##TITLE=QMC5230 Grupo 5b $$ Begin of the data block
##JCAMP-DX=5.00 $$ ACD/SpecManager v 10.08
##SPECTROMETER/DATA SYSTEM=Alpha
##DATE=15 Sep 2014 09:51:18
##DATA TYPE=INFRARED SPECTRUM
##DATA CLASS=XYDATA
##ORIGIN=
##OWNER=
##NPOINTS=1765
##FIRSTX=399.76428223
##LASTX=3997.64306641
##MAXX=3997.64306641
##MINX=399.76428223
##MAXY=0.86912483
##MINY=0.44892687
##XFACTOR=1.0000000000
##YFACTOR=1.000000000000000e-9
##FIRSTY=0.86347818
##DELTAX=2.03961372
##XUNITS=1/CM
##YUNITS=ARBITRARY UNITS
##XYDATA=(X++(Y..Y))
399.8H63478184m63724L145516P06613l793955k719522J753986K673686R4652r06766
418.1H63968670J946211K652824j552343m245460q69453L023743R23515l204763k029777
436.5H60613167K449572K346278k436042l449977J346350L318965j081764m232407
452.8H58874142n31971L871321R67265m319251k704918K582311K340377k956152l882647
471.2H54240477J148701L127694j518667m736423j027763L209889J74880n208671l715992
489.5H45694125J635670J116991n284965q657753q434475j5907287k9992521l0992031
505.8G49177754k4400354j4024972K0602226N0620138M1911781K1026314Q342087j159430
522.1H52095544o147504n804955r632767k5719523l6904812j2932956K7577579L6037266
$$ plain form
399.8 863478184 863014460 866159976 866866589 863072634 860353112 862107098 864780784 864875436 863968670
418.1 863968670 865914881 868567705 867015362 862769902 861900449 864924192 865847707 862642944 860613167
436.5 860613167 863062739 865409017 862972975 859522998 860869348 864188313 863106549 858874142
452.8 858874142 858342171 862213492 863180757 858861506 856156588 858738899 861079276 858123124 854240477
471.2 854240477 855389178 858516872 856998205 852261782 851234019 854443908 854618788 849410117 845694125
489.5 845694125 847329795 848446786 843161821 834504068 826069593 810162306 780169785 749177754
505.8 749177754 724777400 710752428 731354654 781974792 823886573 844912887 853254974 852095544
522.1 852095544 845948040 840143085 830510318 804790795 767885983 754953027 782530606 818567872
538.5H18567872J7116547M449010M387378N345464J436710j749634R04202M580915
554.8H55038464K668321j860142j966416J810133K585292j107454l163815l06904K481460
573.1H56178939L63291l049851j955628J637876J381934k382696l433108k15173J536309
591.5H50061893j662790n178511m501284l841936j0984957k2517860j8744588P731139
607.8G90361106K7774692K0693243M603981j698911J803220M800498J682818n13375
624.1H49507272J680911K261162j042188l165543q62062J805127J76489l170609k812207
642.5H44378352O08385J358688j718223l386558j031994N06401k773464p583439q767546
660.8H21590602n116224J30117L152371L375291L350675K948404n38051m595578m827559
$$ plain form
538.5 818567872 835684419 840133429 844520807 849866271 851302981 849553347 850457549 855038464
554.8 855038464 857706785 855846643 853880227 855690360 858275652 857168198 854004383 853697479 856178939
573.1 856178939 856542230 853492379 851536751 853174627 854556561 852173865 848740757 848525584 850061893
591.5 850061893 848399103 843220592 838719308 834877372 823892415 801374555 782629967 790361106
607.8 790361106 818135798 838829041 843433022 841734111 843537331 848337829 850020647 849507272
624.1 849507272 851188183 853449345 852407157 849241614 848379552 850184679 850361168 847190559 844378352
642.5 844378352 844986737 846345425 844627202 841240644 840208650 840715051 837941587 830358148 821590602
660.8 821590602 816474378 816604495 819756866 823132157 826482832 829431236 828893185 824297607 819470048
679.2H19470048m036486p841587j6431690k8284490m4295132n3398490l5709202k89381
695.5F29183590L3246160N7322562N4691374K8812110Q815945K507388k23100m180789
711.8H10175240o483555n088329l517330n225241p872820p618666n961537o698847
728.1G61708915r871125j1879802j1732340j2513637j6140759k0538330k3455501k6416361
744.5F29161060l2093644l9229751m0416777k8611511r322375L103703R552628K5964916
760.8E18108249M8873961N5906295M5276046L5721064L1957090K5785088J6982556
775.1G78610349J0553658Q072316P892549O985188M632056L124594L739119M534244
791.4H28144073L535510J981020K081453L392280L473401J913428R84788J862109K636730
$$ plain form
679.2 819470048 815433562 807591975 791160285 762875795 718580663 665182173 629472971 629183590
695.5 629183590 662429750 719752312 774443686 803255796 812071741 814579129 814356029 810175240
711.8 810175240 803691685 798603356 795086026 789860785 781987965 774369299 768407762 761708915
728.1 761708915 751837790 739957988 728225648 715712011 699571252 679032922 655577421 629161060
744.5 629161060 597067416 557837665 517420888 488809377 479487002 482590705 492143333 518108249
760.8 518108249 566982210 622888505 668164551 703885615 735842705 761627793 778610349
775.1 778610349 789164007 797236323 805128872 812114060 816746116 819870710 823609829 828144073
791.4 828144073 831679583 833660603 835742056 839134336 842607737 844521165 845505953 847368062 850004792
809.7H50004792J516879j81973k27034J062155J445949L44991l15726O41227J351357
828.1H55642617k50638l093123n108774n994737m446328N33641M435122K667307l326118
846.4H41058969n387067K128541J0015190R542346N015492J433373J14679Q30531J422405
864.8H66174459M26054q68558n74708O45816N79774p52806j141489K9087P05600m35889
885.2H64787340j827955j779258j256049j950264l370702m310847n931139j1168539
901.5H33192587j9925654k2036850m961670J9025385K4517060J4010548N707503L691375
917.8H53220284L023267J364648j2934J85668Q78275L95059o91175q18789j37389j83999
938.2H57222915j242042j978218j737118j804114l632307o218016o449282m738331
$$ plain form
809.7 850004792 851521671 851339698 851112664 852174819 853620768 853965759 853650033 854291260 855642617
828.1 855642617 855391979 852298856 847190082 841195345 836749017 837282658 841717780 844385087 841058969
846.4 841058969 835671902 837800443 847815633 857357979 862373471 863806844 863921523 864752054 866174459
864.8 866174459 866600513 865731955 865157247 865803063 866382837 865630031 864488542 864517629 865223229 864787340
885.2 864787340 862959385 861180127 859924078 857973814 854603112 850292265 844361126 833192587
901.5 833192587 813266933 791230083 786268413 805293798 829810858 843821406 849528909 853220284
917.8 853220284 856243551 857608199 857595265 857780933 858659208 859054267 858363092 857544303 857406914 857222915
938.2 857222915 855980873 854002655 852265537 850461423 846829116 840611100 834161818 829423487
954.5H29423487p547498j5816509j5604198J587212J8185675J8686295J0864555M431010
970.9H44210029J651227J045823j86860k116323l073573k074182n52058o10829j559376
989.2H36733878k887786o322145j2158990j1407733K208769J0637403K140641q748233
1005.5H10195804j3707936j5472114j2843550k694368J0506451J5996874J2015640
1019.8H03996801P231474N401969K612651k466500p212639r356737q678079p806837
1036.1G83722103q569420o567180K544582J3434112J7646790J4776647R893954O002128
1052.4H32883716L479480K010644J248956P69376K38240k04384l74437n75482j251817
1070.8H38224292k431035m015744n957305o720901k524853N263031Q584261N779445
$$ plain form
954.5 829423487 821875989 806059480 790455282 792042494 810228169 828914464 839779019 844210029
970.9 844210029 845861256 846907079 846720219 844603896 841530323 839456141 838904083 838293254 836733878
989.2 836733878 833846092 827523947 815364957 803957224 806165993 816803396 818944037 810195804
1005.5 810195804 796487868 781015754 768172204 765477836 775984287 791981161 803996801
1019.8 803996801 811228275 816630244 819242895 816776395 809563756 800207019 791528940 783722103
1036.1 783722103 775152683 768585503 771130085 784564197 802210987 816987634 826881588 832883716
1052.4 832883716 836363196 838373840 839622796 840392172 840630412 840426028 840051591 839476109 838224292
1070.8 838224292 835793257 831777513 825820208 819099307 816574454 821837485 830421746 836201191
1087.1H36201191K355635O80864L4511j05858j35600k73824m65572n77092n74827o46711
1107.5H36492717r56237j105070n29885L25620M85599N1379k50995k83420l33667m87566
1127.9H33408475n14269k94864o1810j01328l39985m70579l09288j37806l28302p18832
1148.3H30131412q93355r64284j669109m340112o774306k565801M298627M206300L69549
1166.7H21798921j378298j967848l406226o743610j0538995o965280P022977J5746653
1183H13568294R938896J807689q54909j309633j816809j897991j181662n73814q67665
1201.3H16812396j520872j573861j068532r02176j485407j894534j193941j66356k65241
1219.7H06741476j488924k706706l048659j853466J04904P11739j28686j160503k266049
$$ plain form
1087.1 836201191 838556826 839237690 839272201 839166343 839030743 838756919 838291347 837714255 837139428 836492717
1107.5 836492717 835536480 834431410 833901525 834227145 834712744 834764123 834513128 834229708 833896041 833408475
1127.9 833408475 832894206 832599342 832537532 832436204 832096219 831625640 831316352 831178546 830850244 830131412
1148.3 830131412 829238057 828273773 826604664 822264552 815490246 812924445 817223072 821429372 821798921
1166.7 821798921 820420623 818452775 815046549 808302939 797763944 790798664 797821641 813568294
1183 813568294 823507190 825314879 824459970 823150337 821333528 819435537 818253875 817680061 816812396
1201.3 816812396 815291524 813717663 812649131 811746955 810261548 808367014 807173073 807006717 806741476
1219.7 806741476 805252552 802545846 799497187 797643721 797748625 798460364 798331678 797171175 794905126
1238.1G94905126l336012l916085m393697n573094p381499q939623j0063470j1770546
1254.4G39531100j5207231k0487130k5039732k1332622j966834K6851177M5509160
1268.6G27857888M2658210K6464402J0801256J494348k429724l515243m128099n255163
1285G93947875o312549o942629p922233r782612j1582732j1889160j0482132q754552
1301.3G20279276p742285o249369m309475o565750j5449941k6193321l3087313l3467471
1317.6E87214351k6255131j3071477L893017K3425758M2944610N8917105O1622561
1331.9G38690794M5800447K3983538Q184672j010120n357445o687879p365823q375824
1348.2G87862360r209036r495020r871662j1213720j3339162j6766011k3341179l0332685
$$ plain form
1238.1 794905126 791569114 787653029 783259332 777686238 770304739 761365116 751301646 739531100
1254.4 739531100 724323869 703836739 678797007 657464385 655497551 682348728 727857888
1268.6 727857888 770516098 796980500 807781756 809276104 806846380 803331137 799203038 793947875
1285 793947875 787635326 780692697 772770464 762987852 751405120 739515960 729033828 720279276
1301.3 720279276 712536991 706287622 701978147 695412397 679962456 653769135 620681822 587214351
1317.6 587214351 560959220 547887743 551780760 575206518 618151128 677068233 738690794
1331.9 738690794 784491241 808474779 816659451 815649331 810291886 803604007 796238184 787862360
1348.2 787862360 778653324 769158304 759286642 748072922 734733760 717967749 694626570 664293885
1364.5F64293885l0204415j6838729Q345901L0593277L7236630K8394282J6734600
1378.8G38555431R186328M385233Q43227k422214m805922m041076m46260L328085L625333
1397.1G48208165J008988j997233m508018o698847p758498q097411r147644j0290563
1413.5G00718939j0750949j2287319j6289353j8044591j8500626j8888474j7784476
1427.7E88173151j7723143j6143799r955287p37667Q968532J4106691J7283499K0280659
1444.1F04252636K2812486K6962161L2202661L5082579L1468868K2743583R523570
1458.3G85048544q22246m053712o647527r372473r628176r769082j2124479j4083505
1474.7G18547344j4757216j6133249j8663883k2310197k5556386k3463487m529238
$$ plain form
1364.5 664293885 634089470 617250741 625596642 656189919 693426549 721820831 738555431
1378.8 738555431 747741759 752126992 752970219 750548005 745742083 741701007 741254747 744582832 748208165
1397.1 748208165 749217153 747219920 742711902 736013055 728254557 720157146 711009502 700718939
1413.5 700718939 689967990 677680671 661391318 643346727 624846101 605957627 588173151
1427.7 588173151 570450008 554306209 544350922 543613255 552581787 566688478 583971977 604252636
1444.1 604252636 627065122 654027283 686229944 721312523 752781391 775524974 785048544
1458.3 785048544 784226298 780172586 773525059 764152586 754524410 744755328 732630849 718547344
1474.7 718547344 703790128 687656879 668992996 646682799 621126413 597662926 593133688
1488.9E93133688K1400511K1165371j55926k5125622k9936910k268493K9594719M7082663
1505.2F54890001M2663514J5570701M58717l376484n199134o389559o868660q289278
1521.6F83459818r302914r320974j0219038j0019123r691417j0538936q596897m745722
1537.9F11024797j936972L74079J177370p30157o105006j4591693k2076309k3743689
1554.2E43392420j5916050K900422K8416634M0130019M7381341M6077967L2604992
1568.5G24987745J8507541Q100152L572404J066625k192974o616652j4538109k3294807
1584.8G09591925k8320730l1817078l8093805m5625031m7626734l5532266j0921270
1599.1D71655011J2078732K5623471L2240450L1052530K1246255J1333346P062435
$$ plain form
1488.9 593133688 614534199 635699570 635543644 610418022 580481112 578212619 607807338 654890001
1505.2 654890001 697553515 713124216 713582933 710206449 705007315 698617756 691749096 683459818
1521.6 683459818 674156904 664835930 654616892 644597769 634906352 624367416 615770519 611024797
1537.9 611024797 609087825 609461904 610639274 609909117 603804111 589212418 567136109 543392420
1554.2 543392420 527476370 530376792 558793426 598923445 646304786 692382753 724987745
1568.5 724987745 743495286 751595438 755167842 756234467 754041493 747424841 732886732 709591925
1584.8 709591925 681271195 649454117 611360312 565735281 518108547 482576281 471655011
1599.1 471655011 483733743 509357214 541597664 572650194 593896449 605229795 612292230
1613.4F12292230K710283m627347k598405Q711994J6695916J3947964P330179K472222
1629.7F56935036r97543l785551q418917j1651755j2218416j3316273j3440907j2769938
1646E80335736r424209m463673o029487j6432762k0976007k2540927k4047702j9650072
1662.3D56770897p844031O038249K1403610L5943151L6081016L2239258K8507173K1435797
1678.6F30575120J7689050J8502235K1139741J7272174J3200999J2737632J1823236
1692.9G42940187J2477220J2617409J0691523R781301P604838O253779N608082M270851
1709.2H12245190L961146M317939M465819L872812K538561K128661K336919K216995
1725.5H38084042J993001K268135K515793K143383Q02636J73330J15812l03268l49403
$$ plain form
1613.4 612292230 615002513 610375166 607776761 616488755 633184671 647132635 654462814 656935036
1629.7 656935036 655937493 652151942 643733025 632081270 619862854 606546581 593105674 580335736
1646 580335736 570911527 566447854 560418367 543985605 523009598 500468671 476420969 456770897
1662.3 456770897 448926866 454965115 476368725 512311876 548392892 580632150 609139323 630575120
1678.6 630575120 648264170 666766405 687906146 705178320 718379319 731116951 742940187
1692.9 742940187 755417407 768034816 778726339 788507640 796112478 802366257 807974339 812245190
1709.2 812245190 816206336 820524275 824990094 828862906 831401467 833530128 835867047 838084042
1725.5 838084042 840077043 842345178 844860971 847004354 847806990 847980320 848096132 847792864 847443461
1743.9H47443461M22061J650333K270758J900673J374483J323104J244128R38952M73797
1762.2H59041750K72990Q25405J401305J290143L39746m10378j38879L36349K57552
1780.6H63215983j01388k18629j78874q8930l68238j179277j352966n01395K53857
1799H59480143L05712j20223k24232K74896R87590J535415J896501J963317J278997
1817.3H67378116K29180j54973K76030O61790N73575J61112l13521m06027m59372o39439
1837.7H67306471m45783P3492K980q17060j290619j143813p25389l00944P9513M43339
1858.1H63182187O48201M23073j50740p69317j539111k254129k004981q63730N36263
1876.5H57207716J568496J632392P99477n1141l0517O27458J009345R84192R75788
$$ plain form
1743.9 847443461 847865522 849515855 851786613 853687286 855061769 856384873 857629001 858567953 859041750
1762.2 859041750 859314740 860140145 861541450 862831593 863171339 862760961 862622082 862958431 863215983
1780.6 863215983 863114595 862895966 862717092 862628162 862259924 861080647 859727681 859226286 859480143
1799 859480143 859785855 859665632 859441400 859716296 860703886 862239301 864135802 866099119 867378116
1817.3 867378116 867607296 867452323 867728353 868390143 868963718 869124830 868811309 868405282 867945910 867306471
1837.7 867306471 866860688 866934180 866937160 866120100 864829481 863685668 862960279 862659335 862738848 863182187
1858.1 863182187 863830388 864253461 864102721 863333404 861794293 859540164 857535183 856671453 857207716
1876.5 857207716 858776212 860408604 861208081 861156940 861126423 861753881 862763226 863747418 864723206
1894.8H64723206Q57770M00841j28925k46286J32382L86953K4736m71413l31461J60098
1915.2H65507901P3552n73158p86245m80235l05176m34458n38468l97444l03388n59270
1935.6H61203611q93235r17614j001954j927853l759562n446733m654705l63648L948629
1954H46186936M734576L130376J447856l0040j168669r47415O90221J924873J599014
1972.3H57567728O10768J32263J88708J31309j38402r9539L75449O72281L12984k86937
1992.7H59466612l56018m351P4625k14637l86119j74403J9372j98066n24879m78387
2013.1H57223749j73449o2704j84417j88530L5703J25826j81019n75424n61118j80363
2033.5H55278254Q7499M4763p033J42813K30193L0398k67327k95579q5652m6015k78353
$$ plain form
1894.8 864723206 865580976 865981817 865852892 865606606 865738988 866125941 866150677 865679264 865347803 865507901
1915.2 865507901 865581453 865008295 864222050 863741815 863436639 863002181 862463713 862066269 861762881 861203611
1935.6 861203611 860310376 859392762 858390808 856462955 852703393 847256660 842601955 842238307 846186936
1954 846186936 850921512 854051888 855499744 855469704 854301035 853353620 854043841 855968714 857567728
1972.3 857567728 858178496 858310759 858499467 858630776 858492374 858392835 858768284 859440565 859753549 859466612
1992.7 859466612 859110594 859106243 859180868 858966231 858580112 858405709 858425081 858227015 857702136 857223749
2013.1 857223749 857050300 856987596 856803179 856614649 856650352 856776178 856595159 856019735 855458617 855278254
2033.5 855278254 855365753 855410516 855403483 855546296 855776489 855806887 855539560 855243981 855158329 855112314 854833961
2056H54833961m31240l24369k36272l95000n77212m09305J6391K84374K37346J03474
2076.4H53102148J18315J84893N5254j85430j99020n186L6955j97053m01556l24309
2096.8H52185011j38044j44721k68936j91390P1764J93059L9578j02103Q404J56284
2117.1H51808906N5372k00033k94030j55091r8109k98381m63426l48747j59561k00511
2137.5H49646389l74436l48747q9049O0320j04964l28839l14116j85371k11835k86757
2157.9H47462595j06395K72095M39644K48790K0206M6730J62721L6597k59221l96311
2178.3H47927451l27051l03089m30465m73976k34842N9724R1135l7134l2246O6459
2198.7H46305966j311k37524l93451l06010j16110j04666k46763k42829k3246J47939
$$ plain form
2056 854833961 854402721 854078352 853842080 853447080 852869868 852460563 852476954 852761328 852998674 853102148
2076.4 853102148 853220463 853405356 853460610 853275180 853076160 853070974 853107929 852910876 852509320 852185011
2096.8 852185011 852046967 851902246 851633310 851441920 851513684 851706743 851746321 851644218 851652622 851808906
2117.1 851808906 851864278 851664245 851370215 851215124 851117015 850818634 850355208 850006461 849846900 849646389
2137.5 849646389 849271953 848923206 848834157 848894477 848789513 848460674 848146558 847961187 847749352 847462595
2157.9 847462595 847356200 847628295 848067939 848316729 848336935 848383665 848546386 848582983 848323762 847927451
2178.3 847927451 847600400 847297311 846866846 846392870 846158028 846217752 846308887 846271753 846239507 846305966
2198.7 846305966 846304655 846067131 845673680 845367670 845251560 845146894 844900131 844657302 844634056 844781995
2219.1H44781995J16050O7234J51694K03907N2631j73032k46823j93298j98006k90513
2239.5H44271839l15249j90437q2374j63555l19958l66807l66509m68671n84841n08547
2259.9H40904891k23994L3736M6492j29819k83181l09647k78115k26378r4891J36972
2280.3H39576066L76641M59194L33310J56402Q9169R8109P4327J3888J8537N8591O318
2302.7H41260552j24454k26438k40743k63036m33206p14600q88288o76692j21891K67327
2323.1H37838531K86102K03669R9599j82271n71727p87497p01547j99616N65768R22620
2343.5H37473631O53267L85463L08156J52052n2214n3764M1604o4730l62396n49317
2363.9H37931752m85837m43399m52996l83377l46541m61102o20245n93544l76880k10583
$$ plain form
2219.1 844781995 844898045 844965279 845116973 845320880 845373511 845200479 844953656 844760358 844562352 844271839
2239.5 844271839 843956590 843766153 843683779 843520224 843200266 842833459 842466950 841998279 841413438 840904891
2259.9 840904891 840680897 840714633 840761125 840631306 840348125 840038478 839760363 839533985 839439094 839576066
2280.3 839576066 839952707 840411901 840745211 840901613 840990782 841088891 841163218 841177106 841195643 841254234 841260552
2302.7 841260552 841136098 840909660 840668917 840405881 839972675 839258075 838369787 837693095 837571204 837838531
2323.1 837838531 838124633 838328302 838427901 838245630 837673903 836886406 836184859 835985243 836551011 837473631
2343.5 837473631 838126898 838512361 838820517 838972569 838920355 838866591 838908195 838843465 838481069 837931752
2363.9 837931752 837445915 837002516 836549520 836166143 835819602 835358500 834738255 834144711 833767831 833557248
2384.3H33557248k14040k08497o6459M4822o0081k93493l99530l17216k05100j24156
2404.7H31713498O3419L57807N00202L30031M4763q7202r6261j72019l11136l08514
2425.1H32034588j50800j06752k77340l85940k25187k8968m7266j54436j46269n6804
2445.5H30454826o7353k51233m38631m72009m44770m01139j86503J91629M40120L37422
2465.9H29162359M4108j08064p6234j13010l12448m36008l22997j64152k00092l68417
2486.3H27105045l92556k45750k25246l96609m41432j91033J18494J44720n7161p8082
2506.7H25340390J11342J42455r7573l41237l88860m13120n91517p24554m90844J9908
2527.1H22566390L52144L32654K24352J99198J20283j57297n19216o87301o06120m58240
$$ plain form
2384.3 833557248 833343208 833134711 833068252 833113074 833052993 832759500 832359970 832042754 831837654 831713498
2404.7 831713498 831776917 832134724 832634926 832964957 833009720 832922518 832826257 832654238 832343102 832034588
2425.1 832034588 831883788 831777036 831499696 831113756 830888569 830859601 830812335 830657899 830511630 830454826
2445.5 830454826 830387473 830136240 829697609 829225600 828780830 828379691 828193188 828384817 828824937 829162359
2465.9 829162359 829206467 829098403 829022169 828909159 828596711 828160703 827837706 827673554 827473462 827105045
2486.3 827105045 826712489 826466739 826241493 825844884 825403452 825212419 825330913 825475633 825418472 825340390
2506.7 825340390 825451732 825594187 825496614 825155377 824766517 824353397 823761880 823037326 822546482 822566390
2527.1 822566390 822918534 823251188 823475540 823674738 823795021 823637724 823118508 822431207 821825087 821366847
2547.5H21366847l15011r7930J55747K74419J89603M4524L2604J21236P9870j15037
2567.9H21736872j64449O1750K79367K18690j1683j13189n5194r7871l11434m35173
2588.3H21107686l24011j64926j59681k30730j81794p2002j32323l77655n74410n85198
2608.7H18304956n96881q29399j152396j205742q55327k84314K67863O95050R97663
2627H15341473J078605Q69453N68390M18961L81470K15173j04905l19004k50637j15097
2647.4H18083882k29120m53770m33803k47240k67565n45323p35044o00577l37958k57969
2667.8H13975513l52323l32773j20342j9610j70230k82228j74344r9778l18587o50525
2688.2H11454773p24137n98788o45518q67486q55744m01855J84715N01037N70058O58632
$$ plain form
2547.5 821366847 821051836 820953906 821109653 821384072 821573675 821618199 821650803 821772039 821851909 821736872
2567.9 821736872 821572423 821634173 821913540 822132230 822120547 822007358 821952164 821854293 821542859 821107686
2588.3 821107686 820783675 820618749 820459068 820228338 820046544 819974542 819842219 819464564 818890154 818304956
2608.7 818304956 817708075 816878676 815726280 814520538 813665211 813380897 813648760 814343810 815341473
2627 815341473 816420078 817289531 817857921 818276882 818658352 818873525 818768620 818449616 818198979 818083882
2647.4 818083882 817854762 817400992 816967189 816719949 816452384 815907061 815172017 814571440 814233482 813975513
2667.8 813975513 813623190 813290417 813170075 813150465 812980235 812698007 812523663 812423885 812105298 811454773
2688.2 811454773 810730636 810131848 809486330 808618844 807763100 807361245 807545960 808046997 808617055 809275687
2708.6H09275687P38501N52297J39713r0301M4942K23339J53124l7730r7036l9876
2729H10862660p6472k85268m41075l83496l32713m89294o81162o48499m94003n19276
2749.4H06511402p39157q41022o48975m27365m23134n13374m81844l31045k81334m36961
2769.8H01387191n50628m48763m08054o28292r19104j090288j179695j381159j763821
2788.2G93017387k154767k336025k295673k185941j967013j373708l26216P88450J556694
2806.5G82723188K052963K434492K554119K287328J801908J402855J162529Q51393
2822.8G97270775L28779k04503m58956n18501p19249j050175j215219j246393j395225
2841.2G90791333j639128j749516j576483j289069j244784j371384j146972l38018
$$ plain form
2708.6 809275687 810014188 810566485 810706198 810615897 810660839 810884178 811037302 810999572 810902536 810862660
2729 810862660 810786188 810500920 810059845 809676349 809343636 808854342 808173180 807524681 807030678 806511402
2749.4 806511402 805772245 804931223 804282248 803854883 803431749 802918375 802436531 802105486 801824152 801387191
2769.8 801387191 800836563 800387800 799979746 799351454 798432350 797342062 796162367 794781208 793017387
2788.2 793017387 790862620 788526595 786230922 784044981 782077968 780704260 780378044 781166494 782723188
2806.5 782723188 784776151 787210643 789764762 792052090 793853998 795256853 796419382 797270775
2822.8 797270775 797599554 797395051 796936095 796417594 795698345 794648170 793432951 792186558 790791333
2841.2 790791333 789152205 787402689 785826206 784537137 783292353 781920969 780773997 780435979
2857.5G80435979O00279J150369J370669J491785J419425J005292M66227J99437K69056
2875.9G88408518L36468K33471K13385L96729M95612J97649l52204o79671o77407p46072
2896.3G87826478j101672j397669j315058j068473r84192r90152q38816o38664p83205
2914.6G78708577j282811j673996j659573j399636j175225p97689R4295J198471J815438
2933G73827851J660049J145422Q30055O87062L47972j93000n79416o65784p44880j115560
2953.4G75199771j530171j600503j524747j695156k016067k100468j874924j535714
2969.7G61322021j107692m64976L21090Q77381R08017N46217K42114K15947J78218
2988G63038337j10507n08129q39293j094997j372457j596987j556754j394928j502156
$$ plain form
2857.5 780435979 781036258 782186627 783557296 785049081 786468506 787473798 787940025 788139462 788408518
2875.9 788408518 788744986 788978457 789191842 789588571 790084183 790281832 789929628 789249957 788572550 787826478
2896.3 787826478 786724806 785327137 784012079 782943606 781959414 780969262 780130446 779491782 778708577
2914.6 778708577 777425766 775751770 774092197 772692561 771517336 770719647 770813942 772012413 773827851
2933 773827851 775487900 776633322 777463377 778150439 778498411 778305411 777725995 777060211 776315331 775199771
2953.4 775199771 773669600 772069097 770544350 768849194 766833127 764732659 762857735 761322021
2969.7 761322021 760214329 759749353 760070443 760947824 761855841 762402058 762644172 762860119 763038337
2988 763038337 762927830 762419701 761580408 760485411 759112954 757515967 755959213 754564285 753062129
3006.4G53062129k035677k871097l837227m751683n214512m584968k544105L76284
3022.7G27599144L017843M376173M199266K800405O75202j623571l470779m165351
3039G33408332l487110k081931j022935j004934j956046l555119n471527o705106n627155
3057.4G02496469j996696J833320L622174L496945K381384P91371o68704j462281j444698
3075.7G09049284p90953M1425O96957J209974J680136K037823K164960K058327J827360
3094.1G19975293J569330J377702J355291J419067J242161M83572q55744k231121k792179
3112.4G21543372k204955j298368j156509j968741l369630n033373o623030p645786
3128.8F92242980p603228o157100l293515L22819L560841N603493O341338O023705
$$ plain form
3006.4 753062129 751026452 748155355 744318128 739566445 734351933 729766965 727222860 727599144
3022.7 727599144 730616987 734993160 739192426 741992831 742668033 741044462 737573683 733408332
3039 733408332 729921222 727839291 726816356 725811422 723855376 720300257 714828730 708123624 702496469
3057.4 702496469 700499773 702333093 705955267 709452212 711833596 712624967 711956263 710493982 709049284
3075.7 709049284 708258331 708299756 708996713 710206687 711886823 713924646 716089606 718147933 719975293
3094.1 719975293 721544623 722922325 724277616 725696683 726938844 727422416 726566672 724335551 721543372
3112.4 721543372 719338417 718040049 716883540 714914799 711545169 706511796 699888766 692242980
3128.8 692242980 684639752 678482652 675189137 675511956 679072797 684676290 691017628 697041333
3145.1F97041333N069136M028499L086150J996160Q57413J05023k67446n46217q76188
3163.4G10493863j302481j775205k201200k643227l191054l735841m182994m631519
3179.8F86830342n201817n792320o148636o065309n405962m024566j829803Q44717
3196.1F53206646L241420M708290N052388M412532L076196J521110K89917l24786l32653
3214.4F74851060l517J24574l69966j358688k399087l210485l758490m131556m523694
3232.8F55220151n103231n691409o112516o523668o952226p207990p216990p025063
3249.1F03387058o608129n933642m983306l613412j704097M95255K461552L617406
3265.4E87118685L456772J963257k70605k435386m131257n446732o382823o826401
$$ plain form
3145.1 697041333 702110469 706138968 709225118 711221278 712078691 712183714 711916268 711370051 710493863
3163.4 710493863 709191382 707416177 705214977 702571750 699380696 695644855 691461861 686830342
3179.8 686830342 681628525 675836205 669687569 663622260 658216298 654191732 652361929 653206646
3196.1 653206646 656448066 661156356 666208744 670621276 673697472 675218582 675508499 675183713 674851060
3214.4 674851060 674847543 674972117 674602151 673243463 670844376 667633891 663875401 659743845 655220151
3232.8 655220151 650116920 644425511 638312995 631789327 624837101 617629111 610412121 603387058
3249.1 603387058 596778929 590845287 585861981 582248569 580544472 581039727 583501279 587118685
3265.4 587118685 590575457 592538714 592268109 589832723 585701466 580254734 573871911 567045510
3281.7E67045510o858409o636917o133676n154013l698588k027035k99155J486778
3298E37724495L319561N045414O469965P501781Q132160Q412778Q451105Q328557Q054018
3316.4F01439834P640183P085681O446659N936146N753755N812943N838871N644501
3332.7F51598573N265593M844547M404306L947556L519416L145635K847135K581656
3349F82154417K272189J962900J724481J516998J316488J067996Q29637P53582O40452
3367.4F94239140K63989j39654k41399j75834k47955m15623n16713n12898m54426l31103
3387.8F91467524j35780j58310m55200n57721k99335j35481m28081p64489o58273l90053
3408.2F87484801k86281k98977l99113m68552l37899k17974k71201k48194m6432R9778
$$ plain form
3281.7 567045510 560187101 553550184 547416508 542262495 538563907 536536872 536237717 537724495
3298 537724495 541044056 546089470 552559435 560061216 568193376 576606154 585057259 593385816 601439834
3316.4 601439834 609080017 616165698 622612357 628548503 634302258 640115201 645954072 651598573
3332.7 651598573 656864166 661708713 666113019 670060575 673579991 676725626 679572761 682154417
3349 682154417 684426606 686389506 688113987 689630985 690947473 692015469 692845106 693598688 694239140
3367.4 694239140 694503129 694363475 694122076 693946242 693698287 693282664 692765951 692253053 691798627 691467524
3387.8 691467524 691331744 691173434 690718234 690160513 689861178 689725697 689297616 688533127 687874854 687484801
3408.2 687484801 687198520 686899543 686500430 686031878 685693979 685476005 685204804 684956610 684910178 685009956
3428.6F85009956M9115P0929K25544J26541j62542j91569N2988K97725L81530L07858
3449F86168075K90274M01139N04673O06000O80924O11186O16193Q74102R95755O68109
3469.4F92416430K71081K88487N79119Q50141Q88765O41703N44667O89507O79672N96881
3489.8F98446453O84321Q22007Q84593Q49187Q59022R23634P27057M91798O06656Q46446
3510.2G06141174J001477R60827P95722Q26776J063645J233458J095474Q35478P78616
3528.5G14732647Q29697R34660J129448J143039J016140J172065J451493J364171Q96454
3546.9G24669814O54459Q18014R43959R99153J112044J201331J222730J203656J218081
3565.2G34043241J157999R22679Q12591R73820J233101J401603J482249J588225J739979
$$ plain form
3428.6 685009956 685059071 685130000 685355544 685482085 685319543 685127974 685180962 685478687 685860217 686168075
3449 686168075 686458349 686859488 687364161 687970161 688651085 689262271 689878464 690752566 691748321 692416430
3469.4 692416430 692687511 692975998 693555117 694405258 695294023 695935726 696480393 697169900 697849572 698446453
3489.8 698446453 699130774 699952781 700837374 701686561 702545583 703469217 704196274 704688072 705294728 706141174
3510.2 706141174 707142651 708103478 708899200 709725976 710789621 712023079 713118553 713954031 714732647
3528.5 714732647 715562344 716497004 717626452 718769491 719785631 720957696 722409189 723773360 724669814
3546.9 724669814 725324273 726142287 727086246 728085399 729197443 730398774 731621504 732825160 734043241
3565.2 734043241 735201240 736123919 736936510 737910330 739143431 740545034 742027283 743615508 745355487
3583.6G45355487J683473J231850R54389J198292J423299J401902J389861J371026
3599.9G56009579J249015J225352J311004J356066J306712J241684J240671J227260
3616.2G66167343J152813R50158P43806Q43108J070499R63629M87864K84254L73125
3634.6G73036599M37319M52400N21958P37369J030922J139581P47084o8307m30107
3652.9G77604818j69515J81436K86222K27511K34425L96847N28753M16935K16961K01463
3673.3G80125856n6624n44846m65572o2108L29793P13050R44793N39363j48058j93656
3693.7G81181991N8651K31683L05355J49429l9876J49668M79638L42667l40342o46174
3714.1G81872690k93315L7849Q2374o080j09911j66714p2777J65045M17471L96311
$$ plain form
3583.6 745355487 747038960 748270810 749225199 750423491 751846790 753248692 754638553 756009579
3599.9 756009579 757258594 758483946 759794950 761151016 762457728 763699412 764940083 766167343
3616.2 766167343 767320156 768270314 769014120 769857228 770927727 771891356 772379220 772663474 773036599
3634.6 773036599 773473918 773926318 774448276 775185645 776216567 777356148 778103232 778034925 777604818
3652.9 777604818 777435303 777616739 777902961 778130472 778364897 778761744 779290497 779707432 779924393 780125856
3673.3 780125856 780069232 779524386 779058814 778996706 779326499 780039549 780984342 781523705 781375647 781181991
3693.7 781181991 781240642 781472325 781777680 781927109 781887233 782036901 782516539 782859206 782518864 781872690
3714.1 781872690 781579375 781617224 781699598 781693518 781583607 781416893 781344116 781509161 781926632 782322943
3734.5G82322943L4988j81258p2658M1664K7537Q3089J07646k01046m96745l08395
3754.9G81357765q8632j37389j91390o1512K6941l9756j83821l46541l31819n8949
3775.3G79944897J89662Q8989k06887l12805k83540j90317m0353J6213J6153Q3863
3795.7G79305875J44899P1407j55271l09705k83957k98023k56419j6809J95146J72794
3816.1G78569937P9512o5982l85523m22895k19166j25170l9220J25826K75194J78159
3836.5G77970672k01881m17829l86774l44277j98424J45913L92138R656o72698n71131
3856.9G75725365k07723K3723J09852K5451m1008m6730j49072k91466l06905j69754
3877.3G74671733l2544%k3305j89364l82066l14414k72632l61681k22087J00732K69830
$$ plain form
3734.5 782322943 782357931 782176673 782104015 782145679 782173216 782256305 782363951 782162905 781666160 781357765
3754.9 781357765 781269133 781131744 780940354 780878842 780905783 780866027 780682206 780335665 780003846 779944897
3775.3 779944897 780134559 780223548 780016661 779703856 779420316 779229999 779189646 779205859 779222012 779305875
3795.7 779305875 779450774 779522181 779366910 779057205 778773248 778475225 778218806 778201997 778397143 778569937
3816.1 778569937 778649449 778583467 778197944 777775049 777555883 777430713 777391493 777517319 777792513 777970672
3836.5 777970672 777768791 777350962 776964188 776619911 776421487 776567400 776959538 776969194 776296496 775725365
3856.9 775725365 775517642 775541365 775651217 775676668 775635660 775588930 775439858 775148392 774841487 774671733
3877.3 774671733 774639189 774639189 774615884 774426520 774044454 773730040 773457408 773095727 772873640 772974372 773244202
3899.7G73244202J00017k57790m33147k99692r8169K4318O8367K4438j02580j71721
3920.1G72098243j22249r0957j09374r3877p9513j77801k68221j86085q7917j00613
3940.5G70781636j41382j47164r1851p0631j59681j81138j08421r7037j40607j61529
3960.9G69482195j53958j06633m8876l4392m470M0948o556j21057j49250o0320r597
3983.3G68828034r7692j82271j41382j06513j59741j84238j34170
3997.6G67822027
$$ plain form
3899.7 773244202 773344219 773086429 772653282 772353590 772255421 772279739 772348106 772372544 772269964 772098243
3920.1 772098243 771975994 771885037 771775663 771681786 771602273 771424472 771156251 770970166 770882249 770781636
3940.5 770781636 770640254 770493090 770401239 770330608 770170927 769989789 769881368 769784331 769643724 769482195
3960.9 769482195 769328237 769221604 769172728 769138336 769133866 769174814 769168258 769047201 768897951 768837631 768828034
3983.3 768828034 768730342 768548071 768406689 768300176 768140435 767956197 767822027
3997.6 767822027
##END=$$ End of the data block
