##TITLE=QMC5230 Grupo 5 $$ Begin of the data block
##JCAMP-DX=5.00 $$ ACD/SpecManager v 10.08
##SPECTROMETER/DATA SYSTEM=Alpha
##DATE=15 Sep 2014 09:51:18
##DATA TYPE=INFRARED SPECTRUM
##DATA CLASS=XYDATA
##ORIGIN=
##OWNER=
##NPOINTS=1765
##FIRSTX=399.76428223
##LASTX=3997.64306641
##MAXX=3997.64306641
##MINX=399.76428223
##MAXY=0.85115904
##MINY=0.33917573
##XFACTOR=1.0000000000
##YFACTOR=1.000000000000000e-9
##FIRSTY=0.83690923
##DELTAX=2.03961372
##XUNITS=1/CM
##YUNITS=ARBITRARY UNITS
##XYDATA=(X++(Y..Y))
399.8H36909235J842498j441300k241075Q881N18382j797914j440704J701831K144039
418.1H36203873j74522n62787P05599J015306n12779j619041o56962N64396j3768j351357
438.5H33597958j258016J80483M80175j149177j539111J19388Q36313q45433k402782
456.9H28019798r29475J146674j76489k537906j820743L53574k39491k569378k022564
475.2H19224000M31955L19004k681792l890812j519680m73559l115475m928172l260314
493.6H00105155l126562q820772j7600239k7988851l5677373k9699922k2531807j4025271
509.9F40634358K5854587O3888610N2717626K2926033Q718431K431273n338073j2068450
526.2G99764395j8656969l3837974m3901742j4317810L5396754M8241139K6617646
$$ y = [836909235, 838751733, 837310433, 835069358, 835078239, 835596621, 833798707, 832358003, 834059834, 836203873, 836029351, 835466564, 836172163, 837187469, 836674690, 835055649, 834398687, 834963083, 834949315, 833597958, 832339942, 832520425, 833000600, 831851423, 830312312, 830431700, 831268013, 830422580, 828019798, 827090323, 828236997, 828060508, 825522602, 823701859, 824055433, 823815942, 821246564, 819224000, 819655955, 819974959, 817293167, 813402355, 811882675, 811409116, 808293641, 803365469, 800105155, 796978593, 788157821, 770557582, 742568731, 706891358, 677191436, 654659629, 640634358, 666488945, 730377555, 783095181, 806021214, 814739645, 817170918, 811832845, 799764395, 781107426, 747269452, 703367710, 689049900, 724446654, 772687793, 799305439]
540.5G99305439P758081L132224M687786L476441J45376N02884L639102L212512q23021
558.9H25036824k193451O57201J784622j269042l066957m91679J501381q05556l126204
577.2H18027139j449585R51111m09305l163993k724767n17309j139402m284680n627871
595.6G99661338n052447q024871j8040538k8105140j9567072J2010932L4542739K7126491
611.9G94551432R060502j177132l77476M549503M484713J901210L70442j212120k034723
630.2H10116351j465261r90391j650393k520502k432286j889825j883507k427518k546132
648.6G92310536j957178j880467l332377n596637p820011r673714q310914l248811
664.9G50490427J370072O066800O788551K484978j962006m224539n329252p842600
$$ y = [799305439, 807063520, 810195744, 814883530, 818359971, 818505347, 819008231, 822647333, 825859845, 825036824, 822843373, 823500574, 825285196, 824016154, 820949197, 820457518, 821958899, 821153343, 818027139, 816577554, 817528665, 817119360, 813955367, 811230600, 810713291, 809573889, 805289209, 799661338, 794608891, 786584020, 768543482, 740438342, 720871270, 732882202, 767424941, 794551432, 803611934, 802434802, 802057326, 806606829, 811091542, 812992752, 813363194, 812151074, 810116351, 808651090, 807660699, 806010306, 803489804, 801057518, 799167693, 797284186, 794856668, 792310536, 790353358, 788472891, 785140514, 779543877, 771723866, 762050152, 753739238, 750490427, 751860499, 757927299, 764715850, 767200828, 765238822, 761014283, 755685031, 747842431]
681.2G47842431j2252033j8051207k8461933m6592533n8806479m0824175n54681L8202047
697.5E80501437O5028966O3282251L6828876J3611733J346827n009830o566644n435228
713.9G43588388n662262p929087q805275p058501o361723q562148j0451972j0159493
730.2F78597927j0096550j2506723j5651584j7246783j8679082k2393048k8125226
744.5E53898931l4494341m1558117m5260965l6352188j5572518J832008J1991442K9527843
760.8D24012095N2486509N9931516N1388026M3930530L8759888K9687523K0972908
775.1G21168995J5490293J0555149P122814O984770P421971N472123L115535L474653
791.4G80806303N065858M427970K234697K108574L985584M217565K022564Q18014K052606
$$ y = [747842431, 735590398, 717539191, 689077258, 642484725, 583678246, 542854071, 542299390, 580501437, 645530403, 708812654, 745641530, 759253263, 760600090, 755590260, 749023616, 743588388, 737926126, 729997039, 721191764, 714133263, 707771540, 699209392, 688757420, 678597927, 668501377, 655994654, 640343070, 623096287, 604417205, 582024157, 553898931, 519404590, 477846473, 432585508, 396233320, 380660802, 382492810, 394484252, 424012095, 476498604, 536430120, 587818146, 631748676, 670508564, 700196087, 721168995, 736659288, 747214437, 754337251, 761322021, 768743992, 774216115, 777331650, 780806303, 785872161, 790300131, 792534828, 794643402, 798628986, 802846551, 804869115, 805687129, 807739735]
809.7H07739735K693116P52807j113236r4414J905859J580357j51455r8169J142442
828.1H14357042O1751l838659p756173r271801n890667J937806O627799K867817n322575
846.4G93772340o526888M749120J4815092J3205111O948292K411664N19991R51647
862.8H30846369J482427M43340q51751n56349N25236K93672r78351j106202J39415
881.1H30237806N68807q06451k231538k312184k256095l476500m982651n832016q396328
899.5H00512850j5886783k6035607k6093900m130066K3694039K9449403J7438888Q311093
915.8H07259917N789519M006207J571893O50525J302839J137137m50849j203597k50041
934.1H19813550K42590j200199k642810k208114j496374l077209o554723q989096q102774
$$ y = [807739735, 810432851, 811185658, 810072422, 809978008, 811883867, 813464224, 813312769, 813214600, 814357042, 814418793, 810580134, 802823961, 793552160, 787661493, 789599299, 796227098, 799094915, 793772340, 787245452, 791994572, 806809664, 820014775, 826963067, 829374731, 829894722, 830846369, 832328796, 832772136, 831920385, 831364036, 831889272, 832182944, 831204593, 830098391, 830237806, 830806613, 830000162, 827768624, 825456440, 823200345, 819723845, 814741194, 808909178, 800512850, 784626067, 758590460, 732496560, 728366494, 752060533, 781509936, 798948824, 807259917, 813049436, 817055643, 818627536, 819278061, 820580900, 821718037, 821267188, 820063591, 819813550, 820056140, 818855941, 816213131, 814005017, 812508643, 809431434, 802876711, 793887615, 785784841]
952.5G85784841o378055j0595501j9413471j6845762M132688K2606432K2881568J4558911
968.8G96731651O924152K020776M5717q66174k207995m059434m076004j662433j10924
987.2G92739332j182676m561007r764075j5532017j2596428L946781J2427211J380026
1003.5G66857147j1138975j7012716j9688666j6176164k643406J4010191K0094514
1017.8G34301925J4697075R593665Q082032L591061m290640j0302365j2162745j1122108
1034.1G32387900j0296404j0772049p268727M202962J6947508K1906614J9031286J3520122
1050.4G79659212Q321046M559696K792835K227545J463592L27528k29597l8863k35557
1068.8G98847437j616597l560901n534530p943272r142757l735661P032394J2182474
$$ y = [785784841, 779406786, 768811285, 749397814, 732552052, 736684740, 759291172, 782172740, 796731651, 803655803, 805676579, 805722296, 804856122, 802648127, 798588693, 794512689, 792850256, 792739332, 791556656, 786995649, 777231574, 761699557, 749103129, 753049910, 765477121, 766857147, 755718172, 738705456, 719016790, 702840626, 700197220, 714207411, 734301925, 748999000, 758592665, 766674697, 770265758, 765975118, 755672753, 743510008, 732387900, 722091496, 711319447, 704050720, 708253682, 725201190, 747107804, 766139090, 779659212, 787980258, 792539954, 795332789, 797560334, 799023926, 799351454, 799121857, 799082994, 798847437, 797230840, 793669939, 788135409, 780192137, 771049380, 767313719, 774346113, 786528587]
1085.1G86528587Q581341L470778R17971L09766L22282n066o09220p94529n24760n29289
1105.5G97667861j129448j767159j546979l37303O15538L96549K9266J89662J5617
1123.8G94133604p14601r98854l98159P4029l26216q20816n11169M4763j50383q65817
1144.2G89466381r97603n54085p67469j963019l388346o210506q904039l752232N029321
1162.6G67958403N646288J446307j319051l360093n399644q610010j2817502q674503
1178.9G34870195Q984030K1031022J4216125K751350k015054k371311j893819j977682
1195.2G73594856k134382j601995r74535j291216k205789k300978j425385j202047
1211.5G60458529k002776k036452o84798J15633j211881l645838m701316k606869P29144
$$ y = [786528587, 795109928, 798580706, 799498677, 799808443, 800130725, 800125659, 799516439, 798721910, 798197150, 797667861, 796538413, 794771254, 793224275, 792886972, 793502510, 793899059, 793928325, 794117987, 794133604, 793419003, 792420149, 792021990, 792096019, 791769803, 790948987, 790437818, 790482581, 790332198, 789466381, 788468778, 787914693, 787147224, 785184205, 781795859, 775585353, 766681314, 762929082, 767958403, 773604691, 775050998, 773731947, 770371854, 764972210, 756362200, 743544698, 734870195, 743854225, 764885247, 779101372, 781852722, 779837668, 777466357, 775572538, 773594856, 771460474, 769858479, 768883944, 767592728, 765386939, 763085961, 761660576, 760458529, 758455753, 756419301, 755734503, 755850136, 754638255, 750992417, 746291101, 743684232, 744413376]
1229.9G44413376J372576l96490j760304k620161l882349n149543o084502p315993
1246.2G18576610r306252j1461615j3279498j5458763j9393205k5705696l1282544
1260.5E92689037k6290774j769006L3606529N5914938N2541554L3483148J4747024
1274.8G54922450L060340k558469m547298n250395o238043p593334q921325j0380685
1291.1G12493241j2276352j4171302j4826655j3454974j1195183r595752p687389n290926
1307.4F23994708p580995j7546118k9821455l8016916l9302826l2039076j6768097
1321.7D42919225M483759K8602749N1362515O9833219P3505282N5308580K9195607
1336G55210936R890735j055598o136298q186877r451032j0596871j1403918j1817038
$$ y = [744413376, 745785952, 745389462, 743629158, 741008997, 737126648, 731977105, 725892603, 718576610, 709270358, 697808743, 684529245, 669070482, 649677277, 623971581, 592689037, 566398263, 564629257, 598235786, 654150724, 706692278, 740175426, 754922450, 757982790, 755424321, 750877023, 745626628, 739388585, 731795251, 722873926, 712493241, 700216889, 686045587, 671218932, 657763958, 646568775, 636973023, 629285634, 623994708, 616413713, 598867595, 569046140, 531029224, 491726398, 459687322, 442919225, 447402984, 476005733, 527368248, 597201467, 670706749, 726015329, 755210936, 765101671, 764046073, 757909775, 749722898, 740271866, 729674995, 718271077, 706454039]
1352.3G06454039j2476266j4093101j6631841k1031440k8995454l6676526l5651148
1366.6E40898263j9208192J0413885L5665810M3307185L4137487K1430135J2619257
1380.8F79263830O324649J337171k516151m573345l931105r27031L320217M704475
1397.1F83002710K070129j797020n047321p167161p916808q923888j0694087j1608362
1413.5F31918192j1950791j4424443j9051135j9946873k0124376k1153152k0929456
1427.7E04337966k1560669j9607931j2698710l032058Q335322J5376001J8926174K1375447
1444.1E11451542K3487926K9440164L8862765M4074238L8362085K5813818J1929155
1458.3G23421693K097487l472686q809268j1505902j0749876j2059272j6141832j7193675
$$ y = [706454039, 693977773, 679884672, 663252831, 642221391, 613225937, 576549411, 540898263, 521690071, 532103956, 567769766, 611076951, 645214438, 666644573, 679263830, 685588479, 686925650, 684409499, 679836154, 675905049, 674978018, 678298235, 683002710, 685072839, 683275819, 678228498, 671061337, 663144529, 654220641, 643526554, 631918192, 619967401, 605542958, 586491823, 566544950, 546420574, 525267422, 504337966, 482777297, 463169366, 450470656, 447438598, 455773920, 471149921, 490076095, 511451542, 534939468, 564379632, 603242397, 647316635, 685678720, 711492538, 723421693, 725519180, 722046494, 713237226, 701731324, 690981448, 678922176, 662780344, 645586669]
1474.7F45586669j6222417j7901540k2177398k7536869l1608701k8996646o058782
1488.9D95084316K5522619K5540590l37064k9969037l4333229j140356L5035372N3485394
1505.2E68888605M8972368K0418346K791107l033638o400824q368015q999229j0301590
1521.6F03967130j0249555r953678j1377394j1395812j1666000j2751341j0119557
1535.8E26453793o969571n560160j501381R81808j463592q113564j8084228k6419460
1552.2D59323645k7779103j7513930P953554M1396379N0936550N4326952N0666690
1566.4F19310737L5317123K0785689J0032892L953993R76682j082659o147265j6431570
1582.8F66715622k7223885l2965601l6628425m3676853n2401006n4567635m0418148
$$ y = [645586669, 629364252, 611462712, 589285314, 561748445, 530139744, 501143098, 495084316, 520606935, 546147525, 545810461, 515841424, 481508195, 480367839, 515403211, 568888605, 617860973, 638279319, 641070426, 638036788, 631635964, 623267949, 614268720, 603967130, 593717575, 583763897, 572386503, 560990691, 549324691, 536573350, 526453793, 519484222, 513924062, 512422681, 513404489, 511940897, 503827333, 485743105, 459323645, 431544542, 414030612, 421984166, 463380545, 514317095, 568644047, 619310737, 654627860, 675413549, 685446441, 689400434, 690377116, 689294457, 683147192, 666715622, 639491737, 606526136, 569897711, 526220858, 473819852, 419252217, 378834069]
1597C78834069j2440235J3366193K8907448L6809027L5416216K4269819J3344705Q433581
1613.4E26940823K830326n322039k197206J0222316J8822968J6168892R041250L783941
1629.7E80291271m22835m651368r662688j1084437j1301994j3798297j5547752j6160637
1646D97661263j1870951n395472q168638j9419729k3010046k6305347k9997677k5061965
1662.3C48431438r255707Q598745K6399404M3265223M3932200L9670527L5416543K6438236
1678.6E62896609K0477057J9719600K2689224J9936204J5404701J4585137J3094545
1692.9F88803077J2426436J2255728J1408389J2348115J0621727P953405P249951O521523
1709.2G69588351N470813M209399L344118M128814N416691M810930L511548L048181
$$ y = [378834069, 366393834, 379760027, 408667475, 445476502, 480892718, 505162537, 518507242, 526940823, 529771149, 524449110, 522251904, 532474220, 551297188, 567466080, 576507330, 580291271, 579868436, 575217068, 565554380, 554469943, 543167949, 529369652, 513821900, 497661263, 485790312, 480394840, 472226202, 452806473, 429796427, 403491080, 373493403, 348431438, 339175731, 347774476, 374173880, 417439103, 461371303, 501041830, 536458373, 562896609, 583373666, 603093266, 625782490, 645718694, 661123395, 675708532, 688803077, 701229513, 713485241, 724893630, 737241745, 747863472, 755816877, 763066828, 769588351, 775059164, 779268563, 782612681, 786741495, 792158186, 796969116, 800480664, 803528845]
1725.5H03528845K878249K465844J556456J037836J909852J663030r9004j002073k59817
1743.9H13679218R18567J848937K535343L532350L686309K748370J635849Q50082R29177
1762.2H32364202J565694J389504P61211N13971O04212J036942R73344O08623N61595
1780.6H40379298M58538j38283n53905o82414j424730k060771j440048l61025N18024
1799H34694684R27865N03123M9591N17666J605094K558887L122449L142714K269387
1817.3H49391460P55430m25399m59671M56095R05275L20197N0604J65045k36988p27475
1837.7H50194573q34405q77023j065969q85785q82149j237750j052558l42786L20196
1856.1H43336344O65188Q22246O19173l06428j914203l398657l373563k005816m79817
$$ y = [803528845, 806407094, 808872938, 810429394, 811467230, 813377082, 815040112, 814941108, 813939035, 813679218, 814597785, 816446722, 818982065, 822514415, 826200724, 828949094, 830584943, 831435025, 832364202, 833929896, 835319400, 836080611, 836594582, 837198794, 838235736, 839209080, 839817703, 840379298, 840837836, 840699553, 840145648, 839463234, 838038504, 835977733, 834537685, 834176660, 834694684, 835622549, 836125672, 836175263, 836692929, 838298023, 840856910, 843979359, 847122073, 849391460, 850146890, 849721491, 849261820, 849717915, 850623190, 850943387, 850993991, 851159036, 850922048, 850194573, 849360168, 848483145, 847417176, 846531391, 845649242, 844411492, 843358934, 843016148, 843336344, 844001532, 844823778, 845442951, 845136523, 843222320, 839823663, 836450100, 834444284, 833964467]
1874.4H33964467J144648K484977K697706J670599L38435j15692N24103J618326K034187
1892.8H46361756J663566J221478O76632M1127j56343J26720K49505m8578k85506j68801
1913.2H49681556j72734o02305q78453p56502n21481l20733m00960n12958m92632p12395
1933.6H44310403j141966j332581j420080k072573l528714n842209q117080o917834
1949.9H13937366n48661O098926P755995N482376K415776l17395j962900j290440J332581
1968.3H32903624L016650K423764J224398O43134L48449p6592k40326K41459P76410
1986.6H41260970O24656L5167j48654J44720J51992k19524l57509j25289k384k95400
2007H41068745o01650n03540l04877m17412n47290k23696K36333K45690k03192n98312
$$ y = [833964467, 835109115, 837594092, 840291798, 841962397, 842300832, 842185140, 842709243, 844327569, 846361756, 848025322, 849246800, 849923432, 849964559, 849808216, 849934936, 850184441, 850135863, 849850357, 849681556, 849508822, 848906517, 848028064, 847271562, 846750081, 846429348, 846028388, 845515430, 845022798, 844310403, 843168437, 841835856, 840415776, 838343203, 834814489, 828972280, 820855200, 813937366, 813388705, 819487631, 827243626, 832726002, 835141778, 834824383, 832861483, 831571043, 832903624, 835920274, 838344038, 839568436, 840211570, 840560019, 840483427, 840243101, 840484560, 841260970, 841885626, 841920793, 841772139, 841916859, 842068851, 841849327, 841491818, 841366529, 841364145, 841068745, 840467095, 839963555, 839658678, 839241266, 838693976, 838470280, 838706613, 838952303, 838749111, 838150799]
2027.4H38150799n89549m00603l29614k00033J74582M67956L39985j2934j51575l1411
2047.8H37417603j9968k79129m50789l31581k53558m87089q11220q32081n29825k52664
2068.2H33169699j24216J30653M74095N07713J81794p9811m9829L0577o1870k21371
2088.6H33957434k18511j29700k28762m84169n37932l14235r9421m5061m6670O3240
2109H31916213K23577K17497O1870j2219J2398l4511k15709l91841m15862l81410m33147
2131.4H30546856n24163n15938m04835l09348l00169k80380j63377q1956j96516m22717
2151.8H27347457n33938m57823k71976l8624K41816N12123O00219L98636R2685m2498
2172.2H27848077m1068j60932m56214o51598n96583m92096m90308m38571j63615J60456
$$ y = [838150799, 837561250, 837160647, 836831033, 836631000, 836805582, 837273538, 837613523, 837600589, 837449014, 837417603, 837397635, 837118506, 836667717, 836336136, 836082578, 835595489, 834784269, 833952188, 833422363, 833169699, 833045483, 833176136, 833650231, 834157944, 834339738, 834259927, 834210098, 834240675, 834178805, 833957434, 833738923, 833609223, 833380461, 832896292, 832358360, 832044125, 831944704, 831899643, 831852973, 831916213, 832139790, 832357287, 832419157, 832406938, 832419336, 832384825, 832169116, 831777275, 831361413, 830980003, 830546856, 830022693, 829506755, 829101920, 828792572, 828492403, 828212023, 828048646, 827966690, 827770174, 827347457, 826813519, 826355696, 826083720, 826045096, 826286912, 826799035, 827399254, 827797890, 827890575, 827848077, 827807009, 827646077, 827189863, 826538265, 825941682, 825449586, 824959278, 824520707, 824357092, 824517548]
2192.6H24517548K04742J7285p5996m4047j45972m36247n72204l51727j15514j80900
2213H22816968l13401j18137K62678L80754K32280J62542K24888J29402j89007m08053
2233.4H23180914l28183j97947l02434m80473m08769j99258k43604n13554o28948n76258
2253.8H19301486p03692r82285r18746l64661R8765q285l50595m13000k99871l39628
2274.2H15019488l63111m5359M64558O95110M41014O0142m7148l8922k10225m24445
2294.6H15551102m55141m29630o16312r71794j260281j412868j572490j797736j916528
2312.9H05118322k056837k614855l160477k722263j477182o65367q92043j463950j472711
2331.3G88592637j212001j557529k017617j355768N05209K561033M193604L958344
$$ y = [824517548, 824722290, 824739575, 824663579, 824619532, 824473560, 824037313, 823465109, 823113382, 822997868, 822816968, 822503567, 822385430, 822648108, 823028862, 823261142, 823423684, 823648572, 823777974, 823588967, 823180914, 822852731, 822654784, 822352350, 821871877, 821463108, 821263850, 821020246, 820506692, 819877744, 819301486, 818597794, 817615509, 816696763, 816332102, 816430867, 816422582, 816071987, 815658987, 815359116, 815019488, 814656377, 814611018, 815075576, 815770686, 816211700, 816271842, 816224694, 816185772, 815975547, 815551102, 815095961, 814666331, 814050019, 813078225, 811817944, 810405076, 808832586, 807034850, 805118322, 803061485, 800446630, 797286153, 794563890, 793086708, 792421341, 791529298, 790065348, 788592637, 787380636, 785823107, 783805490, 782449722, 782954931, 785515964, 789709568, 793667912]
2347.6G93667912J035095k729655m997670m895270l503680j624823K3782J198411K196074
2366G80370176L017306L433526L431439L219366L013015K882183K706050K257467J594543
2384.3H05925071R81927N27144K04861j5855j68502k70427l76939n06521m60088j06752
2404.7H05733919L47555O04927O05882M99069L48568P7605k36332l74913k86222j72019
2425.1H07148039k53260m22776m44471l40820k66254k47538j71363j3828K5808j30236
2445.5H04883301k80976l32713m38333p01606q83877o38902l2068M71890N69463M20690
2465.9H03036869K51591L9994k28226l87907l57508l06487m00246n19395m64141l14176
2486.3H00350368l18766m79459n51165m60743l57449k73884j10805O8784J29700P5161
$$ y = [793667912, 794703007, 791973352, 786975682, 782080412, 778576732, 776951909, 776975691, 778174102, 780370176, 783387482, 786821008, 790252447, 793471813, 796484828, 799367011, 802073061, 804330528, 805925071, 806906998, 807434142, 807639003, 807623148, 807454646, 807184219, 806807280, 806300759, 805840671, 805733919, 806081474, 806686401, 807292283, 807791352, 808139920, 808217525, 807981193, 807606280, 807320058, 807148039, 806894779, 806472003, 806027532, 805686712, 805420458, 805172920, 805001557, 804987729, 805013537, 804883301, 804602325, 804269612, 803831279, 803129673, 802245796, 801606894, 801574826, 802046716, 802616179, 803036869, 803288460, 803328454, 803100228, 802712321, 802354813, 802048326, 801648080, 801128685, 800664544, 800350368, 800031602, 799552143, 799000978, 798540235, 798182786, 797908902, 797798097, 797866881, 797996581, 798071742]
2506.7G98071742L7968R7513N9188k42293o24657q52167r30548Tp36058k15113M20153
2529.1G94155180P47562O46651L52740R9182j26898m84288r08732j088679q51214l80397
2549.5G92161107J0192K00451K79784L24011K87294J66238Q0883N2691J609j1325J14083
2572G93667018K96951L44217J76489n4836j74880k02060k61724m23610n37932m30703
2592.4G92398930k33114j55151k01821k65539l04878m11033o56724r14395j075685
2610.7G88180590j274824j602710j798749j441538n01573N40674J225531J487195J495242
2629.1G86309838J349092J059115P48515N41627L41475K6882l02851m10855l04401
2647.4G89358437k83182m25219m77374l95536m45545o87241q56102p63595n55933m72903
$$ y = [798071742, 798109710, 798207223, 798266411, 798024118, 797399461, 796547294, 795616746, 794686198, 793950140, 793735027, 794155180, 794902742, 795549393, 795902133, 796001315, 795874417, 795390129, 794481397, 793392718, 792541504, 792161107, 792171299, 792371750, 792651534, 792975545, 793262839, 793429077, 793509960, 793562651, 793564260, 793552935, 793667018, 793963969, 794308186, 794484675, 794429839, 794254959, 794052899, 793791175, 793367565, 792829633, 792398930, 792165816, 792010665, 791808844, 791543305, 791238427, 790827394, 790170670, 789256275, 788180590, 786905766, 785303056, 783504307, 782062769, 781561196, 782101870, 783327401, 784814596, 786309838, 787658930, 788718045, 789466560, 790008187, 790349662, 790376544, 790073693, 789662838, 789358437, 789075255, 788650036, 788172662, 787777126, 787331581, 786644340, 785788238, 785024643, 784468710, 783995807]
2667.8G83995807m71413l63171k01106j59860k22087k28285j58012k33770n72562q99732
2688.2G80485809r44317r26494j146615j340449j061976m05669J84536N80251R58324
2706.6G76383400J258016J164913O97434K76148J82867K40386J48177P808M8757J07050
2727G80514956o7890l37243l96133k88844l72350p18415r35614q19921o89030q15869
2747.4G75073647j013815j005232q39591p83801q55744p77006n27919m32491n84066
2765.7G68253982o98984o01887m92037n97059q31187r86517j104474j387775j825392
2784.1G59728670k184629k415657k742052l160000l327966l065288k487242j669348
2800.4G38676488n09619R06050K161920K956450L292561L336370L202319K809584K190292
$$ y = [783995807, 783524394, 783161223, 782960117, 782800257, 782578170, 782349885, 782191873, 781958103, 781385541, 780485809, 779541492, 778614998, 777468383, 776127934, 775065958, 774660289, 774844825, 775425076, 776383400, 777641416, 778806329, 779503763, 779779911, 779962778, 780203164, 780351341, 780359149, 780407906, 780514956, 780447066, 780109823, 779713690, 779424846, 779052496, 778334081, 777398467, 776578546, 775889516, 775073647, 774059832, 773054600, 772215009, 771431208, 770575464, 769798458, 769270539, 768838048, 768253982, 767554998, 766953111, 766461074, 765864015, 765032828, 764046311, 762941837, 761554062, 759728670, 757544041, 755128384, 752386332, 749226332, 745898366, 742833078, 740345836, 738676488, 738166869, 739072919, 741234839, 744191289, 747483850, 750820220, 754022539, 756832123, 759022415]
2818.8G59022415J595497J117050O08862L517n66483r65118j185477j341581j548827
2837.1G56739855j828969k086520k179742k157688k098501j941502j754999j615643
2853.4G41076291j307726n34952N90086J547992K022088K066672J770556J277446Q27730
2871.8G49336183N28574L48270K88963M09067O30379P31349O03854K77758k06470o99282
2892.2G52248645j009762j182974j380980j614332j747012j659692j378119j085996
2908.5G41189778r61006j002192j184762j519799j885772k057016j950323j687706
2924.8G28941202j122117M8936J494348K454459K488435J849412J189471P70688L66092
2943.2G38480926j55211o06179q34882j004041j354873j756310j957059k101600k388478
$$ y = [759022415, 760617912, 761734962, 762343824, 762347341, 761780858, 760815740, 759630263, 758288682, 756739855, 754910886, 752824366, 750644624, 748486936, 746388435, 744446933, 742691934, 741076291, 739768565, 739233613, 739823699, 741371691, 743393779, 745460451, 747231007, 748508453, 749336183, 749864757, 750213027, 750501990, 750911057, 751541436, 752272785, 752876639, 753154397, 752947927, 752248645, 751238883, 750055909, 748674929, 747060597, 745313585, 743653893, 742275774, 741189778, 740228772, 739226580, 738041818, 736522019, 734636247, 732579231, 730628908, 728941202, 727819085, 727868021, 729362369, 731816828, 734305263, 736154675, 737344146, 738114834, 738480926, 738325715, 737719536, 736884654, 735880613, 734525740, 732769430, 730812371, 728710771, 726322293]
2961.5G26322293k686381k757728k569378k201020j592338o55294L62337R75013J027226
2979.9G16224730P60794M75824L07798J55747j44124n48720r75729j470565j908541
2998.2G12877214k039492j875878j747787j978933k639950l632605m855335o050646
3014.5F88056588o558537n594194l002942M45843L566861N369008N312144L469885
3030.9F91064656O36816k200604m341066n211889m542709k833903j333296j125097
3047.2F70112908k334297m458606o818414q211314o929398k787411J688778M187465
3063.5F44449711M723072L845692J944363J9610j053214j217664p87377k1875Q57532
3081.9F52759850J629591K106071K295732K419770K493799K266526J775145J460612
$$ y = [726322293, 723635912, 720878184, 718308806, 716107786, 714515448, 713860154, 714222491, 715197504, 716224730, 716985524, 717461348, 717769146, 717924893, 717780769, 717232049, 716256320, 714785755, 712877214, 710837722, 708961844, 707214057, 705235124, 702595174, 698962569, 694107234, 688056588, 681498051, 675903857, 672900915, 673346758, 676913619, 682282627, 687594771, 691064656, 691701472, 689500868, 685159802, 679947913, 675405204, 672571301, 671238005, 670112908, 667778611, 663320005, 656501591, 648290277, 641360879, 638573468, 640262246, 644449711, 649172783, 653018475, 654962838, 654982448, 653929234, 652711570, 651924193, 651902318, 652759850, 654389441, 656495512, 658791244, 661211014, 663704813, 665971339, 667746484, 669207096]
3098.2F69207096J603782J881540J601994M71175j110196k493263l089010k643109
3114.5F65430009j733660j379371k083242l778338n963922p833779q855641q812666
3130.8F24989390p317960m060864K64763M160762O532967P348001P103980O185055
3147.1F45206094M935860L645420K395988J277089M07756k43068o81043r55164j328349
3165.5F54660583j932085k568245l085613l605962m251838m893660n386353n915582
3181.8F23021245o616771p197440p233560o479084m855752k404333O30737L588974
3198.1E92454016N540252O025195N228221L655375J929223N42820k29717k79069J45555
3216.5F15011871L24845k70665j434981k615869l520608m169882m684567n153895n683124
$$ y = [669207096, 670810878, 672692418, 674294412, 674765587, 673655391, 671162128, 668073118, 665430009, 663696349, 662316978, 660233736, 656455398, 650491476, 642657697, 633802056, 624989390, 617671430, 613610566, 613875329, 618036091, 624569058, 631917059, 639021039, 645206094, 650141954, 653787374, 656183362, 657460451, 657868207, 657625139, 656944096, 655988932, 654660583, 652728498, 650160253, 647074640, 643468678, 639216840, 634323180, 628936827, 623021245, 616404474, 609207034, 601973474, 595494390, 590638638, 588234305, 588865042, 592454016, 597994268, 604019463, 609247684, 612903059, 614832282, 615375102, 615145385, 614866316, 615011871, 615336716, 615066051, 613631070, 611015201, 607494593, 603324711, 598640144, 593486249, 587803125]
3234.8E87803125o315946o932914p489384q012056q374751q449137q280516p865011
3251.1E26083410p165194o130993m568041k342104K93493K697289M148245M064917
3267.5E17081022K415061j18553k645314m694402o278336p429690q094996q295506
3283.8D81939286q115500p545024o368637m556895k412468j25319K221585M461675
3300.1D59498703O419123P964492R023457R641111R893865R842574R606898R288073
3316.4E31178296Q854031Q217395P506608P014871O892026O955802O914496O692052
3332.7E90225577O330133N863249N344093M869997M494608M127920L719031L374696
3349F28349304L103912K793849K443909K159596K000034J855313J589060J322031J195908
$$ y = [587803125, 581487179, 574554265, 567064881, 559052825, 550678074, 542228937, 533948421, 526083410, 518918216, 512787223, 508219182, 505877078, 506170571, 508867860, 513016105, 517081022, 519496083, 519377530, 516732216, 512037814, 505759478, 498329788, 490234792, 481939286, 473823786, 466278762, 459910125, 455353230, 452940762, 452815443, 455037028, 459498703, 465917826, 473882318, 482905775, 492546886, 502440751, 512283325, 521890223, 531178296, 540032327, 548249722, 555756330, 562771201, 569663227, 576619029, 583533525, 590225577, 596555710, 602418959, 607763052, 612633049, 617127657, 621255577, 624974608, 628349304, 631453216, 634247065, 636690974, 638850570, 640850604, 642705917, 644294977, 645617008, 646812916]
3367.4F46812916J028240O52849K95639J66536J30772N2452r2625k38240k07543L099
3387.8F48604095J54734J2397k59697k35558L4571Q4281k52664n38230m17054k22087
3408.2F46964788k00629j74939j84179k81513k72631j84775j18792m5418K8848J17719
3428.6F45648479J48952J91212K85030J73211m3035n4955O6757J60932K65897M47213
3449F47289693N60940N34892N35369O53147P54595O56963O19828R17971J143456Q46624
3469.4F54513478L81649L88503P18772R25601Q39710N88119O17445Q38279Q08537P26283
3489.8F61346376Q37624R21845Q91805Q50022Q59678Q26299P04825P21872Q56042R85026
3510.2F69801414J156807J136422R22442R00209J027166J074553R92596Q58903Q70943
$$ y = [646812916, 647841156, 648494005, 648789644, 648956180, 649086952, 649139404, 649046779, 648808539, 648600996, 648604095, 648758829, 648771226, 648511529, 648275971, 648310542, 648394823, 648142159, 647603929, 647186875, 646964788, 646764159, 646589220, 646405041, 646123528, 645850897, 645666122, 645547330, 645501912, 645530760, 645648479, 645797431, 645988643, 646273673, 646446884, 646403849, 646348894, 646415651, 646576583, 646842480, 647289693, 647850633, 648385525, 648920894, 649574041, 650328636, 650985599, 651605427, 652523398, 653666854, 654513478, 654895127, 655283630, 656002402, 656928003, 657767713, 658355832, 658973277, 659811556, 660620093, 661346376, 662184000, 663105845, 663997650, 664847672, 665707350, 666533649, 667238474, 667960346, 668816388, 669801414, 670958221, 672094643, 673017085, 673917294, 674944460, 676019013, 677011609, 677870512, 678741455]
3528.5F78741455J066983J249075J310169J251400J223326J366257J398325J137674
3544.8F88744664R04203R82642J095533J129627J253188J306295J270533J248658J004517
3563.2F98939860M85539N75006J572609J974762J587629J407921J539171J652956J711369
3581.5G11446822J571178R45985N73755J389384J897454J497746J405299J639723J568139
3599.9G23935485J590073J717210J284480Q25465J136124J497447J496852J211285
3616.2G34694421O67513R18925J630008J432061L02732o88076N16355J772880J370073
3634.6G42616892R96351R26793P83026O86109L72052n56767j189530R1017J402616
3652.9G46128559Q75294L88980R53079R33051N11109M67957o8188j127005p06672j25886
$$ y = [678741455, 679808438, 681057513, 682367682, 683619082, 684842408, 686208665, 687606990, 688744664, 689648867, 690631509, 691727042, 692856669, 694109857, 695416152, 696686685, 697935343, 698939860, 699425399, 700000405, 701573014, 703547776, 705135405, 706543326, 708082497, 709735453, 711446822, 713018000, 713963985, 714537740, 715927124, 717824578, 719322324, 720727623, 722367346, 723935485, 725525558, 727242768, 728527248, 729352713, 730488837, 731986284, 733483136, 734694421, 735361934, 736280859, 737910867, 739342928, 739645660, 738957584, 739473939, 741246819, 742616892, 743613243, 744540036, 745323062, 746009171, 746381223, 745824456, 744634926, 744725943, 746128559, 747003853, 747392833, 748345912, 749278963, 749790072, 750258029, 750189841, 749062836, 748356164, 748230278]
3673.3G48230278r96887k09093J207590J187146R48905N09859m99249r06229K70069
3691.7G49742389J123488Q34644L16858j22726l57926J27613N13435j79q75056q29220
3712.1G50473320M31717Q33034J13428n79834q12769p18236l02851K82943Q4818p74324
3732.5G49031246r21428K08616J490295J399874l55601j489818J10924L75271q07941
3750.8G49041438J55568J312614O73592k09212Q8810M45426l2604l58939m07994o1869
3771.2G50646830N20646L88920k58445n88715k27452k0384j11938J05798K47538P6175
3791.6G50778973l17216o71685m64320p14659j036466R6381K47300j42753O07311P43449
3812G49126315l37601j146972o10173p13586n78523P01487O94037J56402j32680k93672
$$ y = [748230278, 747233391, 747024298, 748231888, 749419034, 750367939, 750877798, 750378549, 749472320, 749742389, 750865877, 751700521, 752017379, 751894653, 751536727, 751664340, 752177775, 752177596, 751302540, 750473320, 750905037, 751738071, 751851499, 751271665, 750458896, 749740660, 749437809, 749720752, 749805570, 749031246, 748109818, 748318434, 749808729, 751208603, 750853002, 749363184, 749474108, 749849379, 749041438, 749197006, 750509620, 751183212, 750974000, 751062810, 751508236, 751475632, 751116693, 750708699, 750646830, 751167476, 751556396, 751297951, 750709236, 750481784, 750461400, 750349462, 750455260, 750702798, 750778973, 750461757, 749790072, 749325752, 748611093, 747574627, 747671008, 747918308, 747775555, 748382866, 749126315, 748788714, 747641742, 747031569, 746317983, 745739460, 746440947, 747134984, 747291386, 747158706, 746865034]
3832.4G46865034k05755o70314j041532j72913N39363O28292O12677L46422p44701
3850.8G46156573k660036j707077J249969J462281L37899n11587m00066l3498n45681
3869.1G43348777n19633K10285M54545M10974k86221n17130j33574l79801p8142J8537
3889.5G42528617o34908k07424M12344j86145r13083q28982l05354M63009Q96096N73158
3909.9G41797328K24173K7835m06861n60403j24693R9480j18911j39177l5584k50399
3930.3G40512788l35037l1710Q6725o6579k82943m25696k24173o2287j47879j06156
3950.7G38917053l1650q8156j35004j29223j84238j81258k3007P9036N3048o437l1293
3973.1G38238871p152j5617r7692j19090n2392m8578j09732j48774j47283j42395j85073
$$ y = [746865034, 746659279, 745988965, 744947433, 744774520, 745313883, 745942175, 746554852, 746901274, 746156573, 743496537, 741789460, 743039429, 744501710, 744839609, 744328022, 743927956, 743894458, 743348777, 742829144, 743039429, 743493974, 743904948, 743618727, 743101597, 742968023, 742588222, 742510080, 742528617, 741893709, 741686285, 742098629, 741912484, 740999401, 740170419, 739865065, 740328074, 741224170, 741797328, 742021501, 742049336, 741642475, 741082072, 740957379, 741056859, 740937948, 740798771, 740763187, 740512788, 740177751, 740146041, 740232766, 740166187, 739883244, 739457548, 739233375, 739171088, 739023209, 738917053, 738885403, 738797247, 738662243, 738533020, 738348782, 738167524, 738144517, 738223553, 738276601, 738270164, 738238871, 738231719, 738216102, 738118410, 737999320, 737946928, 737898350, 737788618, 737639844, 737492561, 737350166, 737165093]
3995.6G37165093k16364
3997.6G36948729
$$ y = [737165093, 736948729]
##END=$$ End of the data block
