##TITLE=QMC5230 Grupo 4 $$ Begin of the data block
##JCAMP-DX=5.00 $$ ACD/SpecManager v 10.08
##SPECTROMETER/DATA SYSTEM=Alpha
##DATE=15 Sep 2014 09:51:18
##DATA TYPE=INFRARED SPECTRUM
##DATA CLASS=XYDATA
##ORIGIN=
##OWNER=
##NPOINTS=1765
##FIRSTX=399.76428223
##LASTX=3997.64306641
##MAXX=3997.64306641
##MINX=399.76428223
##MAXY=0.83983302
##MINY=0.31933227
##XFACTOR=1.0000000000
##YFACTOR=1.000000000000000e-9
##FIRSTY=0.83356196
##DELTAX=2.03961372
##XUNITS=1/CM
##YUNITS=ARBITRARY UNITS
##XYDATA=(X++(Y..Y))
$$ plain form
399.8 833561957 833143711 832415700 831680775 831166208 830353022 829028845 828740537 830217898 831562638
418.1 831562638 830820262 829559982 829855919 831053972 830811977 828989267 828044116 828971803 829512000
436.5 829512000 828028798 826174855 826037824 826832533 826213717 824389398 823296249 823848069 824510813
454.8 824510813 823305547 821342528 821029007 821688235 821080923 818947971 817240059 817270696 817793131
473.2 817793131 816831231 814751029 813704073 813795507 812876761 810136974 807243764 805702984 804540217
491.5 804540217 801856339 796978474 789995492 778770506 756682217 723623157 695090890 673703492
507.9 673703492 658601880 678775549 734922409 782691658 803425133 809155703 809069335 805306673
524.2 805306673 797110856 780626237 748631954 708219588 694845259 724682629 764873862 788041174
$$ packed form
399.8H33561957m18246p28011p34925n14567q13186j324177k88308J477361J344740
418.1H31562638p42376j260280K95937J198053k41995j822710r45151R27687N40197
436.5H29512000j483202j853943j37031P94709o18816j824319j093149N51820O62744
454.8H24510813j205266j963019l13521O59228o07312k132952j707912L0637N22435
473.2H17793131r61900k080202j046956R1434r18746k739787k893210j540780j162767
491.5H04540217k683878m877865o982982j1224986k2088289l3059060k8532267k1387398
507.9F73703492j5101612K0173669N6146860M7769249K0733475N730570q6368l762662
524.2H05306673q195817j6484619l1994283m0412366j3374329K9837370M0191233K3167312
$$ plain form
540.5 788041174 797526896 801842988 804533005 806742191 808964133 811165154 812853158 813810170 814509153
558.9 814509153 815094769 815157533 814479470 813756406 813599169 813517570 812821865 811636806 810870886 810744405
579.3 810744405 810369611 809041977 807539821 806710184 806048036 804486990 801717401 798345387 794427514
597.6 794427514 787823498 773944914 751279891 733553469 741600573 770066321 793399632 801406741
613.9 801406741 800497472 800152779 803954184 807798088 809418201 810078263 810094059 809323490 808294356
632.3 808294356 807538092 806893528 805834353 804325521 802815139 801791072 801080942 800221741 799135029
650.6 799135029 797797799 795578480 791661203 785457730 776935875 769348502 767387986 771773279
667 771773279 778556764 782198489 783478081 782877326 780259848 776093364 770223916 761199832 746176302
$$ packed form
540.5G88041174R485722M316092K690017K209186K221942K201021J688004R57012O98983
558.9H14509153N85616O2764o78063p23064j57237q1599o95705j185059p65920j26481
579.3H10744405l74794j327634j502156q29637o62148j561046k769589l372014l917873
597.6G94427514o604016j3878584k2665023j7726422Q047104K8465748K3333311Q007109
613.9H01406741r09269l44693L801405L843904J620113O60062J5796p70569j029134
632.3H08294356p56264o44564j059175j508832j510382j024067p10130q59201j086712
650.6G99135029j337230k219319l917277o203473q521855p587373j960516M385293
667G71773279O783485L641725J279592o00755k617478m166484n869448r024084j5023530
$$ plain form
685.3 746176302 719252646 672434747 611432850 567468941 564083576 598959625 660298169 720832884
701.6 720832884 755567968 767733872 769942164 768225133 764478266 759620368 754482925 749319971
717.9 749319971 743701875 737356663 730584741 723574281 716077507 707421720 697273433 685602903
734.3 685602903 672203958 656451643 637400091 614158392 585506916 549041331 502020895
748.5 502020895 448302656 404071778 385153383 388016462 402499229 435853243 494277954 559283495
764.9 559283495 611769378 654073179 691363037 720033407 738982379 751956701 761589348 769077718
781.2 769077718 775255620 780575931 785176039 789123595 792589903 795794845 798904836 801910818
797.5 801910818 804747105 807396710 809925020 812299788 814363003 815887392 816833198 817436218 817892253
$$ packed form
685.3G46176302k6923656m6817899o1001897m3963909l385365L4876049O1338544O0534715
701.6G20832884L4735084J2165904K208292j717031l746867m857898n137443n162954
717.9G49319971n618096o345212o771922p010460p496774q655787j0148287j1670530
734.3F85602903j3398945j5752315j9051552k3241699k8651476l6465585m7020436
748.5E02020895n3718239m4230878j8918395K863079J4482767L3354014N8424711O5005541
764.9E59283495N2485883M2303801L7289858K8670370J8948972J2974322R632647P488370
781.2G69077718O177902N320311M600108L947556L466308L204942L109991L005982
797.5H01910818K836287K649605K528310K374768K063215J524389R45806O03020M56035
$$ plain form
815.8 817892253 818349004 818881571 819512725 820261121 821032584 821317673 820271850 817234099 811595082
834.2 811595082 803578973 797405779 798593044 804996550 808186471 803598046 797758162 801852465
850.5 801852465 814334869 824754536 829898059 832146883 833197653 833839476 834380507 834756315 834802449
868.9 834802449 834526718 834190607 833995283 833822131 833482325 833044410 832652509 832153618 831118107 829178572
889.3 829178572 826373935 823140323 819712639 815152943 807184398 792980194 771158338 749132335
905.6 749132335 745254815 765640795 791842818 807999372 815342665 819168687 821674049 823447108
921.9 823447108 824586809 825065017 825068235 824903131 824798524 824653387 824143589 823078096 821635783 820032001
942.3 820032001 818110526 815203726 810264647 802944958 795306921 789253175 780493379 763492346
$$ packed form
815.8H17892253M56751N32567O31154P48396P71463K85089j045823l037751n639017
834.2H11595082q016109o173194J187265O403506L189921m588425n839884M094303
850.5H01852465J2482404J0419667N143523K248824J050770O41823N41031L75808M6134
868.9H34802449k75731l36111j95324j73152l39806m37915l91901m98891j035511j939535
889.3H29178572k804637l233612l427684m559696p968545j4204204k1821856k2026003
905.6G49132335l877520K0385980K6202023J6156554P343293L826022K505362J773059
921.9H23447108J139701M78208L218j65104j04607j45137n09798j065493j442313j603782
942.3H20032001j921475k906800m939079p319689p638037o053746q759796j7001033
$$ plain form
958.6 763492346 746916771 748622179 768302619 789126158 801931083 807481050 809504509 810697198
974.9 810697198 810495973 807966292 804195166 801693857 801136613 800405264 798325539 794739068 787529588
993.3 787529588 773980856 761269331 763521135 775021434 777074814 766836822 750821233 732835948
1009.6 732835948 717867136 714185178 725372493 743193030 757145584 766088426 772757828 775530696
1025.9 775530696 772057116 763293087 752315938 742353678 733900964 725257695 719188750 723037541
1042.2 723037541 738491118 758375525 775127172 786507726 793485105 797515810 799840152 801304519
1058.6 801304519 802221119 802538216 802294195 801780283 801078260 799659491 796805263 791988015 784920990
1076.9 784920990 777106106 774238110 780404210 790486872 797420263 800445080 801524401 801720619
$$ packed form
958.6G63492346j6575575J705408J9680440K0823539J2804925N549967K023459J192689
974.9H10697198k01225k529681l771126k501309n57244p31349k079725l586471p209480
993.3G87529588j3548732j2711525K251804J1500299K053380j0237992j6015589j7985285
1009.6G32835948j4968812l681958J1187315J7820537J3952554Q942842O669402K772868
1025.9G75530696l473580q764029j0977149r962260q452714q643269o068945L848791
1042.2G23037541J5453577J9884407J6751647J1380554O977379M030705K324342J464367
1058.6H01304519R16600L17097k44021n13912p02023j418769k854228m817248p067025
1076.9G84920990p814884k867996O166100J0082662O933391L024817J079321J96218
$$ plain form
1093.2 801720619 801550627 801319361 801062346 800619066 799921453 799089432 798206031 797154427 795998573
1111.6 795998573 795365751 795665205 796311140 796614170 796484828 796099186 795639515 795217752 794909894 794679046
1132 794679046 794437170 794217288 794050992 793818772 793462455 793078601 792703032 792125821 791083694 789452136
1152.4 789452136 786957860 781972229 774691403 771912098 776466727 781154871 781946361 780559242
1168.7 780559242 777861357 773325026 765491724 753795445 745888770 753600836 771922231 784411192
1185 784411192 787291527 786175251 784186304 782164216 780475795 779146552 777952492 776719928 775459051
1203.4 775459051 774161398 772769630 771372914 769971371 768558323 767436504 766784549 766182840 764827967
1221.7 764827967 761981666 757846117 754744053 754762828 756345570 756725967 755281270 752576768 749022365
$$ packed form
1093.2H01720619j69992k31266k57015m43280o97613q32021q83401j051604j155854
1111.6G95998573o32822K99454O45935L03030j29342l85642m59671m21763l07858k30848
1132G94679046k41876k19882j66296k32220l56317l83854l75569n77211j042127j631558
1152.4G89452136k494276m985631p280826k779305M554629M688144P91490j387119
1168.7G80559242k697885m536331p833302j1696279p906675P712066J8321395J2488961
1185G84411192K880335j116276j988947k022088j688421j329243j194060j232564j260877
1203.4G75459051j297653j391768j396716j401543j413048j121819o51955o01709j354873
1221.7G64827967k846301m135549l102064J8775J582742L80397j444697k704502l554403
$$ plain form
1240.1 749022365 744710743 739292324 732168376 723034561 712040961 699184477 683723032 663966596
1256.4 663966596 637612343 605024338 576748431 573446870 606549978 661807060 712974250
1270.7 712974250 745589077 760817707 765190184 764004588 760673046 756641686 751622915 745043337
1287 745043337 736934245 727380931 715967119 702443600 687862217 674404085 663317084 654027641
1303.3 654027641 646520019 641030371 633021891 614887714 583862484 543486238 500631511 464454442
1319.6 464454442 444286764 448004842 479327142 534939408 607344687 680395544 733447790
1333.9 733447790 760609746 769930542 769892156 765446067 758680820 750365674 741147220 731477499
1350.2 731477499 721233785 709870100 696714461 681056738 660638571 631135464 592439651
$$ packed form
1240.1G49022365m311622n418419p123948r133815j0993600j2856484j5461445j9756436
1256.4F63966596k6354253l2588005k8275907l301561L3103108N5257082N1167190
1270.7G12974250L2614827J5228630M372477j185596l331542m031360n018771o579578
1287G45043337q109092r553314j1413812j3523519j4581383j3458132j1087001r289443
1303.3F54027641p507622n489648q008480j8134177l1025230m0376246m2854727l6177069
1319.6D64454442k0167678L718078L1322300N5612266P2405279P3050857N3052246
1333.9G33447790K7161956R320796l8386m446089o765247q315146r218454r669721
1350.2G31477499j0243714j1363685j3155639j5657723k0418167k9503107l8695813
$$ plain form
1364.5 592439651 553827405 532005370 541331589 577231586 621096611 655648708 677318394
1378.8 677318394 690048218 696755826 699111700 697853386 693996310 690322042 689813614 693642318
1395.1 693642318 698498487 700685680 699545145 695583642 689287722 681763113 673347712 663513482
1411.4 663513482 652546406 640733778 626374125 607422352 586993814 565582037 542668939
1425.7 542668939 519886851 496065646 473466754 457760692 452602863 459966868 474827349 493227959
1442 493227959 514500201 538845003 569720805 609533846 653822422 692424834 719202161 732088327
1458.3 732088327 734532595 731999516 725149572 715390205 705468833 694270015 679539025 663299024
1474.7 663299024 646954179 628443301 605546713 576811790 542900681 510702908 502441704
$$ packed form
1364.5E92439651l8612246k1822035R326219L5899997M3865025L4552097K1669686
1378.8F77318394J2729824O707608K355874j258314l857076l674268n08428L828704
1395.1F93642318M856169K187193j140535l961503o295920p524609q415401r834230
1411.4F63513482j0967076j1812628j4359653j8951773k0428538k1411777k2913098
1425.7E42668939k2782088k3821205k2598892j5706062n157829P364005J4860481J8400610
1442D93227959K1272242K4344802L0875802L9813041M4288576L8602412K6777327J2886166
1458.3G32088327K444268k533079o849944r759367r921372j1198818j4730990j6240001
1474.7F63299024j6344845j8510878k2896588k8734923l3911109l2197773q261204
$$ plain form
1488.9 502441704 528027058 553977430 552394986 518886685 481408477 481187820 520022690 577005386
1505.2 577005386 627241790 647296786 649656832 646447420 640163660 632028222 623046815 612421572
1521.6 612421572 601605833 591083169 578991711 566719830 554263830 540691614 529619038
1535.8 529619038 521788895 515321910 512549698 512000322 508809149 498841047 478744924 450133145
1552.2 450133145 420255184 402306199 415291190 466543764 523942232 581523180 633218050
1566.4 633218050 667717457 687051833 696035385 699520886 700268745 699095666 693430066 678071797
1582.8 678071797 651820779 619111478 581791222 535954952 479154587 418267757 371836811
1597 371836811 356211871 369845748 401422203 441745758 480220109 506592274 521284163 530542731
$$ packed form
1488.9E02441704K5585354K5950372j582444l3508301l7478208k20657L8834870N6982696
1505.2E77005386N0236404K0054996K360046l209412o283760q135438q981407j0625243
1521.6F12421572j0815739j0522664j2091458j2271881j2456000j3572216j1072576
1535.8E29619038p830143o466985k772212n49376l191173r968102k0096123k8611779
1552.2D50133145k9877961j7948985J2984991N1252574N7398468N7580948N1694870
1566.4F33218050L4499407J9334376Q983552L485501P47859j173079n665600j5358269
1582.8F78071797k6251018l2709301l7320256m5836270n6800365o0886830m6430946
1597C71836811j5624940J3633877L1576455M0323555L8474351K6372165J4691889R258568
$$ plain form
1613.4 530542731 533575535 527641475 524796665 535175860 554693282 571272671 580121934 583325028
1629.7 583325028 582504690 578107178 568906784 557409942 545176864 530581474 514348626 497230411
1646 497230411 484029412 477618396 468874991 447962254 421937138 391802460 357587874 329202145
1662.3 329202145 319332272 330376148 361644506 410542637 458331674 500386655 537551761
1676.6 537551761 565368891 587263107 608532310 632520854 652982175 668543160 683033586
1690.9 683033586 695805371 708071947 720407128 731848001 743771374 753776431 761382580
1705.1 761382580 768179297 773851037 778494477 782330334 785558820 788946927 792930901 796777487
1721.5 796777487 799920440 802540720 804704666 806629479 808236241 809427083 810774982 811906755
$$ packed form
1613.4E30542731L032804n934060k844810J0379195J9517422J6579389Q849263L203094
1629.7E83325028q20338m397512r200394j1496842j2233078j4595390j6232848j7118215
1646D97230411j3200999o411016q743405k0912737k6025116l0134678l4214586k8385729
1662.3C29202145r869873J1043876L1268358M8898131M7789037M2054981L7165106
1676.6E37551761K7817130K1894216K1269203K3988544K0461321J5560985J4490426
1690.9F83033586J2771785J2266576J2335181J1440873J1923373J0005057P606149
1705.1G61382580O796717N671740M643440L835857L228486L388107L983974L846586
1721.5G96777487L142953K620280K163946J924813J606762J190842J347899J131773
$$ plain form
1737.8 811906755 812018692 811600864 811543763 812117755 813545048 815781951 818687439 821405649 823305786
1756.1 823305786 824544430 825378239 826059222 827025056 828073263 828895330 829470456 829697728 830168009
1774.5 830168009 830940008 831542492 831894577 832063496 831903338 831505477 830994070 829833806 828128219
1792.8 828128219 826961577 826618373 826816857 827338934 827680767 827649653 827847004 828962982 831121564
1811.2 831121564 833882272 836479664 838169158 838805437 838797629 838660598 838845789 839362204 839696944
1829.6 839696944 839833021 839799523 839299917 838652134 838246882 837730408 836633563 835589826 834923685
1847.9 834923685 834073663 833127558 832631648 832890153 833614886 834296703 834607244 834337950 833088636
1866.3 833088636 830592036 827785909 826059163 825748801 826702237 828467250 830274522 831416070 831631124
$$ packed form
1737.8H11906755J11937m17828n7101N73992J427293K236903K905488K718210J900137
1756.1H23305786J238644Q33809O80983R65834J048207Q22067N75126K27272M70281
1774.5H30168009P71999O02484L52085J68919j60158l97861n11407j160264j705587
1792.8H28128219j166642l43204J98484N22077L41833l1114J97351J115978K158582
1811.2H31121564K760708K597392J689494O36279p808j37031J85191N16415L34740
1829.6H39696944J36077l3498m99606o47783m05252n16474j096845j043737o66141
1847.9H34923685q50022r46105m95910K58505P24733O81817L10541k69294j249314
1866.3H33088636k496600k806127j726746l10362R53436J765013J807272J141548K15054
$$ plain form
1884.6 831631124 831398964 831585467 832830369 834676504 836146533 836997271 837440133 837628186 837678432
1903 837678432 837704718 837735355 837740481 837695241 837543905 837180495 836584985 836022735 835505009 834817648 834216595
1925.4 834216595 833903313 833707392 833314955 832474887 831396818 830481589 829529464 827795148 824837983
1943.8 824837983 820347548 814207256 808759391 808092058 812750578 818886876 823171496 824882746
1960.1 824882746 824494183 822993279 822032809 822996795 825268507 827197671 828222930 828678787 828826487
1978.5 828826487 828737199 828632236 828831077 829339683 829813063 829932630 829796553 829742789 829789639 829754055
1998.8 829754055 829579473 829327762 829109669 828904986 828597963 828163266 827668846 827188253 826858997 826800883
2019.2 826800883 826870382 826887310 826783538 826483130 825968146 825389743 825005889 824993908 825256705 825528026
$$ packed form
1884.6H31631124k32160J86503J244902J846135J470029Q50738M42862J88053N0246
1903H37678432K6286L0637N126m5240j51336l63410n95510n62250n17726o87361o01053
1925.4H34216595l13282j95921l92437q40068j078069r15229r52125j734316k957165
1943.8H24837983m490435o140292n447865o67333M658520O136298M284620J711250
1960.1H24882746l88563j500904r60470R63986K271712J929164J025259M55857J47700
1978.5H28826487q9288j04963J98841N08606M73380J19567j36077n3764M6850l5584
1998.8H29754055j74582k51711k18093k04683l07023m34697m94420m80593l29256n8114
2019.2H26800883O9499J6928j03772l00408n14984n78403l83854j1981K62797K71321
$$ plain form
2039.6 825528026 825673401 825710058 825679302 825589240 825441062 825242221 825015604 824758470 824427605 823981762
2060 823981762 823396087 822723746 822137654 821824968 821830571 822069883 822400391 822724402 822992265 823141456
2080.4 823141456 823136926 823050559 823001623 822980404 822875619 822640896 822361708 822095752 821816325 821518183
2100.8 821518183 821278214 821203291 821281612 821401954 821490109 821557105 821645319 821746528 821763039 821631968 821398139
2123.3 821398139 821145177 820888102 820545137 820099890 819652319 819296300 819011748 818712115 818408906 818216801
2143.7 818216801 818140388 818031013 817777634 817412615 817034185 816684961 816425443 816399693 816674113 817134380
2164.1 817134380 817599654 817927957 818070829 818083584 818025768 817863643 817527592 817042589 816527128 816085398
2184.5 816085398 815735996 815470755 815335214 815367937 815511346 815637887 815631568 815469086 815223336 814935863
$$ packed form
2039.6H25528026J45375L6657l0756r0062j48178j98841k26617k57134l30865m45843
2060H23981762n85675o72341n86092l12686N603K39312L30508L24011K67863J49191
2080.4H23141456m530q6367m8936k1219j04785k34723k79188k65956k79427k98142
2100.8H21518183k39969p4923P8321J20342Q8155O6996Q8214J01209J6511j31071k33829
2123.3H21398139k52962k57075l42965m45247m47571l56019k84552k99633l03209j92105
2143.7H18216801p6413j09375k53379l65019l78430l49224k59518k5750K74420M60267
2164.1H17134380M65274L28303J42872J2755n7816j62125l36051m85003n15461m41730
2184.5H16085398l49402k65241j35541L2723J43409J26541o319j62482k45750k87473
$$ plain form
2204.8 814935863 814607382 814269125 813980699 813779473 813649118 813596368 813671768 813895583 814205050 814467490
2225.2 814467490 814601839 814621091 814529002 814335942 814091146 813812137 813513875 813228905 812956214 812684238
2245.6 812684238 812407970 812116623 811770439 811283946 810617864 809883356 809294224 809017003 808990836 808971524
2266 808971524 808804750 808513105 808131874 807709694 807437479 807461917 807742894 808177233 808647096 809051752
2286.4 809051752 809371710 809603393 809737444 809794664 809804499 809788227 809720933 809566379 809314013 808989048
2306.8 808989048 808599114 808049262 807240009 806187451 804959893 803814054 803194165 803138733 803307235
2325.2 803307235 803401232 803250849 802828014 802114785 801105320 800073206 799629748 800228000 801493347
2343.5 801493347 802691340 803834558 804836631 805115581 804518521 803590834 802716076 802037716 801638007
$$ packed form
2204.8H14935863l28481l38257k88426k01226j30355n2750P5400K23815L09467K62440
2225.2H14467490J34349J9252r2089j93060k44796k79009k98262k84970k72691k71976
2245.6H12684238k76268k91347l46184m86493o66082p34508n89132k77221k6167j9312
2266H08971524j66774k91645l81231m22180k72215K4438K80977M34339M69863M04656
2286.4H09051752L19958K31683J34051N7220R835j6272o7294j54554k52366l24965
2306.8H08989048l89934n49852q09253j052558j227558j145839o19889n5432J68502
2325.2H03307235R3997j50383m22835p13229j009465j032114m43458N98252J265347
2343.5H01493347J197993J143218J002073K78950n97060r27687q74758o78360l99709
$$ plain form
2361.9 801638007 801399887 801246524 801182687 801206172 801281631 801265299 801069915 800825179 800706685 800718486
2382.3 800718486 800754070 800755262 800757110 800791681 800800025 800688803 800413072 800010383 799600065 799309492 799219131
2404.7 799219131 799411833 799876392 800410271 800807357 801002920 801011622 800876975 800645471 800363064 800087988
2425.1 800087988 799844444 799583256 799237788 798839986 798521638 798367083 798320472 798272729 798183560 798071802
2445.5 798071802 797912717 797629118 797170639 796539664 795850456 795358360 795287967 795608819 796091735 796514273
2465.9 796514273 796735287 796714425 796516657 796251535 795983315 795689583 795315742 794908702 794563770 794267178
2486.3 794267178 793942153 793521523 793016016 792517483 792137682 791956425 791944742 791994870 792053878 792136192
2506.7 792136192 792234123 792296529 792247951 792033076 791600287 790899634 790011704 789170563 788644969 788573444
$$ packed form
2361.9H01638007k38120j53363o3837K3485P5459j6332j95384k44736j18494J1801
2382.3H00718486L5584J192J848L4571Q344j11222k75731m02689m10318k90573r0361
2404.7G99219131J92702M64559N33879L97086J95563Q702j34647k31504k82407k75076
2425.1H00087988k43544k61188l45468l97802l18348j54555m6611m7743q9169j11758
2445.5G98071802j59085k83599m58479o30975o89208m92096p0393L20852M82916M22538
2465.9G96514273K21014k0862j97768k65122k68220k93732l73841m07040l44932k96592
2486.3G94267178l25025m20630n05507m98533l79801j81257j1683N0128N9008Q2314
2506.7G92136192R7931O2406m8578k14875m32789p00653q87930q41141n25594p1525
$$ plain form
2527.1 788573444 788881123 789373159 789852858 790168703 790249050 790058315 789564073 788828909 788007677 787289619
2547.5 787289619 786881089 786879838 787160039 787477732 787703633 787872493 788021922 788130820 788167715 788138211
2567.9 788138211 788132489 788266122 788546026 788814247 788898349 788803160 788668096 788533926 788293719 787914038
2588.3 787914038 787493944 787136495 786891878 786745906 786623538 786451638 786193907 785825729 785291314 784550130
2608.7 784550130 783637464 782566547 781295419 779917061 778781354 778306484 778671324 779660940 780861080
2627 780861080 781999290 783023298 783923626 784602463 784991801 785148323 785159230 785039604 784782588 784442842
2647.4 784442842 784100235 783781648 783444405 783023834 782490790 781897008 781283140 780633509 780010939 779546022
2667.8 779546022 779249609 778999686 778735042 778521538 778425336 778393805 778269112 777948439 777457178 776830137
$$ packed form
2527.1G88573444L07679M92036M79699L15845Q0347j90735m94242p35164q21232p18058
2547.5G87289619m08530j251K80201L17693K25901J68860J49429J08898L6895k9504
2567.9G88138211n722J33633K79904K68221Q4102r5189j35064j34170k40207l79681
2588.3G87914038m20094l57449k44617j45972j22368j71900k57731l68178n34415p41184
2608.7G84550130r12666j070917j271128j378358j135707m74870L64840R89616J200140
2627G80861080J138210J024008R00328O78837L89338J56522J0907j19626k57016l39746
2647.4G84442842l42607l18587l37243m20571n33044n93782o13868o49631o22570m64917
2667.8G79546022k96413k49923k64644k13504r6202l1531j24693l20673m91261o27041
$$ plain form
2688.2 776830137 776063800 775164366 774180889 773202121 772384703 771944821 771999478 772499621 773304045 774223328
2708.6 774223328 775052547 775639057 775951743 776063025 776103377 776193142 776341021 776469469 776492119 776369035
2729 776369035 776166499 775959671 775689900 775253475 774643719 773942471 773255289 772593379 771874130 771080732
2749.4 771080732 770256042 769463420 768747032 768069565 767409980 766821623 766318738 765831232 765310764 764788568
2769.8 764788568 764299035 763795316 763163209 762353599 761392474 760243297 758803487 757022798 754930258
2788.2 754930258 752557755 749933422 747155249 744447649 742156267 740639985 740185022 740896821 742625833
2806.5 742625833 745090485 747948766 750827789 753448725 755688250 757525384 758931756 759856224
2822.8 759856224 760300517 760314763 759930670 759176612 758134127 756914914 755584478 754098594 752378166
$$ packed form
2688.2G76830137p66337q99434r83477r78768q17418m39882N4657N00143Q04424R19283
2708.6G74223328Q29219N86510L12686J11282M0352Q9765J47879J28448K2650j23084
2729G76369035k02536k06828k69771m36425o09756p01248o87182o61910p19249p93398
2749.4G71080732q24690p92622p16388o77467o59585n88357n02885m87506n20468n22196
2769.8G64788568m89533n03719o32107q09610r61125j149177j439810j780689k092540
2788.2G54930258k372503k624333k778173k707600k291382j516282m54963P11799J729012
2806.5G42625833K464652K858281K879023K620936K239525J837134J406372R24468
2822.8G59856224M44293J4246l84093p54058j042485j219213j330436j485884j720428
$$ plain form
2841.2 752378166 750463426 748535275 746763945 745140910 743563235 742058635 740887225 740450859
2857.5 740450859 740950167 742191494 743831754 745571792 747111738 748191118 748789847 749148071 749472857
2875.9 749472857 749781609 750110507 750603557 751248479 751784921 751949549 751661241 751024425 750194609 749204159
2896.3 749204159 747991681 746574938 745087087 743668020 742407501 741358340 740483701 739605665 738495767
2914.6 738495767 737045288 735286057 733348191 731448889 729822755 728815794 728884876 730156839 732220769
2933 732220769 734421849 736190796 737324417 737998009 738367558 738369882 737930596 737129867 736109197 734871566
2953.4 734871566 733355284 731601954 729655921 727504909 725155175 722700715 720337510 718335629
2969.7 718335629 716966689 716408730 716642141 717403412 718322158 719083428 719558537 719811559 719932735
$$ packed form
2841.2G52378166j914740j928151j771330j623035j577675j504600j171410m36366
2857.5G40450859M99308J241327J640260J740038J539946J079380N98729L58224L24786
2875.9G49472857L08752L28898M93050O44922N36442J64628k88308o36816q29816r90450
2896.3G49204159j212478j416743j487851j419067j260519j049161q74639q78036j109898
2914.6G38495767j450479j759231j937866j899302j626134j006961O9082J271963K063930
2933G32220769K201080J768947J133621O73592L69549K324m39286q00729j020670j237631
2953.4G34871566j516282j753330j946033k151012k349734k454460k363205k001881
2969.7G18335629j368940n57959K33411P61271R18746P61270M75109K53022J21176
$$ plain form
2988 719932735 719877124 719455421 718548954 717214346 715571761 713772655 711994708 710286498 708427310
3006.4 708427310 706004083 702632070 698089421 692454457 686368644 681103289 678113639 678283870
3022.7 678283870 681385338 686158001 690845370 693858862 694342613 692245185 688140988 683185995
3039 683185995 678833902 676129699 674911559 673888683 671709478 667569160 661187172 653311014 646391511
3057.4 646391511 643305004 644626141 648528874 652995586 656613052 658490479 658591509 657589614
3073.7 657589614 656306744 655433834 655390024 656230092 657756925 659700036 661905706 664321065 666807592
3092.1 666807592 669040322 670764565 672198057 673808157 675694823 677324772 677906036 676983535 674687326
3110.4 674687326 671734214 669151783 667439520 666037142 663889229 660121799 654315650 646654963
$$ packed form
2988G19932735n5611m21703r06467j334608j642585j799106j777947j708210j859188
3006.4G08427310k423227l372013m542649n634964o085813n265355k989650J70231
3022.7F78283870L101468M772663M687369L013492M83751k097428m104197m954993
3039F83185995m352093k704203j218140j022876k179205m140318o381988p876158o919503
3057.4F46391511l086507J321137L902733M466712L617466J877427J01030j001895
3073.7F57589614j282870q72910m3810Q40068J526833J943111K205670K415359K486527
3092.1F66807592K232730J724243J433492J610100J886666J629949N81264r22501k296209
3110.4F74687326k953112k582431j712263j402378k147913l767430n806149p660687
$$ plain form
3126.7 646654963 637863100 629019260 621567965 617239416 617180347 621082962 627482951 634784997 641831636
3145.1 641831636 647946835 652873576 656558394 658936381 660114825 660483837 660312235 659658670 658602655
3163.4 658602655 657179534 655278325 652782917 649670660 645983338 641770542 636995614 631584466
3179.8 631584466 625483453 618688941 611371517 603977561 597233415 592078567 589445472 589881778
3196.1 589881778 593237042 598567665 604470551 609632611 613223910 615052819 615493894 615197003 614820719
3214.4 614820719 614790916 614917755 614527225 613044143 610333681 606656730 602368951 597636640 592390835
3232.8 592390835 586501181 579986393 572925091 565267384 556944728 548101187 539133072 530396700
3249.1 530396700 522076964 514399290 507793188 502879918 500313163 500445366 503038883 507184565
$$ packed form
3126.7F46654963q791863q843840p451295m328549n9069L902615O399989P302046P046639
3145.1F41831636O115199M926741L684818K377987J178444L69012j71602o53565j056015
3163.4F58602655j423121j901209k495408l112257l687322m212796m774928n411148
3179.8F31584466o101013o794512p317424p393956o744146n154848k633095M36306
3196.1E89881778L355264N330623N902886N162060L591299J828909M41075k96891l76284
3214.4F14820719k9803J26839l90530j483082k710462l676951m287779m732311n245805
3232.8E92390835n889654o514788p061302p657707q322656q843541q968115q736372
3249.1E30396700q319736p677674o606102m913270k566755J32203K593517M145682
$$ plain form
3265.4 507184565 511328816 513770282 513513386 510631144 505697370 499134451 491300464 482701778
3281.7 482701778 473865628 465189219 457115144 450347334 445559591 443152577 443355560 446186274
3298 446186274 451413691 458617836 467287093 476911575 487022161 497198641 507153451 516764104
3314.4 516764104 525947392 534583330 542540312 549781382 556465805 562928915 569398582 575795114
3330.7 575795114 581900239 587551773 592675030 597268105 601369321 605028152 608308017 611219227
3347 611219227 613745213 615902543 617739022 619317651 620664418 621772707 622620225 623225033 623673201
3365.4 623673201 623977780 624000251 623668194 623133063 622545838 621886015 621128976 620302796 619433761 618592143
3385.7 618592143 617891967 617368042 616784394 615952969 615110755 614562690 614171267 613472521 612454295
$$ packed form
3265.4E07184565M144251K441466k56896k882242m933774o562919p833987q598686
3281.7D82701778q836150q676409q074075o767810m787743k407014K02983K830714
3298D46186274N227417P204145Q669257R624482J0110586J0176480R954810R610653
3314.4E16764104R183288Q635938P956982P241070O684423O463110O469667O396532
3330.7E75795114O105125N651534N123257M593075M101216L658831L279865K911210
3347F11219227K525986K157330J836479J578629J346767J108289Q47518O04808M48168
3365.4F23673201L04579K2471l32057n35131n87225o59823p57039q26180q69035q41618
3385.7F18592143p00176n23925n83648q31425q42214n48065l91423o98746j018226
$$ plain form
3404.1 612454295 611592770 611027122 610548735 610042334 609458804 608821630 608291745 607897699 607541442 607272804
3424.5 607272804 607188940 607230842 607224047 607251227 607481539 607653022 607567251 607468367 607594907 607951820 608398497
3446.9 608398497 608884275 609471798 610127866 610820830 611605883 612474978 613285303 614108980 615209758
3465.3 615209758 616480529 617478907 618076801 618656993 619506538 620650232 621861219 622800827 623662829
3483.6 623662829 624733806 625789702 626725674 627741575 628888905 630087435 631257176 632391632
3500 632391632 633457243 634422004 635416508 636474252 637614310 638958097 640356660 641609490 642796278
3518.3 642796278 644040644 645365298 646662295 647829890 648979485 650301456 651808023 653410614
3534.6 653410614 654995441 656515718 658124328 659811080 661289513 662517667 663870335 665376663
$$ packed form
3404.1F12454295q61525n65648m78387n06401n83530o37174n29885l94046l56257k68638
3424.5F07272804q3864M1902o795K7180K30312J71483q5771r8884J26540L56913M46677
3446.9F08398497M85778N87523O56068O92964P85053Q69095Q10325Q23677J100778
3465.3F15209758J270771R98378N97894N80192Q49545J143694J210987R39608Q62002
3483.6F23662829J070977J055896R35972J015901J147330J198530J169741J134456
3500F32391632J065611R64761R94504J057744J140058J343787J398563J252830J186788
3518.3F42796278J244366J324654J296997J167595J149595J321971J506567J602591
3534.6F53410614J584827J520277J608610J686752J478433J228154J352668J506328
$$ plain form
3551 665376663 666855633 668438792 670124769 671775162 673426151 675028980 676272810 677398503 679198861
3569.3 679198861 681426704 683436811 685305238 687254786 689328790 691562772 693794489 695497155
3585.6 695497155 696655869 698441565 700855970 702905595 704736590 706831157 708907247 710905015
3601.9 710905015 713033080 714850485 716165185 717588186 719226360 720950246 722742498 724091232
3618.3 724091232 725345612 727191091 729150414 730292201 730061173 730364561 732093334 733663142 734789252
3636.6 734789252 735778809 736647129 737563014 738451421 738584638 737749517 737672865 739014387 740015626
3655 740015626 740378618 741287470 742290974 742875099 743472338 743771434 743050218 742627800 742916882 742085755
3675.4 742085755 741654575 742676556 743688345 744609356 745472074 745438576 744571805 744606853 745677531
$$ packed form
3551F65376663J478970J583159J685977J650393J650989J602829J243830J125693J800358
3569.3F79198861K227843K010107J868427J949548K074004K233982K231717J702666
3585.6F95497155J158714J785696K414405K049625J830995K094567K076090J997768
3601.9G10905015K128065J817405J314700J423001J638174J723886J792252J348734
3618.3G24091232J254380J845479J959323J141787k31028L03388J728773J569808J126110
3636.6G34789252R89557Q68320R15885Q88407J33217q35121p6652J341522J001239
3655G40015626L62992R08852J003504N84125N97239K99096p21216m22418K89082q31127
3675.4G42085755m31180J021981J011789R21011Q62718l3498q66771L5048J070678
$$ plain form
3693.7 745677531 746634305 747133136 747180581 746824741 746897876 747532547 747720540 746878982 745754302 745863676
3714.1 745863676 746674538 747003853 746789515 746422470 746003926 745612383 745744824 745988011 745521545 744610667
3734.5 744610667 744253039 745138586 746543229 746477067 744853377 744848013 745480001 744579017 744230747 745324194
3754.9 745324194 746095598 745895386 745863736 746326745 746401489 746167123 745778978 745488822 745770574 746180236
3775.3 746180236 746148765 745647073 745357513 745361209 745257258 745302975 745478213 745542467 745395482 744937956
3795.7 744937956 744686663 744236231 743193984 743200183 743402064 742987096 743383110 744222641 744134068 743113875
3816.1 743113875 742712617 742208660 741405845 741850138 742435932 742569089 742518663 742321193 742303371 741847038
3836.5 741847038 740805030 740518034 740879953 741246819 741785944 742422760 742244899 739840209 737702310
$$ packed form
3693.7G45677531R56774M98831M7445l55840P3135O34671J87993q41558j124680J09374
3714.1G45863676Q10862L29315k14338l67045m18544l91543J32441K43187m66466r10878
3734.5G44610667l57628Q85547J404643o6162j623690n364O31988r00984l48270J093447
3754.9G45324194P71404k00212l1650M63009P4744k34366l88145k90156K81752M09662
3775.3G46180236l1471n01692k89560L696j03951M5717J75238O4254j46985m57526
3795.7G44937956k51293m50432j042247O199K01881m14968L96014Q39531q8573j020193
3816.1G43113875m01258n03957q02815M44293N85794J33157n0426j97470j7822m56333
3836.5G41847038j042008k86996L61919L66866N39125O36816j77861k404690k137899
$$ plain form
3854.8 737702310 738668442 740105093 740459144 739999950 739667952 739843130 739407003 738703370 738753080 739127815
3875.2 739127815 739589691 739336908 738787651 738818288 738434732 738144279 738164425 737595856 737394452 737931669
3895.6 737931669 738001049 737298727 736503422 736015797 736191511 736926973 737448990 737635314 737699866 737385154
3916 737385154 736852705 736713827 736828208 736707330 736556888 736582100 736398816 736026049 735930622 736029923
3936.4 736029923 736018598 735797942 735406995 735220671 735198319 734990001 734818339 734844327 734833241 734693944
3956.8 734693944 734550834 734432817 734322548 734271169 734264553 734257460 734250963 734241426 734210253 734181762 734159052 734123826
3981.3 734123826 734056413 733914077 733728707 733594298 733517945 733398855 733187437 732964754
3997.6 732964754
$$ packed form
3854.8G37702310R66132J436651L54051m59194l31998J75178m36127p03633M9710L74735
3875.2G39127815M61876k52783n49257L0637l83556k90453K0146n68569k01404N37217
3895.6G37931669O9380p02322p95305m87625J75714P35462N22017J86324O4552l14712
3916G37385154n32449j38878J14381j20878j50442K5212j83284l72767r5427R9301
3936.4G36029923j1325k20656l90947j86324k2352k08318j71662K5988j1086j39297
3956.8G34693944j43110j18017j10269n1379o616p093o497r537l1173k8491k2710l5226
3981.3G34123826o7413j42336j85370j34409p6353j19090k11418k22683
3997.6G32964754
##END=$$ End of the data block
