##TITLE=QMC5230 Grupo 3 $$ Begin of the data block
##JCAMP-DX=5.00 $$ ACD/SpecManager v 10.08
##SPECTROMETER/DATA SYSTEM=Alpha
##DATE=15 Sep 2014 09:51:18
##DATA TYPE=INFRARED SPECTRUM
##DATA CLASS=XYDATA
##ORIGIN=
##OWNER=
##NPOINTS=1765
##FIRSTX=399.76428223
##LASTX=3997.64306641
##MAXX=3997.64306641
##MINX=399.76428223
##MAXY=0.81572527
##MINY=0.10139737
##XFACTOR=1.0000000000
##YFACTOR=1.000000000000000e-9
##FIRSTY=0.81121576
##DELTAX=2.03961372
##XUNITS=1/CM
##YUNITS=ARBITRARY UNITS
##XYDATA=(X++(Y..Y))
$$ plain form
399.8 811215758 810827076 809449613 806737602 804359138 803130209 801686287 801198363 803404927 806406796
418.1 806406796 807855129 808061659 807865143 807523608 806835115 805916309 805005908 804076195 803267419 802797437
438.5 802797437 802480280 802038550 801363826 800449967 799558759 798659861 797618747 796471119 795456052
456.9 795456052 794601619 793605208 792309821 790969014 789804041 788521171 786927998 785186470 783555627
475.2 783555627 781653464 779439747 777257562 774859071 771344841 766818643 762658656 758970439
491.5 758970439 754118562 746163666 732875645 708998382 663302779 597251892 540298820 498120844
507.9 498120844 469376445 506652296 613953888 710605025 756015837 768933654 769217372 762735248
524.2 762735248 746850848 713338614 650444150 573882401 550774574 610997558 691586196
$$ packed form
399.8H11215758l88682j377463k712011k378464j228929j443922m87924K206564L001869
418.1H06406796J448333K06530j96516l41535o88493r18806r10401r29713q08776m69982
438.5H02797437l17157m41730o74724r13859q91208q98898j041114j147628j015067
456.9G95456052q54433r96411j295387j340807j164973j282870j593173j741528j630843
475.2G83555627j902163k213717k182185k398491l514230m526198m159987l688217
491.5G58970439m851877p954896j3288021k3877263m5695603o6050887n6953072m2177976
507.9D98120844k8744399L7275851J07301592R6651137M5410812J2917817K83718o482124
524.2G62735248j5884400l3512234o2894464p6561749k3107827O0222984Q0588638
$$ plain form
538.5 691586196 738639295 757242382 764206111 767695427 771029651 774852991 778638124 782117248
554.8 782117248 785026968 786883414 787304580 786895454 786310852 785504341 784285247 782916427 781654000
573.1 781654000 780262768 778739691 777052343 775300562 773415327 771221936 768642604 765738010
589.4 765738010 762189269 757260621 750405312 740804315 725009024 694620371 646243870 607723832
605.8 607723832 622793734 682215691 733154893 751580596 749218881 747752964 756275117 764647663
622.1 764647663 766628623 765772104 764429271 762530506 760101378 757700980 755469978 752974570 750072539
640.4 750072539 747017086 744125068 741235137 738130748 734683394 730561495 724759579 715923727
656.8 715923727 702574074 684135616 667103291 661812544 670876324 685997069 693213522 694734871
$$ packed form
538.5F91586196M7053099J8603087O963729L489316L334224L823340L785133L479124
554.8G82117248K909720J856446M21166m09126n84602q06511j219094j368820j262427
573.1G81654000j391232j523077j687348j751781j885235k193391k579332k904594
589.4G65738010l548741m928648o855309r600997j5795291l0388653m8376501l8520038
605.8F07723832J5069902N9421957N0939202J8425703k361715j465917Q522153Q372546
622.1G64647663J980960q56519j342833j898765k429128k400398k231002k495408k902031
640.4G50072539l055453k892018k889931l104389l447354m121899n801916q835852
656.8G15923727j3349653j8438458j7032325n290747R063780J5120745P216453J521349
$$ plain form
673.1 694734871 692890167 687178969 677480340 663442731 643685400 614242554 565725803 487968892
689.4 487968892 394120574 329991102 325263232 378227264 477437049 580926597 643624842
703.7 643624842 665774405 667484999 661087632 651777685 641080916 629398644 617239833 604770184
720 604770184 591695726 577895999 563291550 547804534 530826986 511819839 490664780 467095971
736.3 467095971 440483958 410235941 376114726 337580770 293396205 242853746 191514552
750.6 191514552 153210714 137782246 139275655 150132880 180576026 240583971 314611912 382232457
766.9 382232457 444498330 504558027 553269863 586617231 610100865 628325164 643095970
781.2 643095970 655379117 665879190 675105155 683364213 690850437 697715044 704124272 710213840
$$ packed form
673.1F94734871j844704n711198r698629j4037609j9757331k9442846m8516751p7756911
689.4D87968892r3848318o4129472m727870N2964032R9209785J03489548O2698245
703.7F43624842K2149563J710594o397367r309947j0696769j1682272j2158811j2469649
720F04770184j3074458j3799727j4604449j5487016j6977548j9007147k1155059k3568809
736.3D67095971k6612013l0248017l4121215l8533956m4184565n0542459n1339194
750.6A91514552l8303838j5428468J493409J0857225L0443146O0007945P4027941O7620545
766.9C82232457O2265873O0059697M8711836L3347368K3483634J8224299J4770806
781.2F43095970J2283147J0500073R225965Q259058P486224O864607O409228O089568
$$ plain form
797.5 710213840 716150820 721925855 727330983 732075036 736076951 739371836 741750836 743075430
813.8 743075430 743649602 744199991 745252490 746694863 748206735 749632239 750302017 748678148 743030369
832.2 743030369 731512785 714409888 700929224 703267157 716949701 723353326 712309480 698534489
848.5 698534489 707047522 734355927 756928325 767740250 772756577 775655925 777358234 778333426
864.8 778333426 778993368 779395282 779369414 778999805 778550684 778064132 777430356 776672244 775820434 774607182
885.2 774607182 772437871 768641353 763138413 756660283 749765158 740896523 725268781 696161091
901.5 696161091 650338948 603683949 594319701 635376334 689659655 723734558 739276230 747724235
917.8 747724235 753922999 758473277 761129618 762242854 762694478 762820542 762368321 761189342 759596288
$$ packed form
797.5G10213840N936980N775035N405128M744053M001915L294885K379000J324594
813.8G43075430N74172N50389J052499J442373J511872J425504O69778j623869n647779
832.2G43030369j1517584j7102897j3480664K337933J3682544O403625j1043846j3774991
848.5F98534489Q513033K7308405K2572398J0811925N016327K899348J702309R75192
864.8G78333426O59942M01914k5868l69609m49121m86552o33776p58112q51810j213252
885.2G74607182k169311l796518n502940o478130o895125q868635j5627742k9107690
901.5F96161091m5822143m6654999r364248M1056633N4283321L4074903J5541672Q448005
917.8G47724235O198764M550278K656341J113236M51624J26064m52221j178979j593054
$$ plain form
936.2 759596288 757698894 755195498 751781642 747386754 741380811 731658816 716883183 701168180
952.5 701168180 688986063 671721578 637827814 604716599 608278155 648310959 691580474 718979537
968.8 718979537 730791986 734584928 736849010 736937046 732431948 724723220 719097435 718026221 717554331
987.2 717554331 714381337 707186580 691883087 664077938 638820350 644397974 668622196 673202872
1003.5 673202872 652870595 621466219 586593568 557912290 551452100 574126601 609876037
1017.8 609876037 637925565 656224191 670887530 678478181 673079133 655923188 633545816 612837136
1034.1 612837136 594839156 576163054 562265635 567973852 597612143 637655735 672466636
1048.4 672466636 696543455 711522520 720582187 726202250 729770601 731849432 732705355 732821822
$$ packed form
936.2G59596288j897394k503396l413856m394888o005943r721995j4775633j5715003
952.5G01168180j2182117j7264485l3893764l3111215L561556M0032804M3269515K7399063
968.8G18979537J1812449L792942K264082Q8036m505098p708728n625785j071214m71890
987.2G17554331l172994p194757j5303493k7805149k5257588N577624K4224222M580676
1003.5F73202872k0332277l1404376l4872651k8681278o460190K2674501L5749436
1017.8F09876037K8049528J8298626J4663339P590651n399048j7155945k2377372k0708680
1034.1F12837136j7997980j8676102j3897419N708217K9638291M0043592L4810901
1048.4F72466636K4076819J4979065R059667N620063L568351K078831Q55923J16467
$$ plain form
1064.7 732821822 732585728 731651187 728989363 723622978 714461446 700155497 683353305 676571369
1081 676571369 689326704 710852146 725499451 731475055 733472943 734084666 734109938 733692884 732961714
1099.4 732961714 732122540 731139898 729785740 727950156 725605786 723198235 722022951 722626269 723701060
1117.7 723701060 724101841 723787963 722952366 721837282 720719039 719759583 718869328 717951000 717048049
1136.1 717048049 716180623 715254068 714311481 713434637 712467194 711078227 709079981 706305206 701730132
1154.4 701730132 691235781 675024509 668265998 677697420 687603772 689019561 686122119 681187749
1170.7 681187749 672733903 657089889 632783175 615639687 630381405 667053699 691805363
1185 691805363 696971953 694452047 690451384 686078429 682119131 679256439 677127242 674715400 671637118
$$ packed form
1064.7G32821822k36094r34541k661824n366385r161532j4305949j6802192o781936
1081F76571369J2755335K1525442J4647305N975604J997888O11723K5272m17054p31170
1099.4G32961714q39174r82642j354158j835584k344370k407551j175284O03318J074791
1117.7G23701060M00781l13878q35597j115084j118243r59456q90255r18328r02951
1136.1G17048049q67426r26555r42587q76844r67443j388967j998246k774775m575074
1154.4G01730132j0494351j6211272o758511R431422R906352J415789k897442m934370
1170.7F81187749q453846j5644014k4306714j7143488J4741718L6672294K4751664
1185F91805363N166590k519906m000663m372955l959298k862692k129197k411842l078282
$$ plain form
1203.4 671637118 668289542 665149510 662312329 659262180 655855894 653168261 651977301 651237428
1219.7 651237428 648836434 643230200 635310948 630006015 631036520 634601831 635043383 631701350
1236 631701350 626288056 619503975 611074090 600487530 587411702 571628988 552928686 531017959
1252.3 531017959 505244970 473744690 433473885 385442704 344999045 341212720 392436206
1266.6 392436206 481802374 569045842 626042187 651546001 657094777 652669430 644434452 635180354
1282.9 635180354 624734581 612124205 597078383 579550266 559172451 536035478 511952102
1297.2 511952102 490098357 472090602 457009286 445230722 437612087 427367955 403226346
1311.5 403226346 362273008 311272413 260175258 219205707 196482107 198336676 230058178
$$ packed form
1203.4F71637118l347576l140032k837181l050149l406286k687633j190960p39873
1219.7F51237428k400994n606234p919252n304933J030505L565311M41552l342033
1236F31701350n413294o784081q429885j0586560j3075828j5782714j8700302k1910727
1252.3E31017959k5772989l1500280m0270805m8031181m0443659l786325N1223486
1266.6C92436206Q9366168Q7243468N6996345K5503814N548776m425347q234978r254098
1282.9F35180354j0445773j2610376j5045822j7528117k0377815k3136973k4083376
1297.2E11952102k1853745j8007755j5081316j1778564p618635j0244132k4141609
1311.5D03226346m0953338n1000595n1097155m0969551k2723600J854569L1721502
$$ plain form
1325.8 230058178 295206159 394564420 508899331 600919843 652191579 670907497 670638621
1340 670638621 661010146 647133172 630915999 613168418 594265997 574074805 552053034 527452111
1356.4 527452111 499639481 466013730 421256959 366603374 315622389 289257407 304736316
1370.6 304736316 357411742 424179107 479156703 514592588 535444856 545861542 548035502
1384.9 548035502 542821407 532380044 522711039 519793987 525475919 533172071 535886288 532470703
1401.2 532470703 524289966 512418628 498550177 483459294 466632545 448603898 429940760
1415.5 429940760 408454537 381277919 352904081 324665129 295953363 268844604 242215380
1429.8 242215380 218438119 203285694 200657293 212349027 232256949 256170064 282412112
$$ packed form
1325.8B30058178O5147981R9358261J14334911R2020512N1271736J8715918k68876
1340F70638621r628475j3876974j6217173j7747581j8902421k0191192k2021771k4600923
1356.4E27452111k7812630l3625751m4756771n4653585n0980985k6364982J5478909
1370.6C04736316N2675426O6767365N4977596L5435885K0852268J0416686K173960
1384.9E48035502n214095j0441363r669005k917052N681932P696152K714217l415585
1401.2E32470703q180737j1871338j3868451j5090883j6826749j8028647j8663138
1415.5D29940760k1486223k7176618k8373838k8238952k8711766k7108759k6629224
1429.8B42215380k3777261j5152425k628401J1691734J9907922K3913115K6242048
$$ plain form
1444.1 282412112 310626537 347392768 400669485 466938317 529604852 576268077 598925829
1458.3 598925829 601143301 594291568 580210805 561008751 541894853 521794975 496861011 469782770
1474.7 469782770 443263233 414929032 382056504 343129665 300022751 261719495 254064441
1488.9 254064441 287732631 321868837 323546857 288577527 247358248 245227858 288058192 358017862
1505.2 358017862 425954431 453909874 456236690 450886697 441816807 430584103 418454200 404462367
1521.6 404462367 390131056 376224905 360616475 344933927 329689026 314035594 301757038
1535.8 301757038 294231653 290369004 290925026 292187572 288752347 275784314 250000924 215120882
1552.2 215120882 180653587 159365714 167653114 215190023 277995884 351837426 426013052
$$ packed form
1444.1B82412112K8214425L6766231N3276717O6268832O2666535M6663225K2657752
1458.3E98925829K217472o851733j4080763j9202054j9113898k0099878k4933964k7078241
1474.7D69782770k6519537k8334201l2872528l8926839m3106914l8303256p655054
1488.9B54064441L3668190L4136206J678020l4969330m1219279k130390M2830334O9959670
1505.2C58017862O7936569K7955443K326816n349993r069890j1232704j2129903j3991833
1521.6D04462367j4331311j3906151j5608430j5682548j5244901j5653432j2278556
1535.8C01757038p525385l862649N56022J262546l435225j2968033k5783390l4880042
1552.2B15120882l4467295k1287873Q287400M7536909O2805861P3841542P4175626
$$ plain form
1566.4 426013052 481252193 515233517 531456590 538423359 541257799 539783955 529959977 504183114
1582.8 504183114 461757451 412175447 360808313 304221123 241879880 182976305 142971799
1597 142971799 131026074 142334849 168589905 205584615 244690344 273718446 291141748 303356290
1613.4 303356290 309266061 304448724 302653819 318162769 347177297 372978687 388519913 395978183
1629.7 395978183 396491975 391057312 378423661 361570507 343095601 321507424 298346192 274979591
1646 274979591 256928951 247607365 236831591 213665068 186701521 158599973 129772142 108049296
1662.3 108049296 101397373 110529579 137247860 182823822 231676370 279437602 324743837 360061586
1678.6 360061586 388962805 418567091 453176886 482664913 505561709 527679980 547616780
$$ packed form
1566.4D26013052N5239141L3981324J6223073O966769K834440j473844r823978k5776863
1582.8E04183114m2425663m9582004n1367134n6587190o2341243n8903575m0004506
1597A42971799j1945725J1308775K6255056L6994710L9105729K9028102J7423302J2214542
1613.4C03356290N909771m817337j794905J5508950K9014528K5801390J5541226P458270
1629.7C95978183N13792n434663j2633651j6853154j8474906k1588177k3161232k3366601
1646B74979591j8050640r321586j0775774k3166523k6963547k8101548k8827831k1722846
1662.3A08049296o651923R132206K6718281M5575962M8852548M7761232M5306235L5317749
1678.6C60061586K8901219K9604286L4609795K9488027K2896796K2118271J9936800
$$ plain form
1692.9 547616780 567705333 588455677 607567191 627097130 642980874 655748904 668027699
1707.2 668027699 678287029 686848760 694623828 702327132 710824132 719040990 725830734 731752217
1723.5 731752217 737189293 741882503 746146739 749922037 753327608 756118476 757452667 757027566
1739.8 757027566 755530298 754649282 755630314 758999944 764239073 770224690 775454640 779652834 782806516
1758.2 782806516 784757257 786146522 787877619 790088594 792367816 794168293 795115173 795836270 796756148
1776.5 796756148 797689497 798361361 798607409 798290193 797476649 796297073 794165015 790975630 788187265
1794.9 788187265 787000716 787486136 788760602 789210975 788693845 788945496 791460216 796203911 802085996
1813.2 802085996 807728767 811593950 812942266 812686801 812555015 813493788 814915836 815725267 815710485
$$ packed form
1692.9E47616780K0088553K0750344J9111514J9529939J5883744J2768030J2278795
1707.2F68027699J0259330Q561731P775068P703304Q497000Q216858O789744N921483
1723.5G31752217N437076M693210M264236L775298L405571K790868J334191m25101
1739.8G57027566j497268q81016R81032L369630N239129N985617N229950M198194L153682
1758.2G82806516J950741J389265J731097K210975K279222J800477R46880P21097R19878
1776.5G96756148R33349O71864K46048l17216q13544j179576k132058l189385k788365
1794.9G88187265j186549M85420J274466M50373n17130K51651K514720M743695N882085
1813.2H02085996N642771L865183J348316k55465j31786R38773J422048Q09431j4782
$$ plain form
1831.6 815710485 815117776 813960552 812606931 811506808 810526192 809085190 807276607 805282652 802865386
1850 802865386 800592184 799597383 800387144 802177489 803795934 804560363 804107606 801758587 796805799
1868.3 796805799 790508091 785922229 784738779 786874235 790908098 794952095 797564387 798231721
1884.6 798231721 797926128 798562050 801355362 805363595 808810949 810882628 811747968 812003016 812159777
1903 812159777 812391818 812578976 812623799 812523842 812247872 811690092 810747445 809593916 808342278 806943417
1923.4 806943417 805749536 805048704 804615557 803860426 802348256 800410748 798631132 796675324 793227136
1941.7 793227136 787052274 777045488 763065040 750571012 748918831 759477079 773413599 783038139
1958.1 783038139 786891460 786184490 783039212 781033695 783163846 788174093 792635679 795198381
$$ packed form
1831.6H15710485n92709j157224j353621j100123r80616j441002j808583j993955k417266
1850H02865386k273202r94801P89761J790345J618445P64429m52757k349019m952788
1868.3G96805799o297708m585862j183450K135456M033863M043997K612292O67334
1884.6G98231721l05593O35922K793312M008233L447354K071679Q65340K55048J56761
1903H12159777K32041J87158M4823r9957k75970n57780r42647j153529j251638j398861
1923.4H06943417j193881p00832m33147p55131j512170j937508j779616j955808l448188
1941.7G93227136o174862j0006786j3980448j2494028j652181J0558248J3936520R624540
1958.1G83038139L853321p06970l145278k005517K130151N010247M461586K562702
$$ plain form
1974.4 795198381 796298027 796519697 796331406 796318054 796943426 798050940 799037099 799542010 799638748 799539387
1994.8 799539387 799347401 799108505 798894346 798646033 798254728 797718108 797073185 796274483 795307159 794356465
2015.2 794356465 793768167 793699086 793872952 793965101 793772280 793128967 792043388 790875256 790168703 790206015
2035.6 790206015 790758312 791391194 791862667 792098284 792082429 791851223 791524529 791151226 790684462 790098369
2056 790098369 789378524 788458169 787262380 785877824 784629107 783902049 783860862 784425259 785287619 786047339
2076.4 786047339 786455095 786545336 786474228 786338627 786202729 786062062 785849094 785467029 784877181 784133434
2096.8 784133434 783363819 782710731 782299876 782179594 782270730 782459438 782650590 782830358 783005893 783102274
2117.1 783102274 783021331 782769203 782386243 781846464 781126618 780296564 779453635 778597653 777706623 776830435
$$ packed form
1974.4G95198381J099646K21670j88291j3352O25372J107514R86159N04911R6738r9361
1994.8G99539387j91986k38896k14159k48313l91305n36620o44923p98702r67324r50694
2015.2G94356465n88298o9081J73866R2149j92821o43313j085579j168132p06553L7312
2035.6G90206015N52297O32882M71473K35617j5855k31206l26694l73303m66764n86093
2056G90098369p19845r20355j195789j384556j248717p27058m1187N64397Q62360P59720
2076.4G86047339M07756R0241p1108j35601j35898j40667k12968l82065n89848p43747
2096.8G84133434p69615o53088m10855j20282R1136J88708J91152J79768J75535R6381
2117.1G83102274q0943k52128l82960n39779p19846q30054q42929q55982q91030q76188
$$ plain form
2137.5 776830435 776096523 775586903 775252104 774986207 774705231 774296284 773629129 772728980 771839321 771293521
2157.9 771293521 771294296 771843910 772764623 773756981 774491668 774805486 774817824 774662435 774267316 773523808
2178.3 773523808 772512615 771422684 770378530 769461870 768826485 768617392 768762469 769027948 769236445
2196.7 769236445 769297719 769099891 768558621 767790437 767050624 766459405 765947044 765467942 765117407 765043497
2217.1 765043497 765291691 765773892 766382635 766962349 767286301 767275631 767043948 766650498 766033709 765234113
2237.5 765234113 764458895 763846159 763353586 762881160 762385547 761834264 761118710 760097146 758753777
2255.8 758753777 757308304 756136417 755536795 755440772 755476117 755296648 754720449 753808975 752902746 752409816
2276.2 752409816 752485693 753050208 753968477 755035639 755970776 756612360 757042408 757403016 757685244 757798910
$$ packed form
2137.5G76830435p33912n09620l34799k65897k80976m08947o67155r00149q89659n45800
2157.9G71293521P75N49614R20713R92358P34687L13818J2338j55389l95119p43508
2178.3G73523808j011193j089931j044154r16660o35385k09093J45077K65479K08497
2196.7G69236445O1274j97828n41270p68184p39813n91219n12361m79102l50535p3910
2217.1G65043497K48194M82201O08743N79714L23952j0670k31683l93450o16789p99596
2237.5G65234113p75218o12736m92573m72426m95613n51283p15554j021564j343369
2255.8G58753777j445473j171887n99622r6023L5345j79469n76199r11474r06229m92930
2276.2G52409816P5877N64515R18269J067162R35137O41584M30048L60608K82228J13666
$$ plain form
2296.6 757798910 757777035 757682085 757454455 757034361 756450474 755701363 754675627 753191233 751099885
2315 751099885 748531222 746250451 745256066 745496452 746076584 746473432 746496737 745891273 744522095 742501438
2335.4 742501438 740329683 739338696 740780830 743831933 746470630 748141646 749136448 749317944 748544991
2353.7 748544991 747209311 745985806 745311677 745032370 744728386 744392395 744146883 743906081 743543386
2372.1 743543386 742997169 742315054 741593122 740930438 740431309 740147889 740014911 739915907 739816308 739750326
2392.5 739750326 739613652 739167452 738350868 737448812 736849964 736748874 737188578 738113582 739286721
2410.8 739286721 740290105 740778863 740741134 740394711 739924729 739416420 738931239 738475084 737917125 737146974
2431.2 737146974 736326039 735748291 735506713 735431373 735355496 735268950 735131085 734791934 734147012 733225167
$$ packed form
2296.6G57798910k1875r4950k27630m20094n83887p49111j025736j484394k091348
2315G51099885k568663k280771r94385K40386N80132L96848K3305o05464j369178k020657
2335.4G42501438k171755r90987J442134L051103K638697J671016R94802J81496p72953
2353.7G48544991j335680j223505o74129k79307l03984l35991k45512k40802l62695
2372.1G43543386n46217o82115p21932o62684m99129k83420j32978r9004r9599o5982
2392.5G39750326j36674m46200q16584r02056n98848j01090M39704R25004J173139
2410.8G39286721J003384M88758l7729l46423m69982n08309m85181m56155n57959p70151
2431.2G37146974q20935n77748k41578p5340p5877q6546j37865l39151o44922r21845
$$ plain form
2451.6 733225167 732051790 730679393 729546785 729338706 730163932 731350780 732209325 732575238 732609570
2470 732609570 732382894 731864512 731158316 730454862 729802966 729099095 728320539 727592885 726924241 726147890
2490.4 726147890 725205302 724253297 723522544 723166645 723176539 723344386 723466754 723586202 723812401 724049151
2510.8 724049151 724033535 723539472 722509742 721035123 719275713 717502058 716222763 715969265 716769755
2529.1 716769755 718061268 719226480 720011353 720366240 720157743 719252825 717724919 715936422 714467227
2547.5 714467227 713776946 713869393 714394033 715003490 715524614 715945661 716287851 716515660 716576219 716527462
2567.9 716527462 716598153 716945708 717474282 717949808 718187511 718156159 717940211 717588961 717066228 716362357
2588.3 716362357 715555668 714802861 714263856 713948011 713697493 713329732 712742329 711923897 710863531
$$ packed form
2451.6G33225167j173377j372397j132608k08079Q25226J186848Q58545L65913L4332
2470G32609570k26676n18382p06196p03454o51896p03871p78556p27654o68644p76351
2490.4G26147890r42588r52005p30753l55899R894J67847J22368J19448K26199K36750
2510.8G24049151j5616m94063j029730j474619j759410j773655j279295k53498Q00490
2529.1G16769755J291513J165212P84873L54887k08497r04918j527906j788497j469195
2547.5G14467227o90281R2447N24640O09457N21124M21047L42190K27809O0559m8757
2567.9G16527462P0691L47555N28574M75526K37703l1352k15948l51250n22733p03871
2588.3G16362357q06689p52807n39005l15845k50518l67761n87403q18432j060366
$$ plain form
2606.6 710863531 709512234 707788289 705553234 702780128 699806035 697379470 696368456 697175264
2623 697175264 699337602 701962292 704445422 706587434 708368421 709743202 710609198 710961103 710931361
2641.3 710931361 710633814 710127950 709516466 708926618 708392918 707817674 707089841 706175566 705117404
2659.7 705117404 703971922 702780604 701671183 700819671 700220346 699697971 699182093 698783875 698588371
2678 698588371 698494971 698273242 697735190 696835995 695591509 694034338 692221642 690218866 688199878
2696.4 688199878 686518610 685588717 685699761 686832011 688616931 690569401 692296743 693548203 694231808
2714.7 694231808 694460869 694540024 694738507 695038021 695236146 695219576 695003450 694647372 694144428 693442225
2735.1 693442225 692546904 691457808 690167129 688759744 687361360 686003447 684591830 683049202
$$ packed form
2606.6G10863531j351297j723945k235055k773106k974093k426565j011014Q06808
2623F97175264K162338K624690K483130K142012J780987J374781Q65996L51905k9742
2641.3G10931361k97547n05864o11484n89848n33700n75244p27833r14275j058162
2659.7G05117404j145482j191318j109421q51512n99325n22375n15878l98218j95504
2678F98588371r3400k21729n38052q99195j244486j557171j812696k002776k018988
2696.4F88199878j681268r29893J11044J132250J784920J952470J727342J251460O83605
2714.7F94231808K29061P9155J98483K99514J98125j6570k16126l56078n02944p02203
2735.1F93442225q95321j089096j290679j407385j398384j357913j411617j542628
$$ plain form
2751.4 683049202 681479931 680046678 678757191 677579224 676552713 675651073 674754083 673797667 672803581
2769.8 672803581 671797991 670761347 669566989 668064892 666181147 663799703 660788715 657125294
2786.1 657125294 652839601 647959411 642565191 636918604 631508887 626956344 623958588 623179317
2802.4 623179317 624865115 628658533 633881986 639830709 645900667 651598692 656517565 660433471
2818.8 660433471 663341999 665287793 666256666 666246891 665367067 663823068 661803663 659428895 656764150
2837.1 656764150 653805733 650498271 646923065 643335640 639950752 636822581 633848727 631012321
2853.4 631012321 628730714 627776861 628673434 631229520 634766400 638493538 641685545 643916726 645265818
2871.8 645265818 646171153 646910310 647502005 648198009 649351418 650821090 652024686 652481735 652129948
$$ packed form
2751.4F83049202j569271j433253j289487j177967j026511r01640q96990r56416r94086
2769.8F72803581j005590j036644j194358j502097j883745k381444l010988l663421
2786.1F57125294m285693m880190n394220n646587n409717m552543k997756p79271
2802.4F23179317J685798L793418N223453N948723O069958N698025M918873L915906
2818.8F60433471K908528J945794R68873r775q79824j543999k019405k374768k664745
2837.1F56764150k958417l307462l575206l587425l384888l128171k973854k836406
2853.4F31012321k281607r53853Q96573K556086L536880L727138L192007K231181J349092
2871.8F45265818R05335P39157N91695O96004J153409J469672J203596M57049l51787
$$ plain form
2890.1 652129948 651133478 649611652 647663772 645401716 642871380 640149713 637462735 635113120
2906.5 635113120 633227646 631581843 629815936 627703249 625197887 622333229 619195282 615948141
2922.8 615948141 612911403 610859275 610867023 613357067 617488921 621731579 624977171 627008021 628057122
2941.1 628057122 628362775 628052890 627186835 625800610 623917997 621579647 618793964 615552962 611858785
2959.5 611858785 607737184 603243113 598520279 593921781 589968145 587219536 586069226 586491466
2975.8 586491466 587965071 589741945 591227412 592177987 592689455 592913449 592696548 591720521 589893520
2994.2 589893520 587301970 584110022 580671370 577417612 574465513 571331143 567123532 561044753
3010.5 561044753 552733839 542458236 531436443 522000194 516835272 517531335 523711324 533192813
$$ packed form
2890.1F52129948r96470j521826j947880k262056k530336k721667k686978k349615
2906.5F35113120j885474j645803j765907k112687k505362k864658l137947l247141
2922.8F15948141l036738k052128P748K490044M131854M242658L245592K030850J049101
2941.1F28057122L05653l09885q66055j386225j882613k338350k785683l241002l694177
2959.5F11858785m121601m494071m722834m598498l953636k748609j150310M22240
2975.8E86491466J473605J776874J485467R50575N11468K23994k16901r76027j827001
2994.2E89893520k591550l191948l438652l253758k952099l134370m207611o078779
3010.5E61044753q310914j0275603j1021793r436249n164922O96063O179989R481489
$$ plain form
3026.8 533192813 542699516 549078763 550608695 547333777 540426970 531799018 524022818 519180298
3043.1 519180298 517119884 515513599 511798263 504508078 493276805 479496956 467487991 462264776
3059.4 462264776 464754552 471672088 479442090 485636652 488744259 488699526 486699671 484247178 482605755
3077.8 482605755 482501358 483976662 486696303 490261376 494296074 498579532 502944529 506948590
3094.1 506948590 510181069 512887001 515809774 519214690 522205293 523300827 521607101 517426014
3110.4 517426014 512189507 507794440 505073905 502974033 499701202 493772924 484342039 471676260
3126.7 471676260 457125813 442678243 430802792 424121320 424243093 430753767 441505998 453908503
3143 453908503 465914220 476302981 484628826 490860403 495096117 497588754 498714805 498831481
$$ packed form
3026.8E33192813R506703O379247J529932l274918o906807q627952p776200m842520
3043.1E19180298k060414j606285l715336p290185j1231273j3779849j2008965n223215
3059.4D62264776K489776O917536P770002O194562L107607m4733j999855k452493j641423
3077.8D82605755j04397J475304K719641L565073M034698M283458M364997M004061
3094.1E06948590L232479K705932K922773L404916K990603J095534j693726m181087
3110.4E17426014n236507m395067k720535k099872l272831n928278r430885j2665779
3126.7D71676260j4550447j4447570j1875451o681472J21773O510674J0752231J2402505
3143D53908503J2005717J0388761Q325845O231577M235714K492637J126051J16676
$$ plain form
3159.4 498831481 498230785 497037917 495130956 492299736 488477945 483718306 478020638 471367419
3175.7 471367419 463804930 455369204 445957422 435475230 424207628 412950486 402861804 395326495
3192 395326495 391776413 393131346 399134278 408240944 418282390 427227378 433671802 437232643
3208.3 437232643 438524783 438636303 438671678 439313561 440257549 440335304 438529611 434739083 429473132
3226.7 429473132 423210621 416156143 408339441 399735123 390329480 380122989 369061381 357177049
3243 357177049 344802946 332505852 320731461 309710413 299709648 291232020 285046846 281974196
3259.3 281974196 282469332 286253452 292119652 297926694 301384062 301272929 297749788 291504055 283073395
3277.7 283073395 273072243 262335539 251558304 241205245 231778368 224024758 218715817 216221526
$$ packed form
3159.4D98831481o00696j192868j906961k831220l821791m759639n697668o653219
3175.7D71367419p562489q435726r411782j0482192j1267602j1257142j0088682p535309
3192C95326495l550082J354933O002932R106666J0041446Q944988O444424L560841
3208.3D37232643J292140J11520L5375O41883R43988P7755j805693l790528n265951
3226.7D29473132o262511p054478p816702q604318r405643j0206491j1061608j1884332
3243C57177049j2374103j2297094j1774391j1021048j0000765q477628o185174l072650
3259.3B81974196M95136L784120N866200N807042L457368j11133l523141o245733q430660
3277.7B83073395j0001152j0736704j0777235j0353059r426877p753610n308941k494291
$$ plain form
3294 216221526 216603637 219933316 226162776 234921560 245674238 257900268 271178752 285111517
3310.3 285111517 299275130 313344210 327132344 340481758 353167176 365042627 376319170
3324.6 376319170 387545943 399098694 410876989 422488004 433559060 443943948 453693330
3338.8 453693330 462862104 471412063 479331195 486647695 493390262 499651939 505514741 510961950
3355.2 510961950 516003966 520682096 524960458 528808832 532261968 535356998 538071930 540375471
3371.5 540375471 542305887 543916643 545251012 546342909 547218204 547939777 548597217 549277723 549992085
3389.8 549992085 550626755 551118076 551566362 552068114 552528620 552716315 552680433 552749395 552939892 553050995
3410.2 553050995 553072631 553018332 552897632 552853167 552888811 552892268 552926898 553070366 553250730 553377509 553559780
$$ packed form
3294B16221526L82111L329679O229460Q758784J0752678J2226030J3278484J3932765
3310.3B85111517J4163613J4069080J3788134J3349414J2685418J1875451J1276543
3324.6C76319170J1226773J1552751J1778295J1611015J1071056J0384888R749382
3338.8D53693330R168774Q549959P919132P316500O742567O261677N862802N447209
3355.2E10961950N042016M678130M278362L848374L453136L095030K714932K303541
3371.5E40375471J930416J610756J334369J091897Q75295P21573O57440O80506P14362
3389.8E49992085O34670M91321M48286N01752M60506J87695l5882O8962J90497J11103
3410.2E53050995K1636n4299j20700m4465L5644L457L4630J43468J80364J26779J82271
$$ plain form
3432.7 553559780 553866267 554058969 554039121 554031134 554197729 554504633 554856181 555246532 555702865 556163251
3453.1 556163251 556636035 557227314 557934582 558611095 559311152 560262501 561342239 562138915 562552273
3471.4 562552273 562956750 563646674 564595103 565524876 566180348 566783547 567581773 568387687 569103718 569907069
3491.8 569907069 570827842 571775496 572716236 573631763 574457288 575120926 575745165 576500952 577427626 578549385
3512.2 578549385 579680681 580588639 581423223 582415402 583534062 584519565 585275710 586074293 587077200
3530.6 587077200 588214755 589474320 590756416 591973186 593306899 594756365 596016228 597036481
3546.9 597036481 598091722 599198282 600262582 601432800 602701545 603951871 605254471 606515646
3563.2 606515646 607437849 608258009 609577537 611191928 612663686 614077330 615586221 617238045 619083524
$$ packed form
3432.7E53559780L06487J92702j9848p987J66595L06904L51548L90351M56333M60386
3453.1E56163251M72784N91279P07268O76513P00057R51349J079738P96676M13358
3471.4E62552273M04477O89924R48429R29773O55472O03199P98226Q05914P16031Q03351
3491.8E69907069R20773R47654R40740R15527Q25525O63638O24239P55787R26674J121759
3512.2E78549385J131296R07958Q34584R92179J118660R85503P56145P98583J002907
3530.6E87077200J137555J259565J282096J216770J333713J449466J259863J020253
3546.9E97036481J055241J106560J064300J170218J268745J250326J302600J261175
3563.2F06515646R22203Q20160J319528J614391J471758J413644J508891J651824J845479
$$ plain form
3581.5 619083524 620945215 622342050 623311222 624748051 626581430 628140152 629587591 631218672
3597.9 631218672 632814407 634334207 635916471 637309492 638402164 639551520 640879929 642351270
3614.2 642351270 643760741 644690335 645542026 646872044 648293793 648988068 648610234 648641527 649630547
3632.5 649630547 650493741 651084185 651669323 652306199 653060615 653741419 653718174 652908921 652613938 653164208
3652.9 653164208 653491020 653690457 654464126 655301273 655858696 656438649 656711817 656202435 655895174 655933321
3673.3 655933321 655171454 654731452 655282259 655943811 656705499 657500923 657725453 657387614 657511175 658219695
3693.7 658219695 658843637 659149110 659123540 658859789 658889294 659249425 659301043 658594429 657594860 657388628
3714.1 657388628 657740831 657891273 657679677 657230973 656654596 656199932 656192839 656270981 655913651 655374646
$$ packed form
3581.5F19083524J861691J396835R69172J436829J833379J558722J447439J631081
3597.9F31218672J595735J519800J582264J393021J092672J149356J328409J471341
3614.2F42351270J409471R29594Q51691J330018J421749O94275l77834L1293R89020
3632.5F49630547Q63194N90444N85138O36876P54416O80804k3245q09253k94983N50270
3652.9F53164208L26812J99437P73669Q37147N57423N79953K73168n09382l07261L8147
3673.3F55933321p61867m40002N50807O61552P61688P95424K24530l37839J23561P08520
3693.7F58219695O23942L05473k5570k63751K9505L60131N1618p06614r99569k06232
3714.1F57388628L52203J50442k11596m48704n76377m54664p093P8142l57330n39005
$$ plain form
3734.5 655374646 655395627 656304002 657325923 657117724 655933619 655873835 656092465 655333281 655029535 655622482
3754.9 655622482 655974209 655736506 655619979 655780971 655661166 655306339 654873788 654534638 654550433 654686689
3775.3 654686689 654566765 654110849 653737366 653588474 653431654 653318942 653255939 653168082 652973652 652609110
3795.7 652609110 652322829 651780725 650944233 650847137 650784612 650334477 650510788 651015759 650837719 650047421
3816.1 650047421 649604023 648993254 648262441 648393810 648678660 648719132 648629904 648487031 648452580 648027718
3836.5 648027718 647193074 646874189 646983862 647130430 647417784 647751629 647355676 645248532 643444836
3854.8 643444836 643941939 644846201 645063758 644734621 644463062 644383430 643868387 643310905 643257976 643388271
3875.2 643388271 643515944 643172324 642663121 642457962 642049134 641736507 641446054 640671611 640235066 640406013
$$ packed form
3734.5F55374646K0981R08375J021921k08199j184105n9784K18630p59184l03746N92947
3754.9F55622482L51727k37703j16527J60992j19805l54827m32551l39150J5795J36256
3775.3F54686689j19924m55916l73483j48892j56820j12712o3003q7857j94430l64542
3795.7F52609110k86281n42104q36492r7096o2525m50135J76311N04971j78040p90298
3816.1F50047421m43398o10769p30813J31369K84850M0472q9228j42873l4451m24862
3836.5F48027718q34644l18885J09673J46568K87354L33845l95953k107144j803696
3854.8F43444836M97103R04262K17557l29137k71559p9632n15043n57482n2929J30295
3875.2F43388271J27673l43620n09203k05159m08828l12627k90453p74443m36545J70947
$$ plain form
3895.6 640406013 640359163 639898479 639329433 638813138 638744056 639159918 639528871 639716208 639753819 639492154
3916 639492154 639134943 638994753 638924897 638721228 638538957 638388216 638002872 637502432 637212038 637054861
3936.4 637054861 636854172 636523604 636076212 635770798 635606110 635357916 635086060 634923041 634803355 634582460
3956.8 634582460 634291887 634067655 633917928 633789837 633716643 633736074 633784056 633786321 633759856 633727193 633630574
3979.3 633630574 633462906 633303881 633140326 632888675 632560015 632237613 631982327 631773114 631541252
3997.6 631541252
$$ packed form
3895.6F40406013m6850m60684n69046n16295o9082M15862L68953J87337L7611k61665
3916F39492154l57211j40190o9856k03669j82271j50741l85344n00440k90394j57177
3936.4F37054861k00689l30568m47392l05414j64688k48194k71856j63019j19686k20895
3956.8F34582460k90573k24232j49727j28091p3194J9431M7982K265k6465l2663r6619
3979.3F33630574j67668j59025j63555k51651l28660l22402k55286k09213k31862
3997.6F31541252
##END=$$ End of the data block
