##TITLE=QMC5230 Grupo 2 $$ Begin of the data block
##JCAMP-DX=5.00 $$ ACD/SpecManager v 10.08
##SPECTROMETER/DATA SYSTEM=Alpha
##DATE=15 Sep 2014 09:51:18
##DATA TYPE=INFRARED SPECTRUM
##DATA CLASS=XYDATA
##ORIGIN=
##OWNER=
##NPOINTS=1765
##FIRSTX=399.76428223
##LASTX=3997.64306641
##MAXX=3997.64306641
##MINX=399.76428223
##MAXY=0.82222271
##MINY=0.14657180
##XFACTOR=1.0000000000
##YFACTOR=1.000000000000000e-9
##FIRSTY=0.80687982
##DELTAX=2.03961372
##XUNITS=1/CM
##YUNITS=ARBITRARY UNITS
##XYDATA=(X++(Y..Y))
399.8 806879818 806169987 806168854 804373443 800881982 798460007 797720373 798409104 800938189 804007232
418.1 804007232 806239963 806952953 805387318 803115487 802647114 803385615 802862585 800990045 800243139
436.5 800243139 801382363 801683962 799536705 797389269 797615230 798406184 796780527 794071853 793594718
454.8 793594718 794707656 793824852 790957808 789358735 789701581 789378643 786951780 784543693 783831179
473.2 783831179 783155859 780378640 776834309 774994969 774033010 770846188 765219510 760413587 757556438
491.5 757556438 753314972 744147182 729275227 705653012 662198186 599421501 546498299 511309564
507.9 511309564 490724921 527172089 623672903 711787343 756649196 771966577 772581816 765249193
524.2 765249193 751135230 722448826 665314734 594206274 573085189 629606485 703758836
538.5 703758836 744812608 759866893 767085314 772025704 774265230 775468886 778746843 783686280
554.8 783686280 786641836 786438823 785715222 786543190 787149191 785463274 782964706 782139659 782333553
573.1 782333553 781009436 778190494 776091158 775368631 773971200 770801842 767485857 765444696 763132155
591.5 763132155 757989049 750034273 740433097 725917518 696891069 650178730 613446474 628339708
607.8 628339708 685637712 734376013 751331627 748923957 748616755 757598758 765168250 766712129
624.1 766712129 766618073 766080320 763948023 760879040 758665562 757341981 755192161 751670420 748237431
642.5 748237431 746025920 744002461 740724206 736363828 731986284 726914465 718613863 704879820
658.8 704879820 686328232 670540094 666819334 676094651 689592957 695946038 697894633 695955992
675.1 695955992 689027548 678665817 665402770 646413684 617014706 570479631 499986589 416875750
691.4 416875750 360051960 356204450 405898929 499171168 596143961 654215097 674061716 675591230
707.7 675591230 669827580 660206139 648612559 637098730 626138687 614297450 600935400 587346077
724.1 587346077 574109495 560113490 543972552 525855064 506512105 485445082 461371660
738.3 461371660 433687925 402651250 367910087 327835739 280944705 231821731 193989411
752.6 193989411 178268135 179648861 190238133 219195172 275728106 345141143 408319056 465672910
768.9 465672910 520313442 565108299 596339345 617854118 634105504 648152292 660781145
783.2 660781145 670972109 678859770 686372697 694477081 701908112 707666874 712958753 719294190
799.5 719294190 725939512 731185555 735081375 739117086 743447423 746446431 747314036 747418880 748567224
817.9 748567224 750623405 752137244 753024876 754571855 756327033 755399585 749447107 737892568 722164631
836.2 722164631 710343063 712642193 724907339 730725467 720534980 707073033 714352846 740741372
852.6 740741372 763963342 775760055 780721605 782966554 784773886 786689222 787824690 787726045
868.9 787726045 787323952 787569284 787954926 787413478 786210001 785566747 785573304 784751415 782045722 777898610
889.3 777898610 773023605 767335892 760396004 751195431 736261308 708906651 665096223 620002091
905.6 620002091 609914899 647728384 699224710 732120275 747184455 755973220 763180137 768225133
921.9 768225133 770533442 771508753 772657752 773475111 772822082 771129310 769772887 768654823 766413152
940.3 766413152 762593865 758107483 752933621 744400918 730450094 715053260 702852964 686018169
956.6 686018169 654030025 623275220 627230644 666068375 708148181 734074116 744378746 747819424
972.9 747819424 750716209 751060009 745930910 737697721 732437849 731966019 731334507 727647185 720726728
991.3 720726728 706528902 680031121 655867815 661794245 686026454 691083789 671501577 641445637
1007.6 641445637 609151542 583251476 577668250 598677754 632030189 658630311 675897181
1021.8 675897181 689159811 695858598 691100180 675587058 654529214 634223521 616129041 597423077
1038.2 597423077 583215654 587364733 614297569 651895583 685326636 708558083 722845078
1052.4 722845078 731752396 737815559 741758287 743730128 744417131 744805932 745042384 744204044 741296768
1070.8 741296768 735917330 727207184 713431716 696769118 689619422 701824307 723056734 737627208
1087.1 737627208 743471801 745477498 746456325 746830881 746362805 745397568 744594574 743953168 742805421
1105.5 742805421 740784407 738184988 735855341 734920740 735462427 736170053 736397743 736330628 735667408
1123.8 735667408 734246612 732784510 732020140 731595874 730712116 729450285 728595376 728257596 727760136
1142.2 727760136 726751029 725661516 724795580 723539412 720965147 716222107 705875576 690056562
1158.5 690056562 683320522 692487061 702522814 704656720 702454984 697640657 689179957 674322665
1174.8 674322665 651859522 636352539 650508940 685040116 708760679 714156032 711715341 707676053
1191.1 707676053 703770161 700502932 697824836 695421815 693018138 690423250 687403738 684096336
1207.5 684096336 681065679 678243339 675192535 672503054 671179950 670789361 669293404 664719760
1223.8 664719760 657663703 652888715 654032648 657527447 657986760 654865861 649992883 644073725
1240.1 644073725 636669040 627149820 615300477 601152241 584517539 564882338 541527033 512895525
1256.4 512895525 476206869 431816578 393176287 387094587 431103200 510573745 589238405
1270.7 589238405 641232789 664995968 670894265 667688847 660534322 652080655 642716646 631650150
1287 631650150 618196607 602148533 583513141 562570274 540713429 520660818 504125953 490454435
1303.3 490454435 479804218 472824007 463444233 441380233 403693914 356198400 307865471 268522143
1319.6 268522143 246365324 247639611 277233839 337916315 429841161 535317719 620147586
1333.9 620147586 667299151 684394240 684165597 675539255 663032413 648267210 632157922 615231514
1350.2 615231514 597181082 577274323 554983795 530095518 500140369 459515393 408749104
1364.5 408749104 360528976 334813952 348085701 395897985 456568152 506384790 538536310
1378.8 538536310 557459533 566818297 568939388 564781308 555849075 547276616 544764817 550246298
1395.1 550246298 557572603 560040355 556587219 548915982 538237989 525802493 512085855 496699840
1411.4 496699840 480381429 463766187 444574058 419756055 393523067 367281705 340348512
1425.7 340348512 314605325 289089352 266218871 251678944 249303177 260576785 279346108
1440 279346108 301967084 327353805 355275333 391194373 441052526 501314044 557822406 599980652
1456.3 599980652 620147049 621537387 615065157 602256656 584681273 567388237 549703777 527734995
1472.6 527734995 503312051 479122460 453357279 423451155 387744933 347603023 311076015
1486.9 311076015 302845031 333932519 365841299 367386222 333957434 293725789 290577680 330556244
1503.2 330556244 396858454 462005079 488667339 490700990 485817760 477857679 468009979 457146049
1519.5 457146049 444377571 431162328 418314099 403837591 389153153 374812931 359944284
1533.8 359944284 347970039 340300888 336031586 336116850 337472677 335259289 324741811 302128315
1550.1 302128315 269632101 235633537 213246971 219463766 263796985 321872056 389489740
1564.4 389489740 457152009 507475078 538575411 553407013 559832931 562607884 561398804 552876413
1580.7 552876413 530300498 492565155 447912931 401074499 348400027 288483053 229580641
1595 229580641 187951252 174866244 186373577 213192657 250043929 288217276 315945834 331816405
1611.3 331816405 342330486 347193122 342563748 340627909 354246020 380125552 403116584 416839898
1627.6 416839898 423283219 423603207 419073910 408692330 394360006 378169566 359187096 338887393
1643.9 338887393 318460196 302725643 294631034 285210758 263981521 237746358 209095761 178763047
1660.3 178763047 154909059 146571800 155135095 182328641 228657916 276929528 322521538 364727706
1676.6 364727706 396843076 422824055 449728012 481459260 507983446 528165638 547843397
1690.9 547843397 565870464 584391654 603537381 621122479 639240444 653635681 664886355
1705.1 664886355 675708652 684930563 692968845 700431168 707875967 716150880 723791540 729674399
1721.5 729674399 734795928 739827394 744701624 749466300 753684342 757550001 760523319 761807740
1737.8 761807740 761464417 759911478 758862853 759924352 763555348 768854678 774491310 779429853
1754.1 779429853 783718050 786933064 788810253 790296078 792123079 794457853 796973109 799082398
1770.4 799082398 800481975 801308334 801903605 802627742 803396881 803871930 803753078 802949429 801775277
1788.8 801775277 800056815 797359824 794520140 793087840 793714106 795519531 796465158 796217203 796573222
1807.1 796573222 799083352 803640842 808991015 813934684 817310035 818495929 818295956 818292141 819306016
1825.5 819306016 820872784 822077215 822222710 821393788 820165455 819059432 818247736 817514420 816387355
1843.8 816387355 814753890 812711000 810135841 807580054 806359410 807159066 809017003 810518563
1860.2 810518563 811118066 810765743 808853209 804256380 797706306 792630553 791342378 793695688 797984660
1878.5 797984660 802352071 805497468 806808710 806955934 807675421 810170412 813757241 816909552 818683207
1896.9 818683207 819243550 819408655 819657028 819934726 820079863 820125699 820119143 819951236 819490254 818707287
1917.3 818707287 817741334 816697419 815467417 814211309 813392341 813019395 812377334 810837746 808746815
1935.6 808746815 806895077 805094481 801919937 795869410 785865486 771845400 758999467 756780088
1951.9 756780088 767124832 781345367 791401207 795563996 795031548 792032659 790124536 792118669
1968.3 792118669 796805561 801050067 803601801 804787219 805060983 804808915 804700613 805344701 806555450
1986.6 806555450 807620466 808165073 808279693 808164179 807919145 807612956 807388365 807257354 807036579
2005 807036579 806555629 805863619 805112004 804358304 803626895 803065300 802888334 803052902 803222060 803041220
2025.4 803041220 802388847 801404119 800420761 799820900 799816012 800293803 800929785 801426649 801605046 801477432
2045.8 801477432 801216066 800977588 800719082 800331354 799803257 799166858 798391581 797379613 796129465
2064.1 796129465 794909775 794178486 794159591 794666469 795327365 795914471 796328902 796468258 796337008 796127498
2084.5 796127498 796056390 796074629 795905113 795417368 794794858 794186115 793522060 792807400 792320490 792280197
2104.9 792280197 792538583 792783618 792907953 793107390 793453276 793670595 793534219 793212771 792931497 792577446
2125.3 792577446 791939199 791090131 790303349 789643705 788933635 788076818 787279606 786807001 786606550 786392570
2145.7 786392570 786042571 785633564 785132945 784380138 783419192 782709658 782726943 783402681 784251034 784986615
2166.1 784986615 785633087 786112368 786210537 785909116 785419643 784847021 784059465 782986641 781857371
2184.5 781857371 781000018 780513883 780290604 780277729 780505657 780859828 781038761 780811489 780246496 779599905
2204.8 779599905 779008985 778439879 777906835 777521014 777346194 777358234 777546227 777944624 778508246 779047608
2225.2 779047608 779350042 779343605 779125094 778816223 778401434 777815461 777168632 776633203 776208282 775769591
2245.6 775769591 775239289 774625957 773926020 773024321 771765947 770276904 769065380 768561602 768615007
2264 768615007 768677950 768442094 767941713 767243147 766441822 765833139 765768409 766307771 767176092 768076301
2284.4 768076301 768881738 769589186 770200908 770667136 770974576 771213353 771454513 771579504 771460235 771193564
2304.8 771193564 770933449 770605087 769921839 768665552 766858578 764756680 762972414 762265742 762632906
2323.1 762632906 763344467 763894558 764068961 763544261 762108743 759996831 757864892 757014096 758621633
2341.5 758621633 761883914 764445186 765421867 765727818 765979767 766086817 765783906 765197575 764737844
2359.9 764737844 764508963 764242113 763794959 763167024 762470603 761739373 760759771 759432197 757969499
2378.2 757969499 756674826 755675554 754917264 754347265 754035056 753991604 753980577 753716767 753149509 752403736
2398.6 752403736 751603603 750928640 750709414 751204193 752279758 753488362 754391909 754849851 754947782
2417 754947782 754731178 754266560 753759325 753387928 753057361 752501130 751701176 750957847 750486195 750245273
2437.4 750245273 750108957 750009477 749938846 749818444 749492168 748886585 748028040 746925473 745643437 744577229
2457.8 744577229 744338572 745060205 746182859 747061431 747444332 747435153 747182727 746731162 746119976 745442092
2478.1 745442092 744780719 744137585 743469536 742789447 742132843 741467178 740714312 739860594 739100933 738723636
2498.5 738723636 738748014 738877535 738900125 738952219 739204466 739498794 739497721 739026904 738097727 736764014
2518.9 736764014 735122919 733416438 732134342 731818557 732553601 733794212 734909832 735667527 736029983
2537.3 736029983 735876977 735076308 733674288 731981933 730506361 729718745 729713857 730168879 730711758
2555.6 730711758 731177509 731565773 731863499 732018411 732041955 732019782 732107520 732443571 732973218 733466923
2576 733466923 733728707 733716071 733502448 733156741 732673168 732016325 731221139 730466008 729952037 729667604
2596.4 729667604 729414463 729050219 728510261 727747262 726707518 725335896 723587215 721369445 718650639
2614.8 718650639 715703547 713256776 712248921 713102400 715282917 717885733 720377505 722586095
2631.1 722586095 724421680 725773752 726611435 727023602 727081656 726815999 726324737 725759447 725214005
2649.5 725214005 724679232 724104166 723434627 722625852 721670866 720565796 719401062 718388677 717637479
2667.8 717637479 717060685 716530263 716023147 715615988 715345621 715142012 714867294 714368343 713537335 712315083
2688.2 712315083 710742533 708920538 706908584 704851866 703131795 702239692 702436328 703608632 705416501
2706.6 705416501 707437873 709250152 710574746 711359799 711728334 711890757 712042868 712280393 712519109
2724.9 712519109 712559402 712329209 711942315 711469412 710826039 709923208 708783269 707515061 706217706
2743.3 706217706 704895973 703521490 702109158 700676262 699246645 697871506 696604848 695495665
2759.6 695495665 694551349 693698406 692838907 691957951 691069067 690127790 689086378 687883556 686417460
2778 686417460 684539557 682108223 679096103 675516486 671347499 666572928 661270857 655734420 650447488
2796.3 650447488 645981431 642983198 642080784 643529415 647046149 652022898 657768428 663684905
2812.6 663684905 669294953 674197793 678146005 681114733 683171630 684302211 684462368 683727145 682290673
2831 682290673 680366099 678102076 675512195 672564089 669294477 665795982 662246644 658841729 655673027
2849.3 655673027 652693808 649860263 647526145 646471083 647253513 649714470 653165221 656792819
2865.7 656792819 659907818 662124753 663499653 664423883 665195882 665877104 666675866 667897463 669398189
2884 669398189 670625687 671176076 670982301 670101404 668627977 666724622 664532006 662063241 659336448
2902.4 659336448 656609178 654285550 652507782 650981843 649303854 647270679 644862413 642111659
2918.7 642111659 639089286 635986149 633157730 631290257 631299019 633563936 637380540 641374707 644458950
2937 644458950 646361589 647332668 647642851 647372425 646510065 645075679 643133223 640774846 638020277
2955.4 638020277 634848356 631290019 627390087 623172283 618734598 614391327 610660136 608107388
2971.7 608107388 607114732 607602775 609045386 610816598 612381101 613408625 613953888 614230156 614115834
2990.1 614115834 613261819 611548364 609093308 606129706 602977991 599961936 597206414 594323695
3006.4 594323695 590475321 584838569 576999605 567243397 556793869 547831535 542828977 543296337
3022.7 543296337 548972607 557838440 566758871 572787404 574351847 571420848 564985335 556866705
3039 556866705 549585044 545141935 543349028 541957498 538590491 531932294 521673560 509144902
3055.3 509144902 498378962 493919015 496387720 502620518 509403467 514683485 517228901 517040372
3071.7 517040372 515141666 512819469 511225581 511038959 512312353 514725029 517877460 521468937
3088 521468937 525356352 529356301 533021927 535962045 538409412 541076303 544189870 546930850 547996223
3106.3 547996223 546547711 542775154 537976921 533982575 531594157 529768229 526807785 521403790
3122.6 521403790 512860596 501431048 488276541 475147605 464277327 458039612 457882136 463478506
3139 463478506 472985744 484099895 494938880 504351139 511918426 517629862 521533608 523802042
3155.3 523802042 524800956 524900973 524376273 523314536 521578133 518998623 515516996 511150301 505925298
3173.6 505925298 499871641 493037850 485422969 476930499 467505455 457365155 447163999 437951535
3189.9 437951535 430999458 427570134 428495228 433600426 441543877 450413376 458368212 464112997
3206.3 464112997 467298180 468437344 468468875 468428046 468969464 469781041 469794661 468100101 464603066
3224.6 464603066 459786743 454080343 447658032 440561712 432768375 424249381 414993972 404972941
3240.9 404972941 394216835 382989556 371786654 361031532 350973189 341831416 334004551 328221798
3257.3 328221798 325302929 325701416 329170674 334561110 339857936 342966229 342811376 339557439 333805263
3275.6 333805263 326008677 316727012 306746900 296715170 287024468 278102279 270660460 265428185
3291.9 265428185 262750089 262735486 265449524 270780265 278403372 287905395 298837245 310790479
3308.2 310790479 323329538 336008638 348565429 360860735 372730523 383974999 394498795
3322.5 394498795 404489458 414401114 424563318 434872746 444978595 454591811 463592261 472023517
3338.8 472023517 479949713 487343878 494201064 500535548 506360412 511769891 516840518 521553516
3355.2 521553516 525877833 529819429 533419251 536714196 539688647 542324364 544594765 546436906
3371.5 546436906 547925174 549210608 550288618 551114500 551723838 552193761 552604377 553059280 553605497
3389.8 553605497 554102004 554416478 554677725 555064142 555433631 555488646 555298269 555203378 555242181 555227697
3410.2 555227697 555120945 554947734 554742873 554629982 554589570 554487705 554413855 554497302 554643095 554703772
3430.6 554703772 554812014 555098712 555321634 555354357 555420101 555655658 556019008 556447148 556863248 557290971
3451 557290971 557810843 558422148 559126377 559928954 560739636 561569333 562611699 563809574 564748287 565291703
3471.4 565291703 565822423 566624761 567675710 568768442 569642305 570403516 571307600 572252095 573136926
3489.8 573136926 574104786 575174391 576237619 577253222 578280091 579337299 580248952 580997109 581862032
3508.1 581862032 582942903 584144950 585335553 586392939 587395132 588496387 589735925 590932786
3524.4 590932786 591957986 592977107 594075382 595234990 596552730 597971499 599350512 600832462
3540.8 600832462 602513254 604143023 605451226 606567025 607750714 609020531 610322595 611699045
3557.1 611699045 613192976 614754498 616259754 617705643 619277656 620850801 622160316 623442948
3573.4 623442948 625020444 626824260 628750265 630809426 632899046 634855807 636661768 638418496
3589.7 638418496 640079618 641707420 643472791 645331383 647091508 648743153 650415301 652055979
3606 652055979 653681934 655348897 656947672 658515096 659969091 661284089 662671506 663936436 665007234
3624.4 665007234 665907264 666628182 667377770 667940438 668372989 668949962 669600844 670283496 671046376 671803832
3644.8 671803832 672375262 672732353 672946990 672900498 672696173 672939479 673688948 674363673 674890280 675415397
3665.2 675415397 675747514 675837755 676134050 676289380 676030457 675968885 676040053 676159561 676547110 677139282
3685.6 677139282 677822709 678428769 678731263 678879738 679088473 679313183 679403722 679385841 679422915 679491341
3706 679491341 679527402 679375231 679053783 678831875 678615451 678409457 678323448 678236246 677965820 677627325
3726.4 677627325 677437007 677358568 677431822 677713394 678060949 678405583 678543031 678208649 677920580 678101838
3746.7 678101838 678003013 677616715 677456975 677416921 677217782 676867604 676667035 676582277 676463485 676315725
3767.1 676315725 676070869 675801158 675535023 675315380 675192833 675048470 674825490 674530029 674248397 674063623
3787.5 674063623 673945367 673813105 673552692 673307836 673225522 672894239 672537088 672529101 672277331 671983242
3807.9 671983242 671946824 671842635 671515107 671267271 671215475 670812905 670430183 670324087 670165896 670028567
3828.3 670028567 669832647 669709444 669775605 669656992 669367492 669215739 669064403 668868065 668717802 668626249
3848.7 668626249 668332577 667520463 666930854 666856587 666705310 666511178 666410625 666426420 666273594 665846050
3869.1 665846050 665675998 665588319 665354311 665128291 664808214 664638042 664460838 664045930 663655758 663119495
3889.5 663119495 662484586 662119269 661903560 661716580 661681533 661651194 661451876 661261559 661132276 661040783
3909.9 661040783 661079824 661142051 661090195 660997033 660880566 660690844 660465837 660252750 659985542 659654319
3930.3 659654319 659385502 659144998 658803642 658435643 658118546 657878041 657713473 657509744 657261431 657017767
3950.7 657017767 656759083 656482518 656207204 655957401 655757785 655608594 655500829 655491352 655591488 655688405
3971.1 655688405 655706406 655672133 655588627 655436099 655270576 655114949 654907823 654658258 654435754 654237509
3991.5 654237509 654018342 653786004 653532326
3997.6 653532326
##END=$$ End of the data block
