##TITLE=QMC5230 Grupo 1 $$ Begin of the data block
##JCAMP-DX=5.00 $$ ACD/SpecManager v 10.08
##SPECTROMETER/DATA SYSTEM=Alpha
##DATE=15 Sep 2014 09:51:18
##DATA TYPE=INFRARED SPECTRUM
##DATA CLASS=XYDATA
##ORIGIN=
##OWNER=
##NPOINTS=1765
##FIRSTX=399.76428223
##LASTX=3997.64306641
##MAXX=3997.64306641
##MINX=399.76428223
##MAXY=0.84685487
##MINY=0.23354387
##XFACTOR=1.0000000000
##YFACTOR=1.000000000000000e-9
##FIRSTY=0.83345115
##DELTAX=2.03961372
##XUNITS=1/CM
##YUNITS=ARBITRARY UNITS
##XYDATA=(X++(Y..Y))
399.8 833451152 831988156 828772485 827966154 828077197 825527310 822899997 824585378 828626215 830636919
418.1 830636919 831377387 832661688 831884265 829646826 829676151 830713332 829271436 827641606 828682780
436.5 828682780 829284668 827551007 826817036 828025699 827514172 825216770 824818730 825805902 824776530
454.8 824776530 823193491 823817134 823834360 821161211 819312215 820073545 819726765 817166090 815958500
473.2 815958500 816261530 814439476 811420381 810702443 810247660 806304395 801804423 800118983 797844529
491.5 797844529 792220473 785703540 777068317 757942796 719065487 665512443 620336175 585865438
507.9 585865438 564984977 599896252 686448514 759260476 792878747 804992914 806345165 799715579
524.2 799715579 787947834 765530229 719001770 660262167 642993987 688491702 746571839
538.5 746571839 779168189 794099271 801431179 803321540 805029869 809679627 813192844 813782036
554.8 813782036 815491617 818495393 818321943 816234648 816842020 818187118 816204369 813860357 814569652
573.1 814569652 814659834 811795890 810116649 810903609 809614718 806037605 804572701 804320991 800735891
591.5 800735891 795082331 790807664 784568131 770154715 743724346 706224263 678842425 692902565
607.8 692902565 740141094 780252516 793665648 789987624 789253592 797466695 803344905 803777993
624.1 803777993 804485857 804816365 802172720 799514413 799184501 798048139 794563293 792063177 791299939
642.5 791299939 788993359 785161138 783210993 782206416 778364539 772317350 766216099 756949842
658.8 756949842 741434574 727080166 723717690 730766892 740325212 745973647 749060452 748057783
675.1 748057783 742126644 733995795 723367095 706237674 679364443 637026846 571229219 493329734
691.4 493329734 441797793 441176176 489334732 572818518 656015933 706223845 724357247 725236654
707.7 725236654 720085979 713511527 704876423 694443107 684444904 674779058 663582921 651377976
724.1 651377976 639535248 627000093 611983836 595173955 577432632 557302177 533634663
738.3 533634663 507153630 477906317 444065630 404018432 357786268 310773283 275904059
752.6 275904059 262431949 264811844 277102947 309156001 367288232 435350657 495929509 549333155
768.9 549333155 597730875 636163533 662944376 681239605 695014298 707471788 718406856
783.2 718406856 726466179 733360529 740941167 747655213 752440989 757486165 763665557 768780172
799.5 768780172 772432506 776874125 781832874 784892082 786632657 789221585 791502237 791493595 791202903
817.9 791202903 792979360 794973016 795333862 795946598 797469735 796579123 791244030 782393336 770851016
836.2 770851016 761406720 762533844 772356510 776772201 767227173 756901264 765578628 787408531
852.6 787408531 803322256 810599625 815106988 817734063 818189681 818720937 820200086 820661843 819776177
870.9 819776177 819611669 820213258 819643021 818338215 818196714 818371117 816885114 814375818 811923325
889.3 811923325 808179557 802357495 796368897 790068209 778086424 754113734 717285931 682112217
905.6 682112217 677115560 709450424 750783145 777097225 788913846 794841826 799897492 804135680
921.9 804135680 805949152 806248844 807045937 807741702 807003438 805771768 805162787 803998590 801399112
940.3 801399112 798566461 795911610 791447461 783412755 772473514 761480510 751388907 735642791
956.6 735642791 708564579 684853554 689556956 720833719 754260778 775043905 782735229 784568727
972.9 784568727 786505401 786751986 782427073 775884390 772076547 771464407 770300329 767363429 762015045
991.3 762015045 749844193 727559805 708473623 713970423 732671499 735447764 719728172 696047843
1007.6 696047843 669829249 649336278 646899402 665517509 691703439 711630821 725196123
1021.8 725196123 735798419 740351081 735857964 723557413 706906021 690598965 676488578 662544608
1038.2 662544608 652338922 656775951 679309666 709441423 734928310 752348304 763899863
1052.4 763899863 771227121 775177419 777571023 779650986 780738056 780532002 780232430 780009806 778100848
1070.8 778100848 773484647 766319990 755786061 743255854 738312662 748424828 764909506 775552094
1087.1 775552094 779690266 781534553 782332540 781961381 781358302 781263351 780892372 779695570 778444231
1105.5 778444231 777425051 775701106 773445487 772608578 773656428 774639726 774698079 774655223 774507880
1123.8 774507880 773643374 772560358 772130311 771948695 771279514 770473957 770074964 769594908 768585503
1142.2 768585503 767592311 766909063 765825987 763950586 761637628 758180380 749753535 736556709
1158.5 736556709 731204927 738953471 746852040 747900128 745840251 742235601 735474706 723092496
1174.8 723092496 704764545 692749262 704901874 732909262 751712382 755781353 753701091 750532389
1191.1 750532389 747524679 744730592 742234111 740296602 738576114 736296415 733457744 730891168
1207.5 730891168 728821158 726395488 723533690 721614301 721144736 720686913 718693078 714649737 709289849
1225.8 709289849 705638051 706099451 708223224 708090723 705120325 700793922 695768178 689370215 680996895
1244.2 680996895 670827150 658812940 644397140 627360940 607515037 583191097 551550210
1258.4 551550210 513497472 481741726 479608804 521104693 591921031 659899116 703173637
1272.7 703173637 721357524 724424541 720625818 714033902 706208885 697542906 687619150 675587058
1289 675587058 661157429 644647419 626324296 607199609 589758635 575597048 563865662 554379761
1305.4 554379761 547296047 536969125 514570117 477975011 433130473 389017373 354807377
1319.6 354807377 337683290 343016595 374531507 433471411 518084526 611019135 682974935
1333.9 682974935 721393406 734221637 732846618 724772513 713408351 700244844 686375618 671867907
1350.2 671867907 656100810 638965786 620320857 599316776 573311865 537772715 493465155
1364.5 493465155 451062083 427770942 438914388 481396705 535376668 578811407 606156170
1378.8 606156170 621954620 629279792 630332172 626426995 618913889 612181664 611063719 616469920
1395.1 616469920 622286081 623074353 618961096 611848295 602028310 590287149 577751696 564142227
1411.4 564142227 549456120 534249783 516975582 494663000 470766544 446876794 422650129
1425.7 422650129 399663001 376626074 355763197 342644513 340504259 350203902 366717517 387626082
1442 387626082 412434936 441391498 479350388 529054880 584394634 633145034 668028712 683288753
1458.3 683288753 682198346 675070643 663426995 647961080 632590055 617073119 597943068 576073527
1474.7 576073527 553704441 529811382 502408445 469772130 433473021 402123660 398300529
1488.9 398300529 428574651 455898434 454138935 420616567 382764786 381617665 421062231 484301090
1505.2 484301090 544596732 567308068 567879140 563004375 555493832 546064556 535896838 523954868
1521.6 523954868 510900617 497948498 483727127 469727367 456360042 442506760 431681514
1535.8 431681514 425723821 423326969 424020320 425101936 422634840 412361115 390859306 360524625
1552.2 360524625 329585999 310333490 318529874 362218261 417298764 480107248 541916072
1566.4 541916072 587187290 614268959 626461864 631894588 633935153 631023705 621023118 598761857
1582.8 598761857 563511372 522054732 477753013 427241832 369612426 312746346 272643685
1597 272643685 261091441 274840117 304389417 342994452 381072253 407655418 422412097 432211578
1613.4 432211578 436940759 432712317 430882782 443460792 466916114 486985952 498154789 502599299
1629.7 502599299 501894772 497380257 487308115 473066807 457589090 440429777 422978014 405858129
1646 405858129 392221242 384765804 375298679 352853209 325838059 297412992 267304718 242925867
1662.3 242925867 233543873 241162822 267408013 312542349 359269410 402673930 441996992 471380413
1678.6 471380413 495191067 520114005 549078107 572531164 590440929 608315527 625138044
1692.9 625138044 643009245 661459267 678150356 694786608 707460582 717576861 727497160
1707.2 727497160 735785961 743031859 750156999 757863343 765860200 771640241 775658667 779879689
1723.5 779879689 784245968 788048804 791791081 795761287 799456835 801045597 801158786 800849497 799711943
1741.9 799711943 798759103 799734056 803113818 807479441 811340988 814641416 817778945 820051074 821438611
1760.2 821438611 822756588 824033737 825537801 827646673 830113351 831558108 831285417 830988169 831694424
1778.6 831694424 832452595 832408845 832028568 831659615 831141055 830119312 828232229 826054156 824834704
1796.9 824834704 825069666 826114476 826503456 826115489 826590538 829113960 832952976 836757541 840182841
1815.3 840182841 842701852 843478918 843096793 843334258 844734311 846212804 846854866 846518934 845733702
1833.6 845733702 844667077 843472123 842831910 842827380 842304945 840650737 838736951 836767733 834792733
1852 834792733 833860517 834594727 835938931 836718142 836970448 836868942 835613072 832102835 827166498
1870.3 827166498 823610187 822744131 824296057 827453256 830765963 832758367 833276331 833606780 834842503
1888.7 834842503 836875498 839221418 841468692 842810094 843017459 842960775 843234777 843527853 843555510
1907.1 843555510 843573034 843611360 843321264 842820287 842462122 842004776 841062903 839822412 838849127 838311613
1927.5 838311613 837744951 836894333 835864007 834614992 833152652 831534684 829056263 824203491 815961003
1945.8 815961003 805194736 796581447 796291113 804392159 814576447 821602583 824237108 823487341
1962.1 823487341 821484327 820719242 822474539 825757444 828826427 830722928 831340134 831323862 831340909
1980.5 831340909 831479132 831771135 832481265 833439231 833958387 833787858 833507955 833474517 833316863 832944930
2000.9 832944930 832747996 832660258 832221329 831543446 831062734 830652654 830021381 829486310 829449892 829599023
2021.3 829599023 829489946 829208910 828867674 828189015 827239752 826690316 826834917 827210665 827486873 827812195
2041.7 827812195 828104317 828022122 827665985 827456892 827315390 826899171 826336145 825906754 825402915 824533045
2062.1 824533045 823560357 822839797 822372019 822192848 822526932 823218286 823710918 823792338 823789477 823846996
2082.5 823846996 823720276 823463082 823379934 823346376 822990298 822407961 821912467 821467221 820933342 820530295
2102.9 820530295 820526421 820702612 820752740 820819378 821076155 821258724 821182966 821077228 821038723 820797801 820268869
2125.3 820268869 819718599 819220066 818594098 817877293 817314625 816886425 816388786 815926909 815727115 815616608
2145.7 815616608 815305293 814876139 814479232 813985586 813330054 812859058 812915564 813358545 813885450 814459980
2166.1 814459980 815010965 815260530 815165579 814962029 814677000 814118266 813340545 812608361 811974525 811326027
2186.5 811326027 810796618 810632467 810723007 810809553 810889125 810991883 810901642 810470164 809899926 809403002
2206.9 809403002 808933854 808485389 808221817 808156490 808148146 808250308 808613956 809090316 809372783 809428990
2227.3 809428990 809436023 809379876 809076607 808577359 808125496 807722986 807238162 806786180 806484401 806144714
2247.7 806144714 805589676 804928303 804213524 803242743 802067339 801170051 800832868 800806224 800778568 800666153
2268.1 800666153 800349712 799726367 799063921 798794508 798955798 799297452 799785256 800452709 801033020 801297188
2288.5 801297188 801442385 801695585 801901639 801874042 801737010 801581621 801269710 800752938 800200045 799624562
2308.9 799624562 798775315 797547400 795981765 794080615 792268872 791375160 791536033 791985810 792107940
2327.2 792107940 791905463 791432381 790412605 788717031 786926150 786260843 787450731 789784670 791975975
2345.6 791975975 793298006 793632448 793157220 792249203 791304111 790469706 789865911 789625406 789569616 789497435
2366 789497435 789522648 789730787 789889753 789778650 789518952 789274693 789014101 788738668 788606405 788655877
2386.4 788655877 788680196 788572013 788468897 788340151 787926912 787250340 786641598 786289692 786213338 786507249
2406.8 786507249 787215412 788060427 788631856 788868546 788940191 788805246 788399279 787937105 787616611 787294149
2427.2 787294149 786788106 786233246 785801053 785443544 785148978 785021842 785012364 784897923 784631610 784356534
2447.6 784356534 784011424 783356309 782382369 781390369 780711949 780578315 781060636 781877756 782502651 782677352
2467.9 782677352 782589018 782400608 782020330 781442344 780886590 780447960 779955387 779349506 778809428 778356433
2488.3 778356433 777787149 777081668 776455879 776035488 775801599 775741339 775797486 775842667 775856793 775972843
2508.7 775972843 776185691 776187420 775739729 774943531 773929358 772682667 771383762 770532727 770482242 771062315
2529.1 771062315 771869302 772652030 773205161 773307860 772946656 772236824 771193564 769918799 768844843
2547.5 768844843 768381894 768452287 768718600 769051731 769443572 769759893 769902706 769967020 770011902 769977331
2567.9 769977331 769962192 770194113 770644188 771009803 771124601 771075785 770914793 770577550 770094037 769586146
2588.3 769586146 769050598 768469334 768009901 767772436 767573237 767235041 766783237 766234457 765466928 764383078
2608.7 764383078 762994826 761264920 759115577 756759703 754862487 754121840 754734874 756341934 758369863
2627 758369863 760342538 762009501 763361633 764437377 765147567 765416861 765352070 765101850 764698923
2645.4 764698923 764187157 763704956 763302028 762853920 762256503 761545062 760755002 759842753 758844793 757969797
2665.8 757969797 757366300 756923378 756492376 756104767 755831659 755626261 755428374 755205452 754812658 754094303
2686.2 754094303 753052413 751798153 750379801 748788953 747202992 745966673 745332003 745416343 746240377
2704.5 746240377 747627378 749190867 750552535 751559675 752192676 752471983 752567828 752678216 752828419
2722.9 752828419 752914011 752841949 752625823 752327979 751919270 751353979 750645697 749768436 748723328 747623920
2743.3 747623920 746561646 745505869 744364321 743132830 741926193 740803361 739746630 738819301
2759.6 738819301 738085806 737446308 736758709 736032367 735301852 734497547 733595371 732598245 731381774
2778 731381774 729772687 727714777 725241721 722306848 718818963 714854300 710622728 706291914 702114761
2796.3 702114761 698640883 696521580 696159661 697609723 700649679 704828203 709516227 714163244
2812.6 714163244 718464732 722195745 725146890 727283776 728730619 729503155 729485691 728744209 727530599
2831 727530599 725968301 724061668 721914589 719620943 717103541 714315295 711478591 708855689 706414759
2849.3 706414759 704019427 701798439 700169683 699603438 700380206 702423751 705233753 708091676 710482955
2867.7 710482955 712249041 713410556 714108586 714575410 715002298 715543509 716308773 717245698 718072057
2886.1 718072057 718396604 718052447 717210591 716049016 714527607 712635338 710569680 708491087 706430554
2904.4 706430554 704574287 703145742 701988757 700695217 699057221 697140038 694978893 692566156
2920.7 692566156 690099359 687958598 686654687 686789751 688625097 691619754 694661379 696926177
2937 696926177 698348999 699136555 699323833 698969543 698261201 697248876 695823848 693986595 691834927
2955.4 691834927 689349771 686427593 683124721 679604113 675944090 672312975 669161439 667013943
2971.7 667013943 666116655 666361570 667410731 668760419 669866860 670494676 670806050 670919895 670631349
2990.1 670631349 669738650 668280780 666286945 663786471 661054015 658411801 655880988 653107345
3006.4 653107345 649536788 644603610 637922704 629701972 621061087 613854289 610012591 610705078
3022.7 610705078 615698755 623216331 630540013 635277569 636305392 633656800 628114760 621241689
3039 621241689 615188718 611495554 609843135 608421803 605332196 599384904 590363979 579644442
3055.3 579644442 570731401 567349911 569910049 575608432 581496835 585692286 587342024 586798370
3071.7 586798370 585124791 583377719 582407176 582693338 584165633 586461127 589307547 592548549 596005261
3090 596005261 599415302 602428138 604807854 606766105 608871400 611298680 613296986 613733947 612025619
3108.4 612025619 608525634 604381323 600967526 598803222 597012699 594156623 589104950 581366777
3124.7 581366777 571274936 559861243 548732340 539972067 535579681 536506772 542150617 550748765
3141 550748765 560347795 569457114 577224910 583440125 588121593 591202736 592826903 593410313 593264639
3159.4 593264639 592567563 591413081 589711905 587268591 584005594 580019116 575356483 569976807
3175.7 569976807 563857853 556991458 549362481 540976644 532062411 523246348 515460908 509826303
3192 509826303 507447541 508913577 513844967 520940661 528571188 535255551 539947391 542424202 543234408
3210.3 543234408 543210506 543146789 543514967 544022322 543748915 542000115 538751960 534350455 529157400
3228.7 529157400 523371696 517009437 509993732 502291977 493944585 484956414 475358635 465363711
3245 465363711 455360115 445712566 436648995 428401411 421391457 416268617 413764596 414265871 417472243
3263.4 417472243 422344208 427089661 429827720 429632545 426646203 421364427 414212286 405677110
3279.7 405677110 396404624 387006313 377868772 369350851 362082571 356726378 353646785 352993935
3296 352993935 354852468 359192550 365779281 374238431 384138197 395088226 406700879 418595582
3312.3 418595582 430491477 442142934 453327924 463850081 473621100 482820004 491870314 501107156
3328.6 501107156 510500610 519757092 528594673 536894143 544654369 551893771 558622777 564876735
3345 564876735 570681036 576036572 580967367 585517228 589756608 593706369 597301543 600544274 603493750
3363.3 603493750 606162846 608526230 610526562 612157643 613509715 614643693 615560353 616251588 616713941
3381.7 616713941 617015600 617287219 617654324 618134201 618561327 618818283 619029701 619334161 619607687 619605303
3402.1 619605303 619408309 619326115 619364679 619355738 619273126 619131804 618991137 619000554 619093418 619064152 618995905
3424.5 618995905 619059205 619195461 619283617 619451225 619788110 620022416 620018959 620004416 620142102 620436072
3444.9 620436072 620831728 621199787 621554792 622016549 622573316 623182654 623836935 624506056 625241399 626167953
3465.3 626167953 627174437 627903938 628285527 628678918 629331946 630230248 631178021 631908298 632530391
3483.6 632530391 633271992 634008408 634668410 635413349 636312842 637273073 638191342 639125109 640076816 640785873
3504 640785873 641283333 641970932 642952204 644055843 645080924 645957947 646850824 647901118 649073064
3522.4 649073064 650134087 651010096 651873589 652761757 653710067 654849946 656055808 657179654 658479393
3540.8 658479393 660062790 661559224 662619293 663438141 664371669 665396333 666441262 667595923 668921947
3559.1 668921947 670352399 671757638 673124194 674401999 675404549 676259637 677322924 678704262
3575.4 678704262 680232167 681799948 683449268 685250580 687102854 688634455 689809263 691063643
3591.7 691063643 692523599 694019020 695489049 696892619 698199213 699598551 701197684 702834129
3608.1 702834129 704295754 705591023 706844389 708117068 709347606 710233867 710813701 711595356 712732732
3626.4 712732732 713825762 714312017 714405477 714557767 714889765 715389431 715967357 716667593 717712939
3644.8 717712939 719108939 720159113 719900191 719004214 718575239 718674481 718906224 719145477 719450057
3663.1 719450057 719971836 720788419 721617281 722047329 722195566 722023368 721273124 720502913 720188916 720486403
3683.5 720486403 721466422 722880423 723692775 723329663 722782969 722667813 722883463 723253250 723455489
3701.9 723455489 723310232 723307312 723821700 724405229 724230707 723398328 722726464 722518444 722603738 722633779
3722.3 722633779 722375572 721965849 721800745 722195566 723045409 723694205 723688662 723427832 723400176 723647237
3742.7 723647237 723915935 724069238 724238455 724066198 723245025 722537577 722295105 722078741 721641958 721325219
3763.1 721325219 721277773 721259356 721073210 720617950 720082283 719882250 720097125 720228612 719867110 719364524
3783.5 719364524 719009817 718741477 718559265 718485534 718578637 718846619 719095945 719174027 719026327 718679249
3803.9 718679249 718282878 717786789 717286646 717138708 717392206 717741847 717915177 717815638 717248917 716513455
3824.3 716513455 716100991 715955257 715939283 716119647 716476142 716761291 716664255 716173649 715501785 714830875
3844.6 714830875 714426935 714572728 715171099 715416193 714589119 713556290 712974250 712874591 713061988 713154733
3865 713154733 713083088 712987363 712808073 712442815 711988032 711669862 711537600 711428881 711272776 711001992
3885.4 711001992 710547268 710083127 709589541 709019125 708716154 708845437 709194183 709405959 709193826 708612025
3905.8 708612025 708033860 707717657 707693517 707851112 708003819 707980156 707799315 707621396 707440555 707178235
3926.2 707178235 706935167 706765056 706540465 706203222 705854952 705610514 705435812 705225706 705022633 704916477
3946.6 704916477 704828680 704597116 704227805 703867733 703618824 703458548 703319788 703185916 703076065 703043520
3967 703043520 703069329 703074813 703072429 703066528 703002036 702880859 702750325 702626824 702469528 702258289 702049434
3989.5 702049434 701850235 701642215 701465666 701288640
3997.6 701288640
##END=$$ End of the data block
