##TITLE=$$ Begin of the data block
##JCAMP-DX=5.00 $$ ACD/SpecManager v 10.08
##SPECTROMETER/DATA SYSTEM=Varian
##DATE=30 Apr 2013 15:51:58
##DATA TYPE=INFRARED SPECTRUM
##DATA CLASS=XYDATA
##ORIGIN=
##OWNER=
##NPOINTS=3735
##FIRSTX=399.26403809
##LASTX=4000.35498047
##MAXX=4000.35498047
##MINX=399.26403809
##MAXY=78.15921783
##MINY=16.84371567
##XFACTOR=1.0000000000
##YFACTOR=0.000000100000000
##FIRSTY=45.66819763
##DELTAX=0.96440572
##XUNITS=1/CM
##YUNITS=TRANSMITTANCE
##XYDATA=(X++(Y..Y))
399.3D56681976J37594910Q3096848L0279235K705994P4158O236725P840423L947525
407G28457794O31409J011734K619476K364731P26776J36185R99374J118546j128311
415.7G36937714m354248n500565l053970J584472N620346P154770O066819L394699
423.4G47850037M20532j814804k697296k183380q11234N61523J209031R19113Q3389
432.1G43536911o30112q50830q28705j082000j657181j864624r55963R25369K652740
440.7G39245605L084946K056046L59268j087723j856232j886215j148605K84271J923218
449.4G40974579K922821K625122J036911j193008l122254l860397k921601o43386J716842
458.1G37535629K682724J732331k06986j628723j861954j511535j483689j814956j700440
$$ y = [456681976, 594276886, 677373734, 707652969, 710358963, 710433121, 716669846, 724510269, 728457794, 729089203, 730100937, 732720413, 735085144, 735811920, 735948105, 736947479, 738066025, 736937714, 732583466, 727082901, 724028931, 725613403, 731233749, 738388519, 744455338, 747850037, 748270569, 746455765, 743758469, 741575089, 740763855, 741325378, 742534409, 743453522, 743536911, 742906799, 742055969, 741227264, 740145264, 738488083, 736623459, 735667496, 736592865, 739245605, 742330551, 744386597, 744745865, 743658142, 741801910, 739915695, 738767090, 739051361, 740974579, 743897400, 746522522, 747559433, 746366425, 743244171, 739383774, 736462173, 735818787, 737535629, 740218353, 741950684, 741743698, 740114975, 738253021, 736741486, 735257797, 733442841, 731742401]
466.8G31742401n98144R96551K029877J991730J329040Q06198O67954N46035N0812
475.5G39562454p26471j316223j322327p17163K13166J081161J558304J467056Q50907
484.1G40650864r995p14950r63440p36771k98996O714K3270j11313j24665Q6594L12347
494.7G38119659K03858l74603j167603j696014j609955r19647L9672Q12684J035614
503.4G34443665N87005l59192j415252k198182k539291k516937k300186j989823j622162
512.1G20089645j265945j049042j052093j217728j405487j526489j597748j669693
519.8G09305420j754227j856766k046661k442016l102036l959198m890747n861282
527.5F83392487o996232q542633j0755767j3740006j7199936k0175667k1051292j8127441
$$ y = [731742401, 731144257, 732140808, 734170685, 736162415, 737491455, 738297653, 738965607, 739511642, 739562454, 738835983, 737519760, 736197433, 735480270, 735693436, 736774597, 738332901, 739799957, 740650864, 740640869, 739925919, 738962479, 738225708, 737926712, 737933426, 737956696, 737845383, 737720718, 737807312, 738119659, 738323517, 737948914, 736781311, 735085297, 733475342, 732555695, 732595367, 733408051, 734443665, 735030670, 734671478, 733256226, 731058044, 728518753, 726001816, 723701630, 721711807, 720089645, 718823700, 717774658, 716722565, 715504837, 714099350, 712572861, 710975113, 709305420, 707551193, 705694427, 703647766, 701205750, 698103714, 694144516, 689253769, 683392487, 676396255, 667853622, 657097855, 643357849, 626157913, 605982246, 584930954, 566803513]
535.2E66803513j0661927K74048J1889343K0889588K5105133K4442139K0560455J5661545
543F74963837J1332321Q134918N915527M310074L036957J942596R77555K00729k61688
551.6G10552826l41721j48315N2719J0300l46909r08127j532592k186890k919769l719788
561.3F98511734m458847n023041n499420o183166p403794r418945j2490006j6831359
569F31203156k2045212k6325569k6485901j9591523n432548J2256889K7364731L4935570
576.7F05879593L3977165K7390404J9414062J2931900Q605118N777893L738556K236405
584.4G19951096J302566R57337J094360J454697J658477J380921N98983l66210j107026
593.1G26925201j420364j344604j005249n41840j63651j12381m73556j079407j696243
$$ y = [566803513, 556141586, 556415634, 568304977, 589194565, 614299698, 638741837, 659302292, 674963837, 686296158, 694431076, 700346603, 704656677, 707693634, 709636230, 710613785, 710814514, 710552826, 710211105, 710062790, 710115509, 710125809, 709778900, 708870773, 707338181, 705151291, 702231522, 698511734, 694052887, 689029846, 683530426, 677347260, 669943466, 660524521, 648034515, 631203156, 609157944, 582832375, 556346474, 536754951, 531322403, 543579292, 570944023, 605879593, 639856758, 667247162, 686661224, 699593124, 708198242, 713976135, 717714691, 719951096, 721253662, 722210999, 723305359, 724760056, 726418533, 727799454, 728398437, 728032227, 726925201, 725504837, 724160233, 723154984, 722613144, 722449493, 722337112, 721863556, 720784149, 719087906]
601.8G19087906k256317k804184l264694l453598l394242l446655l956909m895630
609.5F91615677o121979p970505j1128845j5577698j9916343k2408600k2978287k3648567
617.2E61864853k6269226k9723473l0063972k4096070j2873802j277504O019516Q058663
624.9D51638985P320289O773224P872925J1059723J6779785K4724884L2142677L4252892
632.7E92565384K7800255J4738464J991806l237915J279221J1484184K0459824K3349990
640.4F90431213J9843064J3000488O260834J261825k298660n422516q630829j1671142
648.1G02774277j3914032j4710083j3404389r391174k647171N579605J2850266J6804809
655.8F83942108J6728897J3956757J0663452Q198090O519928N010147L477020K226944
$$ y = [719087906, 716831589, 714027405, 710762711, 707309113, 703914871, 700468216, 696511307, 691615677, 685493698, 677523193, 666394348, 650816650, 630900307, 608491707, 585513420, 561864853, 535595627, 505872154, 475808182, 451712112, 438838310, 437560806, 443580322, 451638985, 458959274, 465732498, 473605423, 484665146, 501444931, 526169815, 558312492, 592565384, 620365639, 635104103, 637095909, 633857994, 635137215, 646621399, 667081223, 690431213, 710274277, 723274765, 729535599, 730797424, 728498764, 723076248, 714445419, 702774277, 688860245, 674150162, 660745773, 651354599, 648707428, 654287033, 667137299, 683942108, 700671005, 714627762, 725291214, 733489304, 740009232, 745019379, 748496399, 750723343]
663.5G50723343J389542N76858o30798k058182l039627l183136k852631k783966l284302
672.2G34857101l915023l937149k997513j398392J59683J025391R25980N6686j084137
680.9G23692627k083588k963257m145507o025467q644867j1921311j6110382k1624908
688.6F50173340k7896042l2357826l1116486k1548805m921265J3460999K7175636L2529411
696.3F05498962L0322991K4393501J8551025J4497757J1939621R980393Q194809O672134
704G30051193N542603M716339L995361L239823K384796J414947M15802m14963r23233
712.7G50422668j200408j557236k219620l052292l622665l569489k901993j974182
720.4G30324783j235962j041183j616135l038940n140610p501755r755325j2005005
$$ y = [750723343, 752112885, 752689743, 752058945, 750000763, 746961136, 743778000, 740925369, 738141403, 734857101, 730942078, 727004929, 724007416, 722609024, 722768707, 723794098, 724720078, 724776764, 723692627, 721609039, 718645782, 714500275, 708474808, 699829941, 687908630, 671798248, 650173340, 622277298, 589919472, 558802986, 537254181, 532332916, 545793915, 572969551, 605498962, 635821953, 660215454, 678766479, 693264236, 705203857, 715184250, 723379059, 730051193, 735593796, 740310135, 744305496, 747545319, 749930115, 751345062, 751760864, 751345901, 750422668, 749222260, 747665024, 745445404, 742393112, 738770447, 735200958, 732298965, 730324783, 729088821, 728047638, 726431503, 723392563, 718251953, 710750198, 700994873, 688989868]
728.1F88989868j4802704j8357849k1512070k1646652j6152305m650727R910622K2535286
735.8F24313469K9111061K8759308K3813171J7695542J2653579R064560O330948M043579
743.6G55785217K306671J302414Q97599P44323O03409M54636L37906K23083N3101j70746
753.2G62537613m12064o72836r76257j276703j450882j409683j200409r87397r48486
761.9G53202896j200027j768113k572326l441239m230575m979553n923386p326050
769.6G21761627r367142j2274398j6465378k2189560k8627396l3277778l2683907k4508743
777.3E42367325r541016Q122559K3127060L1698112L3236275K9777527K4166946J8506317
785G01461105J3734284J0045166P379989N586930M406891L534164K756195K006302
$$ y = [688989868, 674187164, 655829315, 634317245, 612670593, 596518288, 591867561, 601778183, 624313469, 653424530, 682183838, 705997009, 723692551, 736346130, 745410690, 751741638, 755785217, 758091888, 759394302, 760291901, 761036224, 761639633, 762094269, 762432175, 762655258, 762708359, 762537613, 762125549, 761452713, 760476456, 759199753, 757748871, 756339188, 755138779, 754151382, 753202896, 752002869, 750234756, 747662430, 744221191, 739990616, 735011063, 729087677, 721761627, 712394485, 700120087, 683654709, 661465149, 632837753, 599559975, 566876068, 542367325, 532826309, 540948868, 564075928, 595774040, 629010315, 658787842, 682954788, 701461105, 715195389, 725240555, 732620544, 738207474, 742614365, 746148529, 748904724, 750911026]
792.7G50911026J280136N46570k31781j033173j777496k395706k847672l045578k808685
801.4G38597641j976929o25229Q56629J945190K287369J865234R24530k02331j209107
810.1G42462997j873169k127838k121276k127915k327423k688522l167878m023132
817.8G22005844n775528q619919j1749344j3392105j1856842o932525n06592M245605
825.5F67418594M657364J24512p627640j5698700k1693077k4701385k4951287k2619514
833.3E54908867j7065086p399025N993232K0451241L1815262L6685333L4463615K7537766
841F87391205J9546661J3202133R276886P113037N756302M660492L681107K793198
848.7G53421021J965789J210709O01349J96686k0752j14823j27945q2092j5717M120
$$ y = [750911026, 752191162, 752737732, 752505951, 751472778, 749695282, 747299576, 744451904, 741406326, 738597641, 736620712, 735995483, 736852112, 738797302, 741084671, 742949905, 743874435, 743672104, 742462997, 740589828, 738461990, 736340714, 734212799, 731885376, 729196854, 726028976, 722005844, 716230316, 707610397, 695861053, 682468948, 670612106, 663679581, 663172989, 667418594, 672075958, 672200470, 664572830, 648874130, 627181053, 602479668, 577528381, 554908867, 537843781, 530444756, 536437988, 556889229, 588704491, 625389824, 659853439, 687391205, 706937866, 720139999, 729416885, 736529922, 742286224, 746946716, 750627823, 753421021, 755386810, 756597519, 757198868, 757395554, 757374802, 757259979, 757132034, 757049942, 757034225, 757038345]
858.3G57038345q0719k82364n68237q82873j181870j466522j799317k232589k673187
867G45870667k816926k313919j086883M83703J736527K162170J721344P93686j47705
875.7G46402664q21762j189041j345062j419831j543579j821289k285385k874908l492203
884.4G29609604m084931m681549n352401o150055p079850q117370r268646j0632935
892.1F74241867j2348251j4323426j5866050j5592881j2004203m564820N463219J5261002
899.8F20266457K1828727K3599854K1138000J6477356J1739502Q090897N624924L924560
907.5G32690277K637405J641007Q89206K66647l71399j067886j733017k269440k704849
916.2G29977951l186569l847351m711228n748443o959992q279495r307480r219513
$$ y = [757038345, 756957626, 756675262, 756107025, 755224152, 754042282, 752575760, 750776443, 748543854, 745870667, 743053741, 740739822, 739652939, 740136642, 741873169, 744035339, 745756683, 746550369, 746402664, 745580902, 744391861, 743046799, 741626968, 740083389, 738262100, 735976715, 733101807, 729609604, 725524673, 720843124, 715490723, 709340668, 702260818, 694143448, 684874802, 674241867, 661893616, 647570190, 631704140, 616111259, 604107056, 599542236, 605005455, 620266457, 642095184, 665695038, 686833038, 703310394, 715049896, 723140793, 728765717, 732690277, 735327682, 736968689, 737857895, 738124542, 737753143, 736685257, 734952240, 732682800, 729977951, 726791382, 722944031, 718232803, 712484360, 705524368, 697244873, 687937393, 678717880]
923.9F78717880p201156l226395J499557N032578N914383M185791J341629p22351r03320
932.6F84638596O32171K836228M534759N008698M190368K549744P85980n42145j261215
941.3G03373184j548767j710434k006302k640381l746795n192642o364747o333465
949F73829651m497833j228867K143173M123841M008407K227326j31150k134704l503037
957.7F74836807m511490n538177o699982p878341r083176j0739136j3423195j7057228
965.4E99906082k0281143k0943298j7782822j2025414p169380o570854j0543594j5525856
973.1D89063721j6340332r919854K432595J5926552K5391998K8145676K4786758J7975502
980.8E77462616J0564003M353065j24664l109932m917946n498123m526596j945724
$$ y = [678717880, 671516724, 668290329, 669789886, 674822464, 680736847, 684922638, 686264267, 685541916, 684638596, 685270767, 688106995, 692641754, 697650452, 701840820, 704390564, 705176544, 704634399, 703373184, 701824417, 700113983, 698107681, 695467300, 691720505, 686527863, 680163116, 673829651, 669331818, 668102951, 670246124, 674369965, 678378372, 680605698, 680474548, 678339844, 674836807, 670325317, 664787140, 658087158, 650208817, 641125641, 630386505, 616963310, 599906082, 579624939, 558681641, 540898819, 528873405, 521704025, 515133171, 504589577, 489063721, 472723389, 462803535, 465236130, 481162682, 506554680, 534700356, 559487114, 577462616, 588026619, 592379684, 592255020, 589145088, 584227142, 578729019, 574202423, 572256699]
988.5E72256699J566658M763298O574211O708526N481568L139496l69835m739304q559456
997.2E86821861r708290o983642j517868L620224N551300L596954n85022m660339p377549
1005.9E68757629q961029j0270157j1895675j3974419j6455574j9197960k1798210
1012.6D66204605k3498230k3354759k0469933j4168243m335136P974586K0176582K8806343
1020.3D37335815L1184349K6977730J8345566Q499413j37635o791114j1880875j6028442
1028.1D87504807j9422684k1785774k2631188k1546173j8474312j3956070r099083
1034.8C60589523n140648k844696k198753k633171l495598m355240m986191n230102
1042.5C29705124m972267m211808l065109j651993j068J883717L852978N531425O449928
$$ y = [572256699, 573823357, 578586655, 585160866, 591869392, 597350960, 600490456, 600120621, 595381317, 586821861, 577113571, 570129929, 568612061, 572232285, 577783585, 581380539, 580795517, 576135178, 568757629, 559796600, 549526443, 537630768, 523656349, 507200775, 488002815, 466204605, 442706375, 419351616, 398881683, 384713440, 380378304, 388352890, 408529472, 437335815, 468520164, 495497894, 513843460, 522342873, 522205238, 515414124, 503533249, 487504807, 468082123, 446296349, 423665161, 402118988, 383644676, 369688606, 360589523, 355448875, 352604179, 350405426, 347772255, 344276657, 339921417, 334935226, 329705124, 324732857, 320521049, 317455940, 315803947, 315802879, 317686596, 321539574, 327070999, 333520927]
1051.2C33520927O316796N232620L700676K425270K012253K723045M400368O587028
1058.9C66918983Q749619J0465698J1492844J1738548J1219483J0055580Q473282O747360
1066.6D45861397N087967L551025K060127N35202r72175k266312l136825l534584l642006
1075.3D43543816l774071m187698m945260n923233o928672p810479q506927r036560
1083C92430916r469452r888306j0327987j0732804j0985679j1003724j0809574j0492344
1090.7C08721046j0101032r593773q912944q093186p277279o614170o164093n903015
1098.5B46061554n784111n758877n750503n659104n440731n149746m849605m457264
1106.2B03211613l724823k447415p33947R31873J934814J891632Q53615p75032k502937
$$ y = [333520927, 339837723, 345070343, 348771019, 351196289, 353208542, 355931587, 360331955, 366918983, 375668602, 386134300, 397627144, 409365692, 420585175, 430640755, 439114037, 445861397, 450949364, 454500389, 456560516, 457095718, 456123543, 453857231, 450720406, 447185822, 443543816, 439769745, 435582047, 430636787, 424713554, 417784882, 409974403, 401467476, 392430916, 382961464, 373073158, 362745171, 352012367, 341026688, 330022964, 319213390, 308721046, 298620014, 289026241, 280113297, 272020111, 264742832, 258128662, 251964569, 246061554, 240277443, 234518566, 228768063, 223108959, 217668228, 212518482, 207668877, 203211613, 199486790, 197039375, 196305428, 197237301, 199172115, 201063747, 201917362, 201142330, 198639393]
1114.9A98639393l995800n136604n881997o056537n308590l367901m54807K540722
1122.6A70977879M401435M301625K368736l74737k641163l584766l087635j535015
1130.3A70826359O13022L105831N906048R017715J2320652J5538845J8359051K0590496
1138B56278019K2223053K3324242K3880672K3767166K2889252K1350365J9456443J7550316
1145.7D30719528J5850105J4439660J3364868J2678680J2374535J2310600J2249260
1152.5E23987236J1995811J1508637J0883064J0233345R577942Q819847P838211O641541
1160.2F01485634N464668M693451M615555N168953N923767O356888O208496N613060
1167.9F45530472M906311M314728L813705L232880K445678J440812K69546j021194
$$ y = [198639393, 194643593, 189506989, 183624992, 177568455, 172259865, 168891964, 168437157, 170977879, 175379314, 179680939, 182049675, 181674938, 179033775, 175449009, 172361374, 170826359, 171439381, 174545212, 180451260, 189468975, 201789627, 217328472, 235687523, 256278019, 278501072, 301825314, 325705986, 349473152, 372362404, 393712769, 413169212, 430719528, 446569633, 461009293, 474374161, 487052841, 499427376, 511737976, 523987236, 535983047, 547491684, 558374748, 568608093, 578186035, 587005882, 594844093, 601485634, 606950302, 611643753, 616259308, 621428261, 627352028, 633708916, 639917412, 645530472, 650436783, 654751511, 658565216, 661798096, 664243774, 665684586, 665954132, 664932938]
1175.6F64932938k394028l828583n366516p108841r041176j0750961j1342506r801522
1183.3F05298805n691910L39432O722336J1755791J4459724J4876442J3698883J1664810
1191F73124313R251099O784286M655610L284301K839051L045272L329697L203812K548446
1199.7G12065887J572800N49011m12826j380081k474137l770599n292740p018890q837281
1208.4F85001144j0484619j1594772j1903992j1490478j0835343j0594177j1187591
1215.1F06910172j2466202j3681565j3799285j1989785q037300k461395L698082R307403
1222.9E57480125J3548050J6109162J7121086J6944198J5977288J4575386J3035202
1229.6F64790497J1582641J0346604R353180Q553543P855759P138977O274719N190582
$$ y = [664932938, 662538910, 658710327, 653343811, 646234970, 637193794, 626442833, 615100327, 605298805, 599606895, 599946327, 606668663, 618424454, 632884178, 647760620, 661459503, 673124313, 682375412, 689159698, 693815308, 697099609, 699938660, 702983932, 706313629, 709517441, 712065887, 713638687, 714187698, 713774872, 712394791, 709920654, 706150055, 700857315, 693838425, 685001144, 674516525, 662921753, 651017761, 639527283, 628691940, 618097763, 606910172, 594443970, 580762405, 566963120, 554973335, 546936035, 544474640, 548172722, 557480125, 571028175, 587137337, 604258423, 621202621, 637179909, 651755295, 664790497, 676373138, 686719742, 696072922, 704626465, 712482224, 719621201, 725895920, 731086502]
1237.3G31086502L950501K760467J867600J410217J352386J537705J789779J973191
1245G47728348J990051J781998J363144Q48999M16336K04162K35138M17557O22864
1253.7G55608597P59201P96966P43943O13784M17328J70975r5520l48206n65795p46003
1263.4G57355270q96072j023941j142044j278305j470108j735382k056961k386475
1271.1G45365982k668610k849731k883377k769699k610626k603989k933197l637238
1278.8G22409515m608383n727157o966782q329391r735337j1092987j2526321j4349289
1286.5F49073868j6515618j7932586j6546211j0622139m24881J1228675K0326538K4052201
1294.2F42639847K2333374J7424240J2088089P980575N302353L491135K001190N68772
$$ y = [731086502, 735037003, 737797470, 739665070, 741075287, 742427673, 743965378, 745755157, 747728348, 749718399, 751500397, 752863541, 753712540, 754128876, 754333038, 754568176, 754985733, 755608597, 756367798, 757164764, 757908707, 758522491, 758939819, 759110794, 759015274, 758667068, 758101273, 757355270, 756459198, 755435257, 754293213, 753014908, 751544800, 749809418, 747752457, 745365982, 742697372, 739847641, 736964264, 734194565, 731583939, 728979950, 726046753, 722409515, 717801132, 712073975, 705107193, 696777802, 687042465, 675949478, 663423157, 649073868, 632558250, 614625664, 598079453, 587457314, 587032433, 598261108, 618587646, 642639847, 664973221, 682397461, 694485550, 702466125, 707768478, 711259613, 713260803, 713829575]
1301.9G13829575q99125k430877l967514n360413o463928p234039p735138q103104
1309.7F71635437q509903r039535r441681q975983o691017k159882L862343R517593
1317.4F40197372J2771759J2535248R145127L946380j545105o233825r556809j1364746
1325.1F49895401j1873589j1673545j1596108j2370376j4263192j6923484j9471665
1331.8E51723442k0710182j9402351j4671021o502647L906555J4335670K2358132K6400833
1339.6E57438431K6389694K3569221J9669457J6024857J3186416J1109696R581451
1346.3F76969223Q479462P746582P248764O748581O037216N080719M026108L073272
1354G25409927K339859J828690J478271J216126R76028P13654M45862K66723K86942
$$ y = [713829575, 712930450, 710499573, 706532059, 701171646, 694707718, 687473679, 679738541, 671635437, 663125534, 654085999, 644644318, 635668335, 628977318, 626817436, 630679779, 640197372, 652969131, 665504379, 674649506, 678595886, 677050781, 670816956, 661260147, 649895401, 638021812, 626348267, 614752159, 602381783, 588118591, 571195107, 551723442, 531013260, 511610909, 496939888, 490437241, 494343796, 508679466, 531037598, 557438431, 583828125, 607397346, 627066803, 643091660, 656278076, 667387772, 676969223, 685448685, 693195267, 700444031, 707192612, 713229828, 718310547, 722336655, 725409927, 727749786, 729578476, 731056747, 732272873, 733248901, 733962555, 734408417, 734675140, 734962082]
1362.7G34962082N18875Q24966J000672R30710O68106L68805J50528K0828p2556j48849
1372.3G39224167j61438m9286J90964M78744O88553P09686M99649J02845l70713q01849
1382G40511322j119461j321411j444321j517563j539001j502609j448212j487732j762772
1390.7G27368240k336959l092881l735962l956146l647919k994461k316055j812591
1398.4G03475266j460801j183471j097565j530914k737427m573517o466751p702942
1406.1F76721878p757187o409225l698349Q2092M307022Q061981J0459595J1064072
1413.8F92831879J0090408Q213043O180268M528350L488083K992478K732925K317734
1421.5G33375168J524963M57154n84412j398392k037735k663269l296966l774796l923721
$$ y = [734962082, 735480957, 736305923, 737306595, 738237305, 738905411, 739274216, 739424744, 739445572, 739373016, 739224167, 739062729, 739013443, 739204407, 739683151, 740371704, 741081390, 741581039, 741683884, 741313171, 740511322, 739391861, 738070450, 736626129, 735108566, 733569565, 732066956, 730618744, 729131012, 727368240, 725031281, 721938400, 718202438, 714246292, 710598373, 707603912, 705287857, 703475266, 702014465, 700830994, 699733429, 698202515, 695465088, 690891571, 684424820, 676721878, 668964691, 662555466, 658857117, 658939209, 663246231, 671308212, 681767807, 692831879, 702922287, 711135330, 717315598, 721843948, 725332031, 728324509, 731057434, 733375168, 734900131, 735357285, 734772873, 733374481, 731336746, 728673477, 725376511, 721601715, 717677994]
1430.2G17677994l728638l327026k928696k776489l078614l821258m664307n197372
1437.9F88155594n432053n918274p170486r006729j0785370j2505951j5374718k0592994
1445.6F01369019k7153359l1150627k8149872j7023697j660461J1430168J7708855
1452.4E25370026J7388382J4226722J1943016J1681824J2294464J2290154J1200523
1459.1F16395111R437180P461815N391159L209419J029663r52225k634239m054070
1466.8F35283813n324821o587524p953568r363098j0492134j0920372j0499916r516411
1474.6E64625969q374634p092323n167809k031746K347641P287407J1782646J5065995
1482.3E78443146J6874885J7340355J6729584J5291748J3261948J0946426Q765717
$$ y = [717677994, 713949356, 710622330, 707693634, 704917145, 701838531, 698017273, 693352966, 688155594, 682723541, 676805267, 669634781, 660628052, 649842682, 637336731, 621962013, 601369019, 574215660, 543065033, 514915161, 497891464, 496231003, 507661171, 525370026, 542758408, 556985130, 568928146, 580609970, 592904434, 605194588, 616395111, 625832291, 633294106, 638685265, 641894684, 642924347, 641972122, 639337883, 635283813, 629958992, 623371468, 615417900, 606054802, 595562668, 584642296, 574142380, 564625969, 556251335, 549159012, 543991203, 541959457, 544307098, 551594505, 563377151, 578443146, 595318031, 612658386, 629387970, 644679718, 657941666, 668888092, 677653809]
1489F77653809P160339O350784O142426O005859N467529M470749L329926K311325J325912
1497.7G20218658J11390j336441k680817l727188m887772o932297j0114822j3626709
1505.4F77024002j6137924j7000504j6847229j6825332j7145081j6431312j2646332
1512.2E63990288m850998N708732J6058312K3086090K5100517K2448502J7033768J1198043
1519.9F79773254O634064L872604K525940J967698J871566K239457L069686M119568
1527.6G06073837M997788N406265N255661M623566L715362K840042K257614J925431
1535.3G37095566J454620M83170q36258j830826j908951j170883l38974o3400l66898
1544G32517166p95212r82208r39636q39310p19833n30091l35845k89155l87649m65164
$$ y = [677653809, 684814148, 691164932, 697307358, 703313217, 708780746, 713251495, 716581421, 718892746, 720218658, 720330048, 718993607, 716312790, 712585602, 707697830, 700765533, 690650711, 677024002, 660886078, 643885574, 627038345, 610213013, 593067932, 576636620, 563990288, 559139290, 564848022, 580906334, 603992424, 629092941, 651541443, 668575211, 679773254, 686407318, 690279922, 692805862, 694773560, 696645126, 698884583, 701954269, 706073837, 711071625, 716477890, 721733551, 726357117, 730072479, 732912521, 735170135, 737095566, 738550186, 739033356, 738197098, 736366272, 734457321, 733286438, 732947464, 732884064, 732517166, 731721954, 730739746, 729800110, 728960800, 728240967, 727710876, 727375031, 727085876, 726698227, 726233063]
1553.6G26233063n50461j071396k413330m193344n215454m454956k167893J38550R92966
1562.3G07297745K20489j108703j898575k058716k322693l233185m500961n350113
1570F87045288n368805m979172n210952p072602j0876846j5703659j9282875j8766098
1577.7E99784279j2421494j275291J0783119J8984032K0501251J5967331Q555679J557236
1585.5F62436142l489609o881103r524918j1829109j3545914j4258346j3748131j1947708
1593.2E77211304q812599m477273M18320M663849O911087O356659L181038j564941
1600.9E83887444o510964j0551262j3127022j4163208j3895263j2791405j1521988
1607.6E01326332j0772934j0865250j1469955j1768646j1027374r109841o464920l616905
$$ y = [726233063, 725682602, 724611206, 722197876, 718004532, 712789078, 708334122, 706166229, 706304779, 707297745, 707518234, 706409531, 704510956, 702452240, 700129547, 696896362, 692395401, 687045288, 681676483, 676697311, 671486359, 664413757, 653536911, 637833252, 618550377, 599784279, 587362785, 586087494, 596870613, 615854645, 636355896, 652323227, 660878906, 662436142, 658946533, 652065430, 642540512, 630711403, 617165489, 602907143, 589159012, 577211304, 568398705, 563921432, 564339752, 569003601, 575914688, 582271347, 585452385, 583887444, 577376480, 566825218, 553698196, 539534988, 525639725, 512848320, 501326332, 490553398, 479688148, 468218193, 456449547, 445422173, 436312332, 429847412, 426230507]
1615.4D26230507o73370K719039O993866J2231064J7959557K3230896K6892967K8021317
1623.1E43605843K6397590K2725601J8323212J4410782J1518021R449539P734527O078339
1630.8F60243454M462280K971039J664581O06461r4452l78494l81623m27551q21075
1639.5F67844620j618500k605515l521194m318619n183716o222076p102432p126389
1647.2F30146179n895881m056702l258858n024566r363709j4505501j8216171j9591675
1654.9E50233116j9604874j9850578k0745735k0964241j8612671j2938080n012169
1661.6D32504768L011933R203109J2698403J3799896J3616791J3515434J4473610J6572151
1669.4E29396095J9024353K0823326K1486092K1211777K0383491J9049530J6982041
$$ y = [426230507, 425557137, 428276176, 435270042, 447501106, 465460663, 488691559, 515584526, 543605843, 570003433, 592729034, 611052246, 625463028, 636981049, 646430588, 654165115, 660243454, 664705734, 667676773, 669341354, 669947815, 669853363, 669474869, 669093246, 668665695, 667844620, 666226120, 663620605, 660099411, 655780792, 650597076, 644375000, 637272568, 630146179, 624250298, 620193596, 616934738, 611910172, 602546463, 588040962, 569824791, 550233116, 530628242, 510777664, 490031929, 469067688, 450455017, 437516937, 432504768, 435516701, 444719810, 457418213, 471218109, 484834900, 498350334, 512823944, 529396095, 548420448, 569243774, 590729866, 611941643, 632325134, 651374664, 668356705]
1676.1F68356705J4182281J1153794Q575668O741485N410691M223709L188324K675781
1683.8G24508438K947693L748627M421768M444656L854828L147888K772980K730713
1691.5G52577591K662277K303162J792068J495285J543579J628647J328507O15844
1699.3G65946960k8457p3242N15365J230088J517333J279755Q65479O34536O10733
1707.9G72498550N53971K93884q5754l62397m01764k47116l4484J34429K48414L62014
1717.6G72959747N25589P10755P94906O63758L64914J28402J75247M81186P78809Q23593
1727.2G78406906O30951L97034K08587o9885n57327j061173j145553n63431M18167
1735.9G76664276J197968J353073R62524M33731Q2932p3548j73797k76184l09906k12403
$$ y = [668356705, 682538986, 693692780, 702268448, 709009933, 714420624, 718644333, 721832657, 724508438, 727456131, 731204758, 735626526, 740071182, 743926010, 747073898, 749846878, 752577591, 755239868, 757543030, 759335098, 760830383, 762373962, 764002609, 765331116, 765946960, 765918503, 765845261, 766360626, 767590714, 769108047, 770387802, 771253281, 771887817, 772498550, 773052521, 773346405, 773260651, 772898254, 772496490, 772249374, 772214890, 772349319, 772597733, 772959747, 773485336, 774196091, 774990997, 775654755, 776019669, 776148071, 776323318, 776804504, 777583313, 778406906, 779037857, 779434891, 779643478, 779573593, 779016266, 777955093, 776809540, 776246109, 776664276, 777862244, 779215317, 780177841, 780611572, 780694504, 780620956, 780447159, 780170975, 779861069, 779648666]
1745.5G79648666l0517J31683K20184K62070L07770L64304L79867K76108J7776l15094
1755.2G81262817n24749m26255l5247L86886N37110L48205M3411j08871p9346o8054
1764.8G81335907k30408m69589n49850l83912j38855l7460j08948j82647j18637J9149
1774.5G79134750M3106j37405m12064n76248n09872k54364L8376K02560J35193j49307
1784.1G77514725n10483p56760p86361o60935n24521m30526k69394J04828O73217J201096
1793.8G75554886J404953J174545O43234O8818l34855m71038l39737p325L92456O85502
1803.4G78771439P37075N31998J75476j93024m80575o46668o62994n07507k05612J40380
1813G77659988L89176M39529K78015l1662l83834o59180p60422o60858m19998j34049
$$ y = [779648666, 779618149, 779749832, 779970016, 780232086, 780539856, 780904160, 781284027, 781560135, 781577911, 781262817, 780738068, 780311813, 780276566, 780663452, 781200562, 781548767, 781592178, 781483307, 781403961, 781335907, 781105499, 780635910, 780086060, 779702148, 779563293, 779525833, 779416885, 779234238, 779115601, 779134750, 779177856, 779040451, 778628387, 778052139, 777542267, 777287903, 777326279, 777528839, 777664032, 777514725, 777004242, 776247482, 775461121, 774800186, 774275665, 773845139, 773575745, 773680573, 774353790, 775554886, 776959839, 778134384, 778777618, 778846436, 778511581, 778040543, 777700806, 777693481, 778085937, 778771439, 779508514, 780040512, 780215988, 780022964, 779542389, 778895721, 778232727, 777725220, 777519608, 777659988, 778049164, 778488693, 778766708, 778735046, 778351212, 777692032, 776931610, 776270752, 775850754, 775716705]
1822.7G75716705J42823M11682O46667P32422N37033P8659m10766o38276m94766j38244
1832.3G76583939J67999K92129K98615L11813L59955L64456K43683q240l31955o43844
1842G77638550q41522q15659n14069k0217M59899P25327P10602M98810K22778k2278
1851.6G78042221j83868k21176j11313J12304L56903N26734N77621N13535L46298Q9722
1861.3G80048981k07596m49524n50842n06516l91083k77938j67084r308K02179L84979
1870.9G78076248M20456K59857k4566k89460m17022l74756k04697J9226K19498L24936
1880.6G78009720K84881J00708j57775l85590n08041n21317m66537l70255k22397k1210
1890.2G75742187J69983K35062R6817k01645n13153o91681o91757n72586m20380k80533
$$ y = [775716705, 775859528, 776271210, 776917877, 777650299, 778187332, 778265991, 777855225, 777216949, 776722183, 776583939, 776751938, 777044067, 777342682, 777654495, 778014450, 778378906, 778622589, 778614349, 778282394, 777638550, 776797028, 775981369, 775467300, 775447083, 775906982, 776632309, 777342911, 777841721, 778064499, 778042221, 777858353, 777637177, 777525864, 777638168, 777995071, 778521805, 779099426, 779612961, 779959259, 780048981, 779841385, 779391861, 778841019, 778334503, 777943420, 777665482, 777498398, 777489090, 777691269, 778076248, 778496704, 778756561, 778731995, 778442535, 778025513, 777650757, 777446060, 777465286, 777684784, 778009720, 778294601, 778395309, 778237534, 777851944, 777343903, 776822586, 776356049, 775985794, 775763397, 775742187, 775912170, 776147232, 776244049, 776042404, 775529251, 774837570, 774145813, 773573227, 773152847, 772872314]
1899.8G72872314j59530o8131n0049j56097m00772p38144j080093j338578j462631
1908.5G67418289j456222j367264j251526j149597j077423j028672r67636q18252m88053
1917.2G57813644N8899P29523J320648J643143J657333J480484J264420J059036Q06809
1925.9G67833939M56009N9509k56043m00238l84598k86636j66702m4861O2943J20315
1935.5G66993637R7962P247j08184k18964l17078l83529l65067k20795O485J90812
1945.2G65682526K15988P6446j25427k74506l33557l38058l23181k80762j87683n9281
1954.8G64052505M5395O4698k0066j82342l75443n53589o77261p19299o75125n66559
1964.5G60392914m26254k80228j48773o3935p0877k00424m30527o82525q56781q87986
$$ y = [772872314, 772712784, 772644653, 772594604, 772438507, 772037735, 771299591, 770219498, 768880920, 767418289, 765962067, 764594803, 763343277, 762193680, 761116257, 760087585, 759119949, 758301697, 757813644, 757872543, 758602066, 759922714, 761565857, 763223190, 764703674, 765968094, 767027130, 767833939, 768289948, 768349457, 768093414, 767693176, 767308578, 767021942, 766855240, 766810379, 766873322, 766993637, 767091599, 767098846, 766990662, 766771698, 766454620, 766071091, 765706024, 765485229, 765491714, 765682526, 765898514, 765974960, 765849533, 765575027, 765241470, 764903412, 764580231, 764299469, 764111786, 764052505, 764097900, 764162598, 764142532, 763960190, 763584747, 763031158, 762353897, 761634598, 760959473, 760392914, 759966660, 759686432, 759537659, 759473724, 759402847, 759202423, 758771896, 758089371, 757232590, 756344604]
1974.1G56344604p65609n16892j79596K03553N75180Q58993R89456R44367P59048N12009
1983.7G59725113K93121J72119J73722K60315L40652L19748J62048p7743k95563m21295
1993.4G60652237m56925m47921m14353l28369j56174Q2245L08304M35562M24424K90756
2003G60389786Q1863j46255l35236m33655m22516l34014k33384j77841j85242k44369
2012.7G57959137l39356m58297n77698o55212o51551n63583m31061l06625k23770j88675
2022.3G53563309j99662k61993l75366n12238o15005o25076n15671l04642l7613K37503
2032G50353546M81262O58188P37915P01676N58166L47443J28174l9826j14898q5068
2041.6G53726578K4032J56861K50168K62985J94855Q1939k8991r8725j00632k3956
$$ y = [756344604, 755578995, 755062103, 754882507, 755086060, 755661240, 756520233, 757509689, 758454056, 759213104, 759725113, 760018234, 760190353, 760364075, 760624390, 760965042, 761284790, 761446838, 761369095, 761073532, 760652237, 760195312, 759747391, 759333038, 759004669, 758848495, 758930740, 759239044, 759674606, 760099030, 760389786, 760471649, 760325394, 759990158, 759556503, 759133987, 758799973, 758566589, 758388748, 758203506, 757959137, 757619781, 757161484, 756583786, 755928574, 755277023, 754713440, 754282379, 753975754, 753751984, 753563309, 753363647, 753101654, 752726288, 752214050, 751599045, 750973969, 750458298, 750153656, 750116043, 750353546, 750834808, 751492996, 752230911, 752932587, 753490753, 753838196, 753966370, 753926544, 753811646, 753726578, 753750610, 753907471, 754157639, 754420624, 754615479, 754697418, 754668427, 754569702, 754469070, 754445114]
2051.2G54445114J23215L08456M81568N96771O29043N79529M65470L15628J67694O4926
2060.9G58177414L7994R1172K03170L44620M88739O03333O41250N58167L52783Q9340
2070.5G61587982j27792k19116j75858n1117R1095K15607L11508L63312L37982K10419
2080.2G62544022o11k22549l66745l80936k78473j19247L4332J49689K21786K45819
2089.8G61827087K03705Q0033j05591k87094l82004l43247j89209O791J65176K38495
2099.5G61214142K21557J34125L052j42670k67410l33176l13720k14386p4540N1270
2109.1G60278244J18637J10855M0055o3782j64566k29874k39487j92566j02386R613
2118.7G59564743J22833K13089K51084K11334R2392o8207k13089k98233l15475k80838
$$ y = [754445114, 754568329, 754876785, 755358353, 755955124, 756584167, 757163696, 757629166, 757944794, 758112488, 758177414, 758215408, 758306580, 758509750, 758854370, 759343109, 759946442, 760587692, 761145859, 761498642, 761587982, 761460190, 761241074, 761065216, 761014099, 761105194, 761320801, 761632309, 761995621, 762333603, 762544022, 762543411, 762320862, 761954117, 761573181, 761294708, 761175461, 761209793, 761359482, 761581268, 761827087, 762030792, 762110825, 762005234, 761718140, 761336136, 760992889, 760803680, 760810471, 760975647, 761214142, 761435699, 761569824, 761572876, 761430206, 761162796, 760829620, 760515900, 760301514, 760226974, 760278244, 760396881, 760507736, 760547791, 760484009, 760319443, 760089569, 759850082, 759657516, 759555130, 759564743, 759687576, 759900665, 760151749, 760363083, 760455475, 760387268, 760174179, 759875946, 759560471, 759279633]
2128.4G59279633k07673r8190L5019J50986J95923J42135J2741j36718k55585l19824
2138G58798447l20893k54287j26419K3040J28098J34659M4403q5831j89362k40631
2147.7G57911224k59552k72216k69928k17514r6970N6763J69372J81580R0027n5466
2157.3G57237320j90125k70309k78168k15988j00937L0976J35040J76925J47629O0654
2167G56733017o4392k03858l17306l54614k88468j49002j0910O2103O3782L4027M349
2177.6G55508728l4409j09252k13013k93732k95257k07825p6065M3640J20163J51367
2187.2G54594345J42670R1934m196j31684k54364l25317l08456j98517l0518J32370
2196.9G53708267K26517K19574J21612k8610j85318l06854l58047l18985k03705o6147
$$ y = [759279633, 759071960, 758973770, 759008789, 759159775, 759355698, 759497833, 759510574, 759373856, 759118271, 758798447, 758477554, 758223267, 758096848, 758119888, 758247986, 758382645, 758427048, 758341217, 758151855, 757911224, 757651672, 757379456, 757109528, 756892014, 756795044, 756851807, 757021179, 757202759, 757292786, 757237320, 757047195, 756776886, 756498718, 756282730, 756181793, 756212769, 756347809, 756524734, 756672363, 756733017, 756668625, 756464767, 756147461, 755792847, 755504379, 755355377, 755344467, 755406570, 755470352, 755504379, 755508728, 755474319, 755365067, 755152054, 754858322, 754563065, 754355240, 754279175, 754322815, 754442978, 754594345, 754737015, 754828949, 754824753, 754693069, 754438705, 754113388, 753804932, 753606415, 753575897, 753708267, 753934784, 754154358, 754275970, 754247360, 754062042, 753755188, 753397141, 753078156, 752874451, 752808304]
2206.5G52808304K9526M9743J3275l5095o9885j03836j61133k37427k93503k82745
2216.1G51717224j93176n8365O1569J10703O2637o8207k27661l47748l84445l43780
2225.8G50328751k71683k08054j56860r6283k0218M0741M4937j6556j06582j72425
2235.4G49365768j86386j57928j10245n6686k442M4174O8512N8976J4267n8670j51902
2246G48827438k50015l22571l31344k54746j10931M3106J40381J42212N8517o0348
2255.7G47881699j53199j84250j57699j05591n6686j5107K9068P6828J03684P7438
2265.3G47496185j0986j30310k25601k49939j91803p9270L7079J08643J12381N9051
2275G46925430k1438j05439j86767k68250l35693l57056l01284j74866k6627P5531
$$ y = [752808304, 752837830, 752887573, 752900848, 752865753, 752795868, 752692032, 752530899, 752293472, 751999969, 751717224, 751524048, 751465683, 751527252, 751637955, 751700592, 751632385, 751404724, 751056976, 750672531, 750328751, 750057068, 749849014, 749692154, 749595871, 749575653, 749616394, 749661331, 749644775, 749538193, 749365768, 749179382, 749021454, 748911209, 748854523, 748852081, 748896255, 748964767, 749023743, 749038010, 748979340, 748827438, 748577423, 748254852, 747923508, 747668762, 747557831, 747600937, 747741318, 747883530, 747942047, 747881699, 747728500, 747544250, 747386551, 747280960, 747224274, 747209167, 747238235, 747315063, 747418747, 747496185, 747485199, 747354889, 747129288, 746879349, 746687546, 746608276, 746645355, 746753998, 746866379, 746925430, 746903992, 746798553, 746611786, 746343536, 746007843, 745650787, 745349503, 745174637, 745148010, 745223541]
2284.6G45223541Q7281J0376j12763k28271l01667l27911l20816k92969k46887j84555
2294.3G43305359j26953j10626j57319k51388l47519m02527m00696l42865k33459q7586
2303.9G40844421M9515J17035R0714J8615k0599l662L204q1100k48032l82919l70102
2314.5G40017090k06070l281J13297J01013j984j39694k76947l80707m09622l43170
2324.2G38469925k21176j28632j24664j91651k52304k31628j11008O0959J93939K05613
2333.8G37669373Q2168r1781j87302j47629n7602p0114k46201m72259n62134m38766
2343.4G35477753k03553j9989M7913O6757J21536K14386K81373K81982K39029J91803
2353.1G36698990J48620J00022N8517M6006M3106j8387j89133m27933o16607o57273
$$ y = [745223541, 745310822, 745321198, 745208435, 744980164, 744678497, 744350586, 744029770, 743736801, 743489914, 743305359, 743178406, 743067780, 742910461, 742659073, 742311554, 741909027, 741508331, 741165466, 740932007, 740844421, 740893936, 741010971, 741101685, 741120300, 741099701, 741096039, 741099243, 741018143, 740770111, 740387192, 740017090, 739811020, 739807739, 739921036, 740022049, 740020065, 739880371, 739603424, 739222717, 738813095, 738469925, 738248749, 738120117, 737995453, 737803802, 737551498, 737319870, 737208862, 737269821, 737463760, 737669373, 737751541, 737659760, 737472458, 737324829, 737267227, 737197113, 736950912, 736478653, 735916519, 735477753, 735274200, 735254211, 735302124, 735368881, 735490417, 735704803, 735986176, 736268158, 736507187, 736698990, 736847610, 736947632, 737006149, 737052155, 737095261, 737076874, 736887741, 736459808, 735843201, 735185928]
2362.7G35185928n51986l84522k46658j81732j90354k58407l69034m94156n96008o43998
2372.4G31269073o24694n45273m31824l28064k81296l10363l85209m47006m58679m34494
2382G27022171m19464m34799m53873m25339l22647j73569m5089o11o1264j91955l18299
2392.6G24175262l69491l23029k14309j06659m4175l1738m9667q5297j43127k25907
2402.3G22581863l14254l71552l70941l16620k41547j83410j65329j89514k48871l33405
2411.9G19846420m28161n09491n48783n32150m74167m12369l81622l91464m30222m86450
2421.6G15251541n63812o64444p66983q25272q02002p04651n85403m99496m64097m58908
2431.2G08916473m62188m82102n44586o53992p63168q00247p21817n51911l68957k54212
$$ y = [735185928, 734633942, 734249420, 734002762, 733821030, 733630676, 733372269, 733003235, 732509079, 731913071, 731269073, 730644379, 730099106, 729667282, 729339218, 729057922, 728747559, 728362350, 727915344, 727456665, 727022171, 726602707, 726167908, 725714035, 725288696, 724966049, 724792480, 724747391, 724746780, 724685516, 724493561, 724175262, 723805771, 723482742, 723268433, 723161774, 723117599, 723085861, 723036194, 722950897, 722807770, 722581863, 722267609, 721896057, 721525116, 721208496, 720966949, 720783539, 720618210, 720428696, 720179825, 719846420, 719418259, 718908768, 718359985, 717827835, 717353668, 716941299, 716559677, 716168213, 715737991, 715251541, 714687729, 714023285, 713256302, 712431030, 711629028, 710924377, 710338974, 709839478, 709375381, 708916473, 708454285, 707972183, 707427597, 706773605, 706010437, 705210190, 704488373, 703936462, 703567505, 703313293]
2440.8G03313293k40325l00446l73077m04282l68958k73361j41144j297J21842K16064
2450.5G01548309K84958L41721L97873M52652M93316N09644N10406N23072N74341O70776
2460.1G06307068P90405Q91342R36585R08432Q13217O72455N15594L71552K64587K11411
2469.8G12682648K14157K55813K96174K85339J88293Q850k05459l87116m90722n18875
2479.4G12329102n10407n01251m94003m64631m00772l32031l18222m04968n79682p78045
2489.1G07545090r26132r86863r68170q95538p88040o56205n21774m21448l82385l96728
2498.7G00601807m22593m18014l69644k90680j89896n7831J13678K96097M22669M32434
2508.3G00118027L22036J57166K8763n951N0583J53808K52915L12424L13491K53220
$$ y = [703313293, 703072968, 702772522, 702399445, 701995163, 701626205, 701352844, 701211700, 701210403, 701332245, 701548309, 701833267, 702174988, 702572861, 703025513, 703518829, 704028473, 704538879, 705061951, 705636292, 706307068, 707097473, 707988815, 708925400, 709833832, 710647049, 711319504, 711835098, 712206650, 712471237, 712682648, 712896805, 713152618, 713448792, 713734131, 713922424, 713931274, 713725815, 713338699, 712847977, 712329102, 711818695, 711317444, 710823441, 710358810, 709958038, 709626007, 709307785, 708902817, 708323135, 707545090, 706618958, 705632095, 704663925, 703768387, 702980347, 702324142, 701802368, 701380920, 700998535, 700601807, 700179214, 699761200, 699391556, 699100876, 698910980, 698853149, 698966827, 699262924, 699685593, 700118027, 700440063, 700597229, 700625992, 700620041, 700670624, 700824432, 701077347, 701389771, 701703262, 701956482]
2518G01956482J47476K9068o6528j22223j44577j46637j32904r6054l6392K3727N0659
2528.6G01462097K4491m4404j24282j87378k26517k45972k46505k16752j51596p0343
2538.2F99972839j9683m3946j50146k98004m26560m96063n06287m79355m27856l48969
2547.9F96775970k47421j54419j14212j44119k12097k64817k76260k69318k81982l18909
2557.5F94492416l40499l03879k14005j30920j21079k03170l34473m45633m91028m70047
2567.2F91437683m12140l43857k75573k13623j75553j89895k66495l77731m69056m99496
2576.8F88214264m73938m27857l87268l44696k79464j97296j37253j33972j79139k25677
2586.5F85427704k33231j99508j48850r0103o409J18027K64816L85437M36020M06876
$$ y = [701956482, 702103958, 702133026, 702066498, 701944275, 701799698, 701653061, 701520157, 701424103, 701387711, 701411438, 701462097, 701486588, 701442184, 701317902, 701130524, 700904007, 700658035, 700411530, 700194778, 700043182, 699972839, 699953156, 699909210, 699759064, 699461060, 699034500, 698538437, 698032150, 697552795, 697124939, 696775970, 696528549, 696374130, 696259918, 696115799, 695903702, 695638885, 695362625, 695093307, 694811325, 694492416, 694151917, 693848038, 693634033, 693503113, 693382034, 693178864, 692844391, 692398758, 691907730, 691437683, 691025543, 690681686, 690406113, 690192490, 690016937, 689827042, 689560547, 689182816, 688713760, 688214264, 687740326, 687312469, 686925201, 686580505, 686301041, 686103745, 685966492, 685832520, 685653381, 685427704, 685194473, 684994965, 684846115, 684756012, 684749603, 684867630, 685132446, 685517883, 685953903, 686360779]
2596.1F86360779L15399J82419K4872j27793k27127k31628j42365j5945P1945Q0032
2605.7F86290588K6169l6850p1258q3313j11847j85089k90528l77502l93829l22495
2615.4F84444046j97296q1101l0899o5689j62964k71988l47824l68881l39889k75727
2625F82301788j88217q6441O256N3787K9984m8599j22147j29776o0043L7765R5673
2635.6F81890030Q7891M4784J6403K4796M5776M0665o638p6446j32675j53656j40839
2646.3F81640091j09863p4311m1809k2964l4409q7509j73721k61231l20663l49503
2655.9F80164108l71628m04281m31900m17175l44697k45971j74103j58234j78680j90735
2665.5F77246704j61819q5373K8228J59150K76489L44467L47519L07922K65351K33001
$$ y = [686360779, 686676178, 686858597, 686883469, 686755676, 686528549, 686296921, 686154556, 686138611, 686210556, 686290588, 686316757, 686279907, 686208649, 686125336, 686013489, 685828400, 685537872, 685160370, 684766541, 684444046, 684246750, 684165649, 684134750, 684069061, 683906097, 683634109, 683286285, 682917404, 682577515, 682301788, 682113571, 682027130, 682033386, 682087173, 682117157, 682068558, 681946411, 681816635, 681756592, 681794357, 681890030, 681977921, 682022705, 682039108, 682063904, 682109680, 682150345, 682143707, 682067261, 681934586, 681780930, 681640091, 681530228, 681455917, 681414108, 681391144, 681356735, 681269226, 681095505, 680834274, 680513611, 680164108, 679792480, 679388199, 678956299, 678539124, 678194427, 677948456, 677774353, 677616119, 677437439, 677246704, 677084885, 676999512, 677027740, 677186890, 677463379, 677807846, 678155365, 678463287, 678728638, 678961639]
2675.2F78961639J87607J08566K3575O11P7743K13318L07922K87018J55335j9455j66779
2685.8F80137100k51083k67639k21482j24206k213J05133J66397J71814J28479M5929
2695.4F79888229o5765j88980k96936l63770l80020l51867k96326k36664k02560k21558
2705.1F77283783k99072m07410n01556n54963n77850n97916o21566o19126n52749m25263
2714.7F72126312k93503k35061k88849m28085n78995o71311o76574o14624n32227m71191
2724.4F67335892m58985n07965o23932q03756j019211j213150j323242j324005j254960
2733F58806686j200409j231231j365662j576996j833114k117157k412110k680893k880325
2741.7F41508789k995109l054505l098755l141861l165855l156471l125458l095474
$$ y = [678961639, 679149246, 679257812, 679281387, 679281998, 679359741, 679573059, 679880981, 680167999, 680323334, 680303879, 680137100, 679886017, 679618378, 679396896, 679272690, 679270477, 679375610, 679542007, 679713821, 679842300, 679888229, 679822464, 679633484, 679336548, 678972778, 678592758, 678240891, 677944565, 677707901, 677505341, 677283783, 676984711, 676577301, 676075745, 675520782, 674942932, 674345016, 673723450, 673104324, 672551575, 672126312, 671832809, 671597748, 671308899, 670880814, 670301819, 669630508, 668953934, 668339310, 667807083, 667335892, 666876907, 666368942, 665745010, 664941254, 663922043, 662708893, 661385651, 660061646, 658806686, 657606277, 656375046, 655009384, 653432388, 651599274, 649482117, 647070007, 644389114, 641508789, 638513680, 635459175, 632360420, 629218559, 626052704, 622896233, 619770775, 616675301]
2749.4F16675301l060341k978516k801475k509194k112846j632233j086960n05523
2757.2E99988213O0920N50576R18960J160851J305046J393966J458779J509018J537475
2765.8F09883804J540795J536865J561241J635399J739654J822815J847763J829224
2773.5F23397560J819077J856308J934356K017098K079544K120819K138824K106018
2781.3F39469604J984864J770706J513901J287842J134338J037750R49097Q34350O97327
2789.9F50679779N62210M42276L29285K13089J00937J6632k6016l6393l4179j9989
2799.6F52227631K8686J30310K65122L79944M23202L80631K71301J27258k2964j46256
2809.2F54064865k06299j86310j16348o0425p0724j46942k46353l28904l90319m51737
$$ y = [616675301, 613614960, 610636444, 607834969, 605325775, 603212929, 601580696, 600493736, 599988213, 600049133, 600599709, 601518669, 602679520, 603984566, 605378532, 606837311, 608346329, 609883804, 611424599, 612961464, 614522705, 616158104, 617897758, 619720573, 621568336, 623397560, 625216637, 627072945, 629007301, 631024399, 633103943, 635224762, 637363586, 639469604, 641454468, 643225174, 644739075, 646026917, 647161255, 648199005, 649148102, 649982452, 650679779, 651241989, 651684265, 652013550, 652226639, 652327576, 652344208, 652318192, 652281799, 652247620, 652227631, 652256317, 652386627, 652651749, 653031693, 653454895, 653835526, 654106827, 654234085, 654211121, 654064865, 653858566, 653672256, 653555908, 653495483, 653424759, 653277817, 653031464, 652702560, 652312241, 651860504]
2818.9F51860504n26581o06842o71920p04728o95114o43921n71747n24978n53284o67801
2828.5F45693588q21838r35364r47418q43048o40793l67737n4932K47880M77294N93796
2838.2F42401428O17371O21185O71234P68738Q53424Q60520P80715O63376N65262M97132
2847.8F49300385M22668L12271J89362J21765J60599K87780M27780N13077N36652N34744
2857.4F52807083N28336M84619L50647J22528j25656k90528l20282k47116j45492o8894
2867.1F53095245k0752J3504K7619m425r6665k23999l33252l79257l51410k70920j68914
2877.7F51286774p0496Q545N6152O5079L4103k8991j06049j74713k10876k00501j49155
2888.3F50509872p9574k4033j0071n3863j62582l27683n17273o77643p51800p12204
$$ y = [651860504, 651333923, 650727081, 650055161, 649350433, 648655319, 648011398, 647439651, 646914673, 646361389, 645693588, 644871750, 643936386, 642988968, 642145920, 641505127, 641137390, 641082458, 641330338, 641807632, 642401428, 643018799, 643639984, 644311218, 645079956, 645933380, 646793900, 647574615, 648237991, 648803253, 649300385, 649723053, 650035324, 650224686, 650346451, 650507050, 650794830, 651222610, 651735687, 652272339, 652807083, 653335419, 653820038, 654170685, 654293213, 654167557, 653877029, 653556747, 653309631, 653164139, 653095245, 653074493, 653087997, 653115616, 653111191, 653014526, 652790527, 652457275, 652078018, 651726608, 651455688, 651286774, 651216278, 651224823, 651280975, 651346054, 651380157, 651351166, 651245117, 651070404, 650859528, 650659027, 650509872, 650430298, 650406265, 650396194, 650342331, 650179749, 649852066, 649334793, 648657150, 647905350, 647193146]
2897.9F47193146n70297l64609j35041Q0719K35291K74811J72577l3036k48336l85209
2907.6F46220016m22515m07944m02069m21677m43725m47083m40063m41361m46472m24728
2917.2F41922379l45688k01111p6K41470M90188O81229P40357O43539M56772K99911
2926.9F44928970K53373K93350L23639K72140J56555N8289L8071Q1100J19476R9564
2936.5F46624527K2507p1640j47019j99585k43759k86407l15781l15933k91519k70768
2946.2F44504623k83737l32489l86505m09317l89709l43323k85263k06528r1247M1656
2955.8F41818161J29166J05590l9749k57644m88434p09229r18388j074028j081085
2964.5F37484360q57926m25415P9384M91943P22237P80258P22618N89409L98407J71051
$$ y = [647193146, 646622849, 646258240, 646123199, 646203918, 646439209, 646714020, 646886597, 646853561, 646605225, 646220016, 645797501, 645389557, 644987488, 644565811, 644122086, 643675003, 643234940, 642793579, 642347107, 641922379, 641576691, 641375580, 641375504, 641616974, 642107162, 642788391, 643528748, 644172287, 644629059, 644928970, 645182343, 645475693, 645799332, 646071472, 646228027, 646286316, 646324387, 646405487, 646524963, 646624527, 646647034, 646575394, 646428375, 646228790, 645985031, 645698624, 645382843, 645066910, 644775391, 644504623, 644220886, 643888397, 643501892, 643092575, 642702866, 642359543, 642074280, 641867752, 641776505, 641818161, 641947327, 642052917, 642013168, 641755524, 641267090, 640557861, 639639473, 638565445, 637484360, 636626434, 636201019, 636280403, 636772346, 637494583, 638274841, 638997459, 639586868, 639985275, 640156326]
2974.1F40156326n7525k56958m19350n49774o52046p31392q09212r06181j007462j046677
2983.8F33719749r48715o95534l54461l9749J58043K08702J33285k3842k16140m03290
2993.4F31538048n59159o78215p68165q35457q81119r10110r45854j023865j172981
3002.1F23763123j395264j661148j920853k129669k274399k384453k511825k680016
3009.8F06805496k848968k929421k846451k600441k276229j999665j875763j944351
3017.5E87484207k165603k435990k639885k717933k700959k674331k691765k720757
3025.2E66736984k673645k491989k191811j835823j475181j136284q49800o57845n61714
3033.9E52862892m67872k23694K62260R18694J530647J867905J810875J376647O60477
$$ y = [640156326, 640098801, 639841843, 639422493, 638872719, 638220673, 637489281, 636680069, 635773888, 634766426, 633719749, 632771034, 632075500, 631721039, 631681290, 631839333, 632048035, 632181320, 632157478, 631941338, 631538048, 630978889, 630300674, 629532509, 628697052, 627815933, 626905823, 625959969, 624936104, 623763123, 622367859, 620706711, 618785858, 616656189, 614381790, 611997337, 609485512, 606805496, 603956528, 601027107, 598180656, 595580215, 593303986, 591304321, 589428558, 587484207, 585318604, 582882614, 580242729, 577524796, 574823837, 572149506, 569457741, 566736984, 564063339, 561571350, 559379539, 557543716, 556068535, 554932251, 554082451, 553424606, 552862892, 552395020, 552171326, 552433586, 553352280, 554882927, 556750832, 558561707, 559938354, 560598831]
3042.6E60598831k26402j169815k042198k712632l090057l154068k949753k550697
3050.3E42703209k030678j457786r01490m30031r4833R5406J84288K58484M12025P00493
3060E39439087J113777J580696K001419K280464K352448K205658J906166J595039J432839
3068.6E55907593J506042J764984K056046K226372K212791K045403J779899J442223
3076.4E70941353J037521N95398J84174j24970l03611l65296l24707j65977J38130
3085E71612015N74569J061135J468506J685104J670723J469460J174774Q78753O37551
3093.7E82232590M70810L85055L93181N05638P06978R46198J159782J310768J409531
3102.4E89520531J492614J579743J656723J696205J694870J684990J702690J749573
$$ y = [560598831, 560372429, 559202614, 557160416, 554447784, 551357727, 548203659, 545253906, 542703209, 540672531, 539214745, 538313255, 537883224, 537788391, 537883797, 538068085, 538326569, 538738594, 539439087, 540552864, 542133560, 544134979, 546415443, 548767891, 550973549, 552879715, 554474754, 555907593, 557413635, 559178619, 561234665, 563461037, 565673828, 567719231, 569499130, 570941353, 571978874, 572574272, 572758446, 572633476, 572329865, 571964569, 571639862, 571473885, 571612015, 572186584, 573247719, 574716225, 576401329, 578072052, 579541512, 580716286, 581595039, 582232590, 582703400, 583088455, 583481636, 583987274, 584694252, 585640450, 586800232, 588111000, 589520531, 591013145, 592592888, 594249611, 595945816, 597640686, 599325676, 601028366, 602777939]
3110.1F02777939J785202J762619J668625J536255J419525J357841J359291J403923
3117.8F15071220J456948J482849J461754J399917J320877J241036J151047J030578
3125.5F25616226Q86994P74688P62444Q72650J052933J211509J284409J271782J215897
3134.2F34949532J152153J085205J003303R07059Q16383P58896P51495P87888Q35877
3142.9F43047791Q47091P83920O54374N19409M58603N05142O18668P12432P23343O52314
3152.5F49523087N50308M66461M15115L83377L57285L36227L23563L19138L26309L58276
3162.2F53359146M24500N08957N62973N34973M14734K48184J03302J9531r003l204
3171.8F56164093L9597J42822K99759M42352M74091L55072J50070j7090p2021n2567
$$ y = [602777939, 604563141, 606325760, 607994385, 609530640, 610950165, 612308006, 613667297, 615071220, 616528168, 618011017, 619472771, 620872688, 622193565, 623434601, 624585648, 625616226, 626503220, 627277908, 628040352, 628913002, 629965935, 631177444, 632461853, 633733635, 634949532, 636101685, 637186890, 638190193, 639097252, 639913635, 640672531, 641424026, 642211914, 643047791, 643894882, 644678802, 645333176, 645852585, 646311188, 646816330, 647434998, 648147430, 648870773, 649523087, 650073395, 650539856, 650954971, 651338348, 651695633, 652031860, 652355423, 652674561, 653000870, 653359146, 653783646, 654292603, 654855576, 655390549, 655805283, 656053467, 656156769, 656176300, 656167297, 656164093, 656203690, 656346512, 656646271, 657088623, 657562714, 657917786, 658067856, 658050766, 657978745, 657926178]
3181.5F57926178n4626j22681j93939j65558r995J84632K93121K67105J64414P5149
3191.1F58363800L0594m349o1569j11389q6441M2190K21100L49350L52326K25906K7008
3201.7F59348526j66626k85568k88925j82267k6092R1247J09177L8528n4473j11313
3211.4F58472214j30463j46866j73874j72195r2621N4703J88217K13013J03912p7820
3221F58238220k36358l13111l10592k69852k30942k10876k01645j77231j14060j9836
3230.7F56153717N5618M9439o2943k38952l99933m90418n07507m74091l97338k68326
3240.3F53419266r5749O3324J30844O9275q5297k44522l31650l24859k53601j65635
3249.9F52181396r5520n7449n4474q4991j42517k21787l20053m33197n40237n88990
$$ y = [657926178, 657871552, 657748871, 657554932, 657389374, 657379379, 657564011, 657857132, 658124237, 658288651, 658363800, 658394394, 658390045, 658328476, 658217087, 658130646, 658172836, 658393936, 658743286, 659095612, 659321518, 659348526, 659181900, 658896332, 658607407, 658425140, 658399048, 658490295, 658599472, 658638000, 658583527, 658472214, 658341751, 658194885, 658021011, 657848816, 657756195, 657810898, 657999115, 658212128, 658316040, 658238220, 658001862, 657688751, 657378159, 657108307, 656877365, 656666489, 656464844, 656287613, 656173553, 656153717, 656209335, 656258774, 656195831, 655956879, 655556946, 655066528, 654559021, 654084930, 653687592, 653419266, 653323517, 653386841, 653517685, 653586960, 653501663, 653257141, 652925491, 652600632, 652347031, 652181396, 652085876, 652028427, 651973953, 651888962, 651746445, 651524658, 651204605, 650771408, 650231171, 649642181]
3259.6F49642181n22613l33634j01776M2725J7395j41220l04184l57285k88543j71128
3269.2F47481918q1634l9673k2354j1826j1902k6474m6234o7444j06811j79901k64969
3279.8F46622696l09448k81830k09961j52588j34506j25427r0943m9362o5384j76620
3289.5F45026627l41340m66003m88205m27017l58429l43781l83911m35409m58298m52042
3299.1F40872192m47082m68331n09414n43099n51834n51491n74264o33354p06711p57637
3308.8F35128975p73239p77359q03375q54302q93097q75397p89337o68106n61409m98314
3318.4F27635040m74357m72184m86450n26504n87578o32401o13937n29366m45594m55628
3328.1F22411041n88226p65305q57162p95975o41022n27420n49697o87523q35190q95691
$$ y = [649642181, 649119568, 648785934, 648684158, 648726883, 648744278, 648603058, 648298874, 647941589, 647653046, 647481918, 647400284, 647360611, 647338257, 647326431, 647314529, 647288055, 647241821, 647174377, 647067566, 646887665, 646622696, 646313248, 646031418, 645821457, 645668869, 645534363, 645408936, 645317993, 645268631, 645203247, 645026627, 644685287, 644219284, 643731079, 643304062, 642945633, 642601852, 642217941, 641782532, 641324234, 640872192, 640425110, 639956779, 639447365, 638904266, 638352432, 637800941, 637226677, 636593323, 635886612, 635128975, 634355736, 633578377, 632775002, 631920700, 631027603, 630152206, 629362869, 628694763, 628133354, 627635040, 627160683, 626688499, 626202049, 625675545, 625087967, 624455566, 623841629, 623312263, 622866669, 622411041, 621822815, 621057510, 620200348, 619404373, 618763351, 618235931, 617686234, 616998711, 616163521, 615267830]
3337.7F15267830q51441p59582p01218p26585q32596r65691j055412j059952r99412
3346.4F07315941r40323r37271r80721j010055r83162r25179r09233r76486j087494
3355.1E98566017j152916j113777r91211q64029q05206q37860r33037j038284j109429
3363.7E89720268j131248j127854j143989j205368j283226j307297j222382j044235
3371.4E80254669q60138p70149q18405r68170j130715j217842j186447j055946q91190
3380.1E71355667p61032o99348o92025p08999p41577q08793r20105j042175j109772
3388.8E63871841j075325r48104p84722o43654n54466n18532n27267n68314o20155
3397.5E57631302o54945o58913o47278o48766o71272o81686o37093n33523m27742l94516
$$ y = [615267830, 614416389, 613656807, 612955589, 612229004, 611396408, 610430717, 609375305, 608315353, 607315941, 606375618, 605438347, 604457626, 603447571, 602464409, 601539230, 600629997, 599653511, 598566017, 597413101, 596299324, 595308113, 594444084, 593638878, 592801018, 591867981, 590829697, 589720268, 588589020, 587461166, 586317177, 585111809, 583828583, 582521286, 581298904, 580254669, 579394531, 578624382, 577805977, 576837807, 575707092, 574489250, 573302803, 572246857, 571355667, 570594635, 569895287, 569203262, 568494263, 567752686, 566943893, 566023788, 564981613, 563871841, 562796516, 561848412, 561063690, 560420036, 559865570, 559347038, 558819771, 558251457, 557631302, 556976357, 556317444, 555670166, 555021400, 554350128, 553668442, 553031349, 552497826, 552070084, 551675568]
3407.1E51675568m57154n59959o19202n99670n44472n21202n44777n60646n10559m03976
3416.8E46353951l20664l32985m28963n14640m94461l57323j85585q5793j03302j93100
3426.4E43337135k72026k91939k71072k51808k44370k19230j56098q3961n2300o3934
3436.1E41430397n9509J2016J15356J47324M9820j10435j98555j46141j5755P8010
3445.7E41302528R3193R1668J50985K73247L93257M53835M49753M01916L26233K42615
3455.3E44179230J94893K24914L12042L69988L26538K08397J23138J49918K59476L56903
3465E46705437L84369L70750L72772M03137M29917M36401M43344M66729M73403M11110
3474.6E50897369K91138K01302K23655L39699M44603M62837M34075M66346O04516P65266
$$ y = [551675568, 551218414, 550658455, 550039253, 549439583, 548895111, 548373909, 547829132, 547268486, 546757927, 546353951, 546033287, 545700302, 545271339, 544756699, 544262238, 543904915, 543719330, 543633537, 543530235, 543337135, 543065109, 542773170, 542502098, 542250290, 542005920, 541786690, 541630592, 541546631, 541494331, 541430397, 541370888, 541382904, 541498260, 541645584, 541695404, 541584969, 541386414, 541240273, 541224518, 541302528, 541395721, 541487389, 541638374, 541911621, 542304878, 542758713, 543208466, 543610382, 543936615, 544179230, 544374123, 544599037, 544911079, 545281067, 545607605, 545816002, 545939140, 546089058, 546348534, 546705437, 547089806, 547460556, 547833328, 548236465, 548666382, 549102783, 549546127, 550012856, 550486259, 550897369, 551188507, 551389809, 551613464, 551953163, 552397766, 552860603, 553294678, 553761024, 554365540, 555130806]
3484.3E55130806Q12149O88286M69742K94113K48985L26309M59671N79682O41327O22215
3493.9E60273285N28335M04816L19634L21197L96462M74815M82826M07372L09372K76451
3503.6E64194565L42483M50745M98466M36936L31344L07160M26788O18172P33833O92902
3513.2E69033394N51910M41284M38195N11169N79796O02875N94787N82199N66979N44395
3522.9E74446983N30091N44166N75600N81360N35164M68101M47235N10178O26106P17201
3532.5E79982185P17888O26221N11017M72832N70678P60460R08737Q98247P39212N68047
3542.1E86755524N15785N76820O30417N95436N35164N79758P47375Q88329Q30269N73692
3551.8E93228569L14446K64778M65622P74383J010094J085358J020088Q86383P67860
$$ y = [555130806, 555942955, 556631241, 557100983, 557395096, 557644081, 557970390, 558430061, 559009743, 559651070, 560273285, 560801620, 561206436, 561526070, 561847267, 562243729, 562718544, 563201370, 563608742, 563918114, 564194565, 564537048, 564987793, 565486259, 565923195, 566254539, 566561699, 566988487, 567606659, 568340492, 569033394, 569585304, 570026588, 570464783, 570975952, 571555748, 572158623, 572753410, 573335609, 573902588, 574446983, 574977074, 575521240, 576096840, 576678200, 577213364, 577681465, 578128700, 578638878, 579264984, 579982185, 580700073, 581326294, 581837311, 582310143, 582880821, 583641281, 584550018, 585448265, 586187477, 586755524, 587271309, 587848129, 588478546, 589073982, 589609146, 590188904, 590936279, 591824608, 592654877, 593228569, 593543015, 593807793, 594273415, 595047798, 596057892, 597143250, 598163338, 599049721, 599817581]
3560.5E99817581P40891Q23860R22851Q69294N74150J63803p3281P9270N68313J109963
3570.1F05596695J426506J445389J286812J100921R50547Q36677P75414Q05511R18732
3578.8F15143204J033554J069298J035156J017799J066437J105576R96627O97861L58925
3587.5F23524437K33726M69208R60999J403846J511155J227188P63855M34341M23012
3596.1F30951767O71043R56993J088524J037217R26704R09920J043586J242943J332970
3604.8F40161667J174087P96585M32435L63464O60095J060257J177826Q88596N00412
3613.5F47215424M56466Q49228J281128J272202P82776K61840J64872N10253R62372
3622.2F53756561J272354J483460J667862J624603J047287J5411q45565q64106k136
$$ y = [599817581, 600558472, 601382332, 602305183, 603174477, 603748627, 603912430, 603839149, 603918419, 604486732, 605596695, 607023201, 608468590, 609755402, 610856323, 611806870, 612643547, 613418961, 614224472, 615143204, 616176758, 617246056, 618281212, 619299011, 620365448, 621471024, 622467651, 623165512, 623524437, 623758163, 624227371, 625188370, 626592216, 628103371, 629330559, 630094414, 630528755, 630951767, 631622810, 632579803, 633668327, 634705544, 635632248, 636542168, 637585754, 638828697, 640161667, 641335754, 642132339, 642564774, 642928238, 643588333, 644648590, 645826416, 646715012, 647215424, 647671890, 648521118, 649802246, 651074448, 651857224, 652119064, 652283936, 652794189, 653756561, 655028915, 656512375, 658180237, 659804840, 660852127, 660867538, 660021973, 659157867, 659155731]
3630.9F59155731J057205J536713J253586O68716L37677M02603N96390O24771M56848
3639.5F66090240K86866L16620N94177R99603J306839J282272Q02460m5242r49478
3648.2F70684357j488495j338349m86297O85654J564254J694870J125260L71780j8768
3656.9F72794266R1629M11453N97610N68924M54865L57132K98920L46374N80216Q48999
3666.5F77350388P26471l5782r96476j231308k95944J081009J539459M66462j265793
3675.2F77338486k105027j352081K17362J243820J135711M43573O0349K92969P54089
3683.9F78029251R42764P12815K27203l12958p56912r34296o88400n4474O63529J079559
3693.5F78908081J012497O03485J78146l967P9270K19192J58310j69296n42679o27670
$$ y = [659155731, 660212936, 661749649, 663003235, 663671951, 664009628, 664412231, 665008621, 665633392, 666090240, 666377106, 666693726, 667287903, 668287506, 669594345, 670876617, 671679077, 671633835, 670684357, 669195862, 667857513, 667371216, 668056870, 669621124, 671315994, 672441254, 672813034, 672794266, 672885895, 673297348, 673894958, 674463882, 674918747, 675275879, 675574799, 675921173, 676501389, 677350388, 678076859, 678041077, 677044601, 675813293, 675517349, 676598358, 678137817, 678604279, 677338486, 675233459, 673881378, 674098740, 675342560, 676478271, 676921844, 676982193, 677275162, 678029251, 678972015, 679684830, 679912033, 679599075, 678842163, 677907867, 677219467, 677164993, 677828522, 678908081, 679920578, 680524063, 680702209, 680698242, 680777512, 680996704, 681155014, 680985718, 680443039, 679815369]
3703.2F79815369k93503K43149O08444N97839K90451j12686m79889p43866p94754n20477
3712.8F78610077K4414N62897Q04825P03887M59900K70844J47095j1368k26059l98331
3722.5F80948181m48837m04511l19366j60217J48773N72052R09729R31244N59768p9727
3732.1F82657089p47070j203003j290283r96552m71954O5231M76532P50656Q73719
3740.8F80114365P17468J75476n61523r90677p24259L1586N55572K95334n35583j138001
3750.4F77939758r30557j09863O35986Q64182P16476N45044M15649J33057l12271n60303
3760.1F79337158k80533L48587P46155N50156J7090k90375j46256J33515J23367k05307
3769.7F80333557m94156m43725j14365K19803L92990M26178L52097J13983k90222o55594
$$ y = [679815369, 679521866, 679765015, 680373459, 680971298, 681261749, 681149063, 680669174, 679925308, 679130554, 678610077, 678634491, 679197388, 680002213, 680706100, 681166000, 681436844, 681583939, 681572571, 681346512, 680948181, 680499344, 680094833, 679775467, 679615250, 679764023, 680336075, 681245804, 682177048, 682736816, 682657089, 681910019, 680707016, 679416733, 678420181, 677948227, 678013458, 678489990, 679240646, 680114365, 680831833, 681007309, 680445786, 679455109, 678730850, 678762436, 679318008, 679613342, 679077759, 677939758, 677009201, 676899338, 677535324, 678399506, 679115982, 679661026, 680076675, 680209732, 679897461, 679337158, 679056625, 679405212, 680151367, 680701523, 680718613, 680428238, 680281982, 680415497, 680538864, 680333557, 679839401, 679395676, 679281311, 679501114, 679894104, 680320282, 680672379, 680786362, 680496140, 679840546]
3779.4F79840546o79627k77710K60620M95148K40173k49786n17960l43093N3634K51084
3789F79073029R1629j36338l2959L94745O60248L45993l24783o40717k30179L89176
3798.7F79589844L12958o52771j598664j417160o9427J263733J381607K85339r12476
3807.3F78182983j198349n58624L00751Q25271R60618P93838K78702m82712r47418
3816F78155060n41153N47638J274795P40128p52640j868820j587524k47651Q64716
3824.7F76584549Q86764J63422l24936j02997M05579N29938J62277k04315j28784K54745
3834.3F78226242M04587l6087q68378j518860j527862q90580j4648O09284P45315N14450
3844F75643463K30560J40305K83356N39322P29293O57273J47629p99256j826019k298508
$$ y = [679840546, 679160919, 678883209, 679143829, 679638977, 679879150, 679629364, 679111404, 678768311, 678821945, 679073029, 679164658, 679028320, 678995361, 679390106, 680050354, 680396347, 680071564, 679430847, 679200668, 679589844, 679902802, 679250031, 677651367, 676234207, 676164780, 677428513, 678810120, 679095459, 678182983, 676984634, 676426010, 676726761, 677552032, 678512650, 679306488, 679585190, 679102478, 678155060, 677613907, 678161545, 679436340, 680176468, 679423828, 677555008, 675967484, 675719833, 676584549, 677471313, 677634735, 677309799, 677206802, 677612381, 678142319, 678304596, 678100281, 677971497, 678226242, 678630829, 678594742, 677726364, 676207504, 674679642, 673789062, 673774414, 674383698, 675129013, 675643463, 675874023, 676014328, 676297684, 676837006, 677566299, 678223572, 678371201, 677571945, 675745926, 673447418]
3853.6F73447418j764679m33349Q78982J408234J103897N84030M11148M91715K86178
3862.3F76413574m17022j107407j061249k17361O25686O01273k79846j104279j023407
3871F72429962j60446N60074M67529j09482k67334L75595J174164J161423J72119r07364
3880.6F74896240j069488k70844N49622N15518k58865q61054o25610J69067O57196
3889.3F73701782L30963m79126j006698q01087o0653O48193Q79746N60150o4774o22787
3898.9F73085709q20618o10352k19574K1286m2648k59094l28217j02844K76184N23682
3908.6F71523514M75998K20642r92j4343J39541K37809P8964l17230o89240p43484
3918.2F70911179m14734P0953L86581L60871O9504k69699m54483l96119j44882J26801
$$ y = [673447418, 671682739, 671249390, 672128372, 673536606, 674640503, 675224533, 675635681, 676127396, 676413574, 675996552, 674889145, 673827896, 673610535, 674236221, 674837494, 674557648, 673453369, 672429962, 672269516, 672829590, 673297119, 673187637, 672920303, 673295898, 674470062, 675631485, 675803604, 674896240, 673826752, 673555908, 674105530, 674621048, 674362183, 673501129, 672875519, 673044586, 673701782, 674032745, 673553619, 672546921, 671745834, 671685181, 672333374, 673213120, 673773270, 673708496, 673085709, 672265091, 671654739, 671435165, 671456451, 671413803, 671154709, 670826492, 670723648, 670999832, 671523514, 671999512, 672220154, 672219162, 672204819, 672344360, 672582169, 672661133, 672343903, 671654663, 670911179, 670496445, 670567398, 670953979, 671314850, 671384354, 671114655, 670660172, 670264053, 670119171, 670245972]
3927.9F70245972K16217M2038k66114m65469m11911j68228Q9798K41165K72903K16446
3937.5F70012817R5444n9814k05613l18374l96118l96424k28195J14670M31061M33426
3947.2F69482880N7449m14352o12259m45099j39466O6147J49613J98211K03782R2086
3956.8F68638992q8882j77765j37177j37710l04184m81720m11301j09253J12839O2180
3966.5F66966019p9346m7913R7504O9122j79901l53088k65885j56631l22037o04324
3976.1F65123520n80444k40021q5983l86658o88477m63867j3809j43204q89587j260681
3985.7F60370789o73829o8893o94580k006226k055206n42984j45798l054962o681213
3994.4F44447098n756150r47189l774109k8386345p5135154j23263932
$$ y = [670245972, 670462189, 670504227, 670238113, 669772644, 669360733, 669192505, 669282303, 669523468, 669796371, 670012817, 670108261, 670048447, 669842834, 669524460, 669128342, 668731918, 668503723, 668618393, 669049454, 669482880, 669540329, 669125977, 668513718, 668068619, 667929153, 667995300, 668144913, 668343124, 668546906, 668638992, 668550110, 668372345, 668235168, 668097458, 667793274, 667311554, 666900253, 666791000, 666903839, 666966019, 666886673, 666838760, 666936264, 667005386, 666825485, 666472397, 666206512, 666049881, 665727844, 665123520, 664543076, 664303055, 664217072, 663830414, 663141937, 662678070, 662664261, 662521057, 661631470, 660370789, 659696960, 659628067, 658933487, 656927261, 654872055, 654329071, 654183273, 651128311, 644447098, 638690948, 637743759, 633969650, 605583305, 530448151, 407184219]
4000.2D07184219
$$ y = [407184219]
##END=$$ End of the data block
