##TITLE=Prato calcinado $$ Begin of the data block
##JCAMP-DX=5.00 $$ ACD/SpecManager v 10.08
##SPECTROMETER/DATA SYSTEM=Alpha
##DATE=29 Sep 2014 13:46:02
##DATA TYPE=INFRARED SPECTRUM
##DATA CLASS=XYDATA
##ORIGIN=
##OWNER=
##NPOINTS=1667
##FIRSTX=599.64648438
##LASTX=3997.64306641
##MAXX=3997.64306641
##MINX=599.64648438
##MAXY=1.11981070
##MINY=0.34544581
##XFACTOR=1.0000000000
##YFACTOR=0.000000010000000
##FIRSTY=0.78196633
##DELTAX=2.03961372
##XUNITS=1/CM
##YUNITS=ARBITRARY UNITS
##XYDATA=(X++(Y..Y))
599.6G8196633J37061J76644K50399K88505K74688K67010K56908K21730J82485J55777
$$ 78196633 78333694 78510338 78760737 79049242 79323930 79590940 79847848 80069578 80252063 80407840
620H0407840J53887J49697J13041Q8220R0713J01834J16128J14316R7114P8684O4432
$$ 80407840 80561727 80711424 80824465 80912685 81003398 81105232 81221360 81335676 81432790 81511474 81575906
642.5H1575906P6396R5617J08123J24467J15811R8819J10137J27185J15108Q5688M1634
$$ 81575906 81652302 81747919 81856042 81980509 82096320 82195139 82305276 82432461 82547569 82633257 82674891
664.9H2674891L7896J92804K60072J89299J54984J54674J61511J63513J76418J88142
$$ 82674891 82712787 82905591 83165663 83354962 83509946 83664620 83826131 83989644 84166062 84354204
685.3H4354204J79189J70702J65576J62583J67573J71971J79297J79315J79296K14583
$$ 84354204 84533393 84704095 84869671 85032254 85199827 85371798 85551095 85730410 85909706 86124289
705.7H6124289K66618K83086K56580K15054J75255J22076J01078J83177K83813L13169
$$ 86124289 86390907 86673993 86930573 87145627 87320882 87442958 87544036 87727213 88011026 88324195
726.1H8324195K88528K50596K27767K18839K07501J91969J70398J42711J31673J09947
$$ 88324195 88612723 88863319 89091086 89309925 89517426 89709395 89879793 90022504 90154177 90264124
746.5I0264124M4131k3007n1928n4318l2890o151k1326p9263j46925k13003k69878
$$ 90264124 90308255 90285248 90233320 90179002 90146112 90139961 90118635 90039372 89892447 89679444 89409566
768.9H9409566k61504j58971j8907R9618J98155L01743M02635M69995N09774N53072
$$ 89409566 89148062 88989091 88970184 89069802 89267957 89569700 89972335 90442330 90952104 91505176
789.3I1505176N74273N46091N18585N18757M98307M55790M24439L99345L85076L77125
$$ 91505176 92079449 92625540 93144125 93662882 94161189 94616979 95041418 95440763 95825839 96202964
809.7I6202964L51846L30949L42273L62271L76445L75796L61138L40981L01486K59793
$$ 96202964 96554810 96885759 97228032 97590303 97966748 98342544 98703682 99044663 99346149 99605942
830.1I9605942K44480K47020K36654K18177K23303K46179K45249K09689J75429J55627
$$ 99605942 99850422 100097442 100334096 100552273 100775576 101021755 101267004 101476693 101652122 101807749
850.5A01807749J45602J46711J38176J07992Q9526R8514J08898J12903J16694J13130
$$ 101807749 101953351 102100062 102238238 102346230 102435756 102534270 102643168 102756071 102872765 102985895
870.9A02985895J01113R4056R4462R4783R7895R4771Q0621Q2624J01972J11890J05381
$$ 102985895 103087008 103181064 103275526 103370309 103468204 103562975 103643596 103726220 103828192 103940082 104045463
893.4A04045463R4032R4414R4950P8094O6137P2932Q1754Q0156P4101R1708J25098
$$ 104045463 104139495 104233909 104328859 104406953 104473090 104546022 104627776 104707932 104782033 104873741 104998839
915.8A04998839J32894J23311J13403R4605P8237P6353P1359N5158M2021L2115J6487
$$ 104998839 105131733 105255044 105368447 105463052 105541289 105617642 105689001 105744159 105786180 105818295 105834782
938.2A05834782M792L350n01l373q059k6381m5454n9343o8295o3645n1880n9677q3124
$$ 105834782 105839574 105842924 105842423 105839050 105830991 105804610 105759156 105699813 105631518 105567873 105515993 105456316 105373192
964.7A05373192r0873q5640q3602p9739o7329m9794l3140l1162m1258m1485l0660l0446
$$ 105373192 105282319 105196679 105113077 105033338 104966009 104916215 104883075 104851913 104810655 104769170 104738510 104708064
989.2A04708064n3668p5722p8893r3722j30105j66738k09868k60961l03173l36027
$$ 104708064 104654396 104578674 104499781 104406059 104275954 104109216 103899348 103638387 103335214 102999187
1009.6A02999187l61884l77214l76308l57652l36003l21782k98619k41864j53482p0333
$$ 102999187 102637303 102260089 101883781 101526129 101190126 100868344 100569725 100327861 100174379 100104046
1030A00104046k1815j777m482l0506n2201n9045q2975j17761j25379j05828p9351n7030
$$ 100104046 100082231 100080454 100075972 100045466 99993265 99934220 99851245 99733484 99608105 99502277 99422926 99365896
1054.5I9365896m7803n8526q4650r9767o7859K175M9734M7803K7466J0490o872k7674
$$ 99365896 99318093 99259567 99174917 99075150 99007291 99009466 99059200 99107003 99134469 99144959 99138087 99110413
1079I9110413m9413o2722p1138r6982j38945j77926k14344k52020k79504l03525l46083
$$ 99110413 99061000 98998278 98927140 98830158 98691213 98513287 98298943 98046923 97767419 97463894 97117811
1101.4I7117811l94511m33081m77117n33993n83946o16133o43909o60611o55007o40219
$$ 97117811 96723300 96290219 95813102 95279109 94695163 94079030 93435121 92774510 92119503 91479284
1121.8I1479284o16819n78719n20021m42022l62915k80416j88434r2656J0693J22798
$$ 91479284 90862465 90283746 89763725 89321703 88958788 88678372 88489938 88397282 88407975 88530773
1142.2H8530773K28661L07989L55977L83371L96222L84873L45779K96253K38675J66714
$$ 88530773 88759434 89067423 89423400 89806771 90202993 90587866 90933645 91229898 91468573 91635287
1162.6I1635287J10292Q8275R8383J55902K55853L62045M44269M90987M98194M67085
$$ 91635287 91745579 91833854 91932237 92088139 92343992 92706037 93150306 93641293 94139487 94606572
1183I4606572M07499L37697K72220K11310J42807O8969K426n3245q6058r6970j09029
$$ 94606572 95014071 95351768 95623988 95835298 95978105 96047074 96049500 95996255 95910197 95813227 95704198
1205.4I5704198j32871j55055j75673k00868k20585k35623k52545k65455k64889k58088
$$ 95704198 95571327 95416272 95240599 95039731 94819146 94583523 94330978 94065523 93800634 93542546
1225.8I3542546k56222k57433k52008k40410k32744k25913k04665j73235j53798j46430
$$ 93542546 93286324 93028891 92776883 92536473 92303729 92077816 91873151 91699916 91546118 91399688
1246.2I1399688j34153j11735q7744o0641k6167J8448P3647J15735J39916J59853J73593
$$ 91399688 91265535 91153800 91066056 91005415 90979248 90997696 91071343 91187078 91326994 91486847 91660440
1268.6I1660440J92040K13218K24858K35159K25579J74046R2173j032r4747j92511
$$ 91660440 91852480 92065698 92290556 92525715 92751294 92925340 93017513 93016481 92921734 92729223
1289I2729223k97392l95536m69989n17290n28509m88764m02868k94435j81103q4471
$$ 92729223 92431831 92036295 91566306 91049016 90520507 90031743 89628875 89334440 89153337 89068866
1309.4H9068866k8295j7350m4388r7156j69855k38466k85781l24934l55083l77423
$$ 89068866 89040571 89023221 88978833 88881677 88711822 88473356 88187575 87862641 87507558 87130135
1329.8H7130135m12255m51958m62014m45187m18073l56859k57593j40882j6796J03426
$$ 87130135 86717880 86265922 85803908 85358721 84940648 84583789 84326196 84185314 84168518 84271944
1350.2H4271944K17557L22884M04286M55499M95297N06073M25452L12900K26349J22279
$$ 84271944 84489501 84812385 85216671 85672170 86167467 86673540 87098992 87411892 87638241 87760520
1370.6H7760520L946j58298l48574m85063n72186o23471o21861n61547l92914j18280
$$ 87760520 87764466 87606168 87257594 86772531 86200345 85576874 84955013 84393466 84000552 83882272
1391H3882272J55497L14665K63953Q6397j41216l65924n74887o81359o36255n18126
$$ 83882272 84037769 84352434 84616387 84702784 84561568 84195644 83620757 82939398 82303143 81785017
1411.4H1785017l41040q0424L29661Q18962R66221Q82596P00670L70545M0572k30127
$$ 81785017 81443977 81363553 81693214 82512176 83478397 84360993 85061663 85432208 85472780 85242653
1431.8H5242653l64322m82541o45375o35058n64992n13447m41295l82375l13759k01202
$$ 85242653 84878331 84395790 83750415 83115357 82550365 82036918 81595623 81213248 80899489 80698287
1452.2H0698287l6972J64568K01291O5327Q4120J59633J81019K61051M73052O35779
$$ 80698287 80661315 80825883 81027174 81092501 81176621 81336254 81517273 81778324 82251376 82887155
1472.6H2887155M17423P6765j04213k18516l22134l88968m53967o16902q34924q58396
$$ 82887155 83304578 83381343 83277130 83058614 82736480 82347512 81893545 81276643 80441719 79583323
1493G9583323q51071j019734j129496j022214q08567p21115r40907r49144p34228o19161
$$ 79583323 78732252 77712518 76583022 75560808 74752241 74031126 73090219 72141075 71406847 70787686
1513.4G0787686n59449n59312n75096o76679p90686q00156q39639p98953p46542p91174
$$ 70787686 70228237 69668925 69093829 68417150 67626464 66826308 65986669 65187716 64441174 63650000
1533.8F3650000p12442n34988n48333o60968o13051n21964m12583l30758k71339k22695
$$ 63650000 62937558 62402570 61854237 61193269 60580218 60058254 59645671 59314913 59043574 58820879
1554.2E8820879j42508n7340j61064k58183k00546j40071j15299j63859k41769k62755
$$ 58820879 58678371 58621031 58459967 58201784 58001238 57861167 57745868 57582009 57340240 57077485
1574.6E7077485l70758n17887n88066o68472p55173q24141q68482q84413q61234q22946
$$ 57077485 56706727 56188840 55600774 54932302 54177129 53352988 52484506 51600093 50738859 49915913
1595D9915913p63500o96105o30909n76523n19889m77022m67691m60235m21485l77640
$$ 49915913 49152413 48456308 47825399 47248876 46728987 46251965 45784274 45324039 44902554 44524914
1615.4D4524914l92023l61183k67076j77530j41030j20119j17245j42959j56316k51159
$$ 44524914 44132891 43771708 43504632 43327102 43186072 43065953 42948708 42805749 42649433 42398274
1635.8D2398274m55988o01345o78462p29063q30558r10946p50357o81973p61932n83106
$$ 42398274 41942286 41340941 40662479 39933416 39102858 38191912 37441555 36759582 35997650 35414544
1656.2C5414544m12572k86066j46288k5037O1548K43542M33179M48922N69838P26586
$$ 35414544 35001972 34715906 34569618 34544581 34606129 34849671 35282850 35731772 36301610 37028196
1676.6C7028196O72734O38116Q19090J131206R27687O94883P67523P78830J011938
$$ 37028196 37700930 38339046 39158136 40289342 41217029 41911912 42679435 43458265 44470203
1694.9D4470203J281860J473704J954496J847285J922810K321530K311766K286982
$$ 44470203 45752063 47225767 49180263 51027548 52950358 55271888 57583654 59870636
1711.3E9870636K403069K703118L295714L220838K651048K692086K833306K672696
$$ 59870636 62273705 64976823 68272537 71493375 74144423 76836509 79669815 82342511
1727.6H2342511K488172K285570K374673K086664J426333J317233J224046R74864Q65877
$$ 82342511 84830683 87116253 89490926 91577590 93003923 94321156 95545202 96520066 97385943
1745.9I7385943Q13383P59536O46275N27519N19419N06687M69458M56119L90875L67439
$$ 97385943 98199326 98958862 99605137 100132656 100652075 101158762 101628220 102084339 102475214 102842653
1766.3A02842653M22716M50122L95632K48921J86193K31946K46071K14982J88721J73771
$$ 102842653 103265369 103715491 104111123 104360044 104546237 104778183 105024254 105239236 105427957 105601728
1786.7A05601728J77538K02465J56534N5969N8579J04654R0230M8649M4405N7745P6008
$$ 105601728 105779266 105981731 106138265 106194234 106252813 106357467 106447697 106496346 106540751 106598496 106674504
1809.2A06674504P0536M5872M2308M4727M6038N7662P9131Q4365P6210N1498k002j3769
$$ 106674504 106745040 106790912 106833220 106877947 106923985 106981647 107060778 107145143 107221353 107272851 107270849 107257080
1833.6A07257080J4305K3198L1686O5303O6793j466l8016j6189K325O640J6689K9969
$$ 107257080 107271385 107294583 107326269 107391572 107458365 107456899 107418883 107402694 107405019 107411659 107428348 107458317
1858.1A07458317J7560j097J5760N3203M3606k4795m6730j8239N36P773J0538J0586
$$ 107458317 107475877 107474780 107490540 107543743 107587349 107562554 107515824 107497585 107498121 107505894 107516432 107527018
1882.6A07527018P808O151J0693j526r835L910J932j1576j3053l493R251J3876o20
$$ 107527018 107534826 107540977 107551670 107550144 107540309 107544219 107546151 107534575 107521522 107518029 107527280 107541156 107540536
1909.1A07540536j6201j0001J0204J4734m267j4747j6534j8680j6618j4412r823r30
$$ 107540536 107524335 107514334 107524538 107539272 107535005 107520258 107503724 107485044 107468426 107454014 107444191 107443261
1933.6A07443261J371n078m280O44p975j7524j5819j1456q547p916j1623j6141r417
$$ 107443261 107444632 107439554 107435274 107435918 107427943 107410419 107394600 107383144 107374597 107366681 107355058 107338917 107329500
1960.1A07329500j955l70q488l1411l8851k5498j6153j3352j5330j9312j6045j1552
$$ 107329500 107327545 107327175 107318687 107287276 107248425 107222927 107206774 107193422 107178092 107158780 107142735 107131183
1984.6A07131183j0693r787p534j6689k5618j5378p141n84M542q488k3282j7905n841
$$ 107131183 107120490 107110703 107103169 107086480 107060862 107045484 107038343 107037759 107042301 107033813 107010531 106992626 106986785
2011.1A06986785k730n412q142j0288j1241j0622r703n496p272j3864j3685j0705j2958
$$ 106986785 106984055 106978643 106970501 106960213 106948972 106938350 106928647 106923151 106915879 106902015 106888330 106877625 106864667
2037.6A06864667j0061k253p904j6510q607L445j025q965q869q512p164j097J359j514
$$ 106864667 106854606 106852353 106844449 106827939 106819332 106822777 106821752 106812787 106803918 106795406 106788242 106787145 106788504 106786990
2066.2A06786990m339r275o294K706N746K253K98L422M124j466n758l171m053q869
$$ 106786990 106782651 106773376 106767082 106769788 106775534 106777787 106778085 106781507 106785631 106784165 106778407 106775236 106771183 106762314
2094.7A06762314q083p629j4138j1206k491l922k683j54m590q643r680j1527j5104
$$ 106762314 106754231 106746602 106732464 106721258 106718767 106714845 106712162 106712008 106707418 106698775 106689095 106677568 106662464
2121.2A06662464j6951k1077l0052l7277Tl1316l8111o3706q6033j03605j35255j77717
$$ 106662464 106645513 106624436 106594384 106557107 106519830 106488514 106450403 106386697 106300664 106197059 106061804 105884087
2145.7A05884087k20513k59948k83098k81418k40922j59382n6899N6732J63531K38609
$$ 105884087 105663574 105403626 105120528 104839110 104598188 104438806 104381907 104438639 104602170 104840779
2166.1A04840779K69997K60199K31301J99533J64342J28960R7120P1919N4491L6704
$$ 104840779 105110776 105370975 105602276 105801809 105966151 106095111 106192231 106264150 106318641 106355345
2186.5A06355345J9944J1349Q189J0813J3661Q345P450J7488K5153J7429J204L6J1265
$$ 106355345 106375289 106386638 106394827 106405640 106419301 106427646 106435096 106452584 106477737 106495166 106496370 106496406 106507671
2213A06507671J4901J1623O032N400J7572K7120K1231J8692L2031L6955L0661K9468
$$ 106507671 106522572 106534195 106540227 106545627 106563199 106590319 106611550 106630242 106662273 106699228 106729889 106759357
2237.5A06759357K6894K3508K9314L3700K3425J2529J1801J5152K2554K8789K4271
$$ 106759357 106786251 106809759 106839073 106872773 106896198 106908727 106920528 106935680 106958234 106987023 107011294
2259.9A07011294K0349K6560L2723L1591K6655K5499K7823K2626J1981J3721K3782
$$ 107011294 107031643 107058203 107090926 107122517 107149172 107174671 107202494 107225120 107237101 107250822 107274604
2282.3A07274604K3258P975m351k349L600N031j145j1146j9228k2674k5248k7549k7609
$$ 107274604 107297862 107305837 107301486 107299137 107302737 107307768 107306623 107295477 107276249 107253575 107228327 107200778 107173169
2308.9A07173169k1005m101M423j1754l7074l8493j3792P486R704O794J0384L1912
$$ 107173169 107152164 107148063 107152486 107140732 107103658 107065165 107051373 107058859 107068563 107075357 107085741 107117653
2333.3A07117653N3179K9206j6045k8920j5498K0135P0381O0070l386m6432m0543k1505
$$ 107117653 107170832 107200038 107183993 107155073 107139575 107159710 107230091 107290161 107286775 107240343 107199800 107178295
2357.8A07178295j5533m864J8334L3939M5884O7890P8380P0238P5042R6011J14966
$$ 107178295 107162762 107157898 107176232 107210171 107256055 107323945 107402325 107472563 107547605 107643616 107758582
2380.2A07758582J17266R7263O2740L3092K1911J9836J5879Q440K968K277J097N996
$$ 107758582 107875848 107973111 108035851 108068943 108090854 108110690 108126569 108135009 108137977 108140254 108141351 108147347
2404.7A08147347J5151J3924R036P308N722Q321J0097j20j1050j0598l10J5545J7321
$$ 108147347 108162498 108176422 108185458 108192766 108198488 108206809 108216906 108216786 108205736 108195138 108194828 108210373 108227694
2431.2A08227694K635j133M637O318J1361J3721Q524O914Q607Q022M435L815R238J5617
$$ 108227694 108230329 108229196 108233833 108240151 108251512 108265233 108273757 108280671 108289278 108297300 108301735 108305550 108314788 108330405
2459.8A08330405J9765J8775J2815P570O163P975J0133J3721J9848K3210J7035J2303
$$ 108330405 108350170 108368945 108381760 108389330 108395493 108403468 108413601 108427322 108447170 108470380 108487415 108499718
2484.3A08499718J8441J3125k789l445N531J7560K6845J8800R274R680Q750J1075J1456
$$ 108499718 108518159 108531284 108528495 108525050 108530581 108548141 108574986 108593786 108603060 108612740 108621490 108632565 108644021
2510.8A08644021n85k610R107J4973J7619K0027J4115O663J0825J4543J3221J7535
$$ 108644021 108643436 108640826 108649933 108664906 108682525 108702552 108716667 108723330 108734155 108748698 108761919 108779454
2535.3A08779454K0778J9861J3363M208P868J7428J7572Q082r18J896Q428J1754J5604
$$ 108779454 108800232 108820093 108833456 108837664 108845532 108862960 108880532 108888614 108887696 108889592 108898020 108909774 108925378
2561.8A08925378J4425L838m732k158M399K944m530l397l22j776N138J2028L385r167
$$ 108925378 108939803 108943641 108938909 108936751 108941150 108944094 108939564 108936167 108935845 108934069 108939207 108951235 108954620 108945453
2590.3A08945453j2886j1158o20R930P486L553J776l791m077N48o19l779l398p1l22
$$ 108945453 108932567 108921409 108920789 108930719 108938205 108941758 108943534 108939743 108935666 108936214 108935595 108931816 108928418 108928347 108928025
2620.9A08928025j1087j8751o152M149k468o270r346j3852k217R596Q82l159K74j0657
$$ 108928025 108916938 108898187 108892035 108896184 108893716 108887446 108878100 108864248 108862031 108871627 108872509 108869350 108869624 108858967
2649.5A08858967j8990q190N60r155k3270k5737j8036j3089j4091k5153l7575k7799
$$ 108858967 108839977 108831787 108832347 108823192 108799922 108774185 108756149 108743060 108728969 108703816 108666241 108638442
2673.9A08638442j3411k0099k0826J466J0407p057k5642k6631j8335j7857k3604k6321
$$ 108638442 108625031 108604932 108584106 108585572 108595979 108588922 108563280 108536649 108518314 108500457 108476853 108450532
2698.4A08450532j9407r561q285j9276l2938l2985k6822k5225k3758l6907o1131o6399
$$ 108450532 108431125 108421564 108413279 108394003 108361065 108328080 108301258 108276033 108252275 108215368 108154237 108087838
2722.9A08087838n8413l3593k301p593k6966l8051m7672m1497l5357n0044p5066q2195
$$ 108087838 108029425 107995832 107993531 107985938 107958972 107920921 107873249 107831752 107796395 107746351 107671285 107589090
2747.4A07589090n1701j4210j2696l6347m6789m2367m0877m5300m8458m6158m6325
$$ 107589090 107537389 107523179 107510483 107474136 107427347 107384980 107344103 107298803 107250345 107204187 107157862
2769.8A07157862o4230q2826n5921j6499k5094n5396p4041j00267j26982j00004n2607
$$ 107157862 107093632 107010806 106954885 106938386 106913292 106857896 106783855 106683588 106556606 106456602 106403995
2792.2A06403995o8391j16157j13702p1454o4981j00970j31810j38223j00613m3583
$$ 106403995 106335604 106219447 106105745 106034291 105969310 105868340 105736530 105598307 105497694 105454111
2812.6A05454111k7525l1257j9586q595q953j4424l0172o4957j01364j32239j86288
$$ 105454111 105426586 105395329 105375743 105367148 105358195 105343771 105313599 105248642 105147278 105015039 104828751
2835.1A04828751k75099l45826m38154p06887j122010j323855q73840P7301P68966
$$ 104828751 104553652 104207826 103769672 103062785 101940775 100616920 99743080 99820381 100589347
2853.4A00589347Q19814N22006K47621J14882M1247n2452j47093k32923k97606k64299
$$ 100589347 101409161 101931167 102178788 102293670 102334917 102282465 102135372 101902449 101604843 101340544
2873.8A01340544j69182j45471j72901j73664j63734j53708j31500j04785r8479j15436
$$ 101340544 101171362 101025891 100852990 100679326 100515592 100361884 100230384 100125599 100027120 99911684
2894.2I9911684j07402q4007j16634j95688k83426m10038o48302j016599j325113j243263
$$ 99911684 99804282 99720275 99603641 99407953 99124527 98714489 98066187 97049588 95724475 94481212
2914.6I4481212o78676O6083O15657Q25351P80714O09117M24683L32004K76649J74213
$$ 94481212 93802536 93868619 94484276 95309627 96090341 96699458 97124141 97456145 97732794 97907007
2935I7907007P8946L0464j8233o3968n9789k8062m0680j15353j38539n8180K8503Q9001
$$ 97907007 97985953 98016417 97998184 97934216 97874427 97846365 97805685 97690332 97551793 97493613 97522116 97611117
2959.5I7611117J38915J62423J66976J63978J44911J05727Q8155J16784J19710R7191
$$ 97611117 97750032 97912455 98079431 98243409 98388320 98494047 98582202 98698986 98818696 98915887
2979.9I8915887J30176J66059J31887O4111l982k4557J0157R751l171J5003m2l3665
$$ 98915887 99046063 99212122 99344009 99408120 99404138 99379581 99389738 99399489 99396318 99411321 99411279 99377614
3004.4I9377614n5545j11091j81598j76215r2059k3193j2129l4350o9827q5998q0043
$$ 99377614 99322069 99210978 99029380 98853165 98761106 98737913 98725784 98691434 98621607 98535609 98455566
3026.8I8455566j09315j67489k02077j67489j08111j55479k39706k16520j37895j12194
$$ 98455566 98346251 98178762 97976685 97809196 97701085 97545606 97305900 97089380 96951485 96839291
3047.2I6839291j61731j99211j81770j77205j79934j73694k04939k52789k83903k60174
$$ 96839291 96677560 96478349 96296579 96119374 95939440 95765746 95560807 95308018 95024115 94763941
3067.6I4763941j83434j63537k35325l34722l75599l11476k37029k15549j88309j91062
$$ 94763941 94580507 94416970 94181645 93846923 93471324 93159848 92922819 92707270 92518961 92327899
3088I2327899k28542k06989j83946k34074l00038l04055k56413k54655l27498l62771
$$ 92327899 92099357 91892368 91708422 91474348 91174310 90870255 90613842 90359187 90031689 89668918
3108.4H9668918l01081l00384m05747m29546l54100k64352j92034k15835l24714l89129
$$ 89668918 89367837 89067453 88661706 88232160 87878060 87613708 87421674 87205839 86881125 86491996
3128.8H6491996l65382l44646l91239m62008m66555l91066l53688l96598m53859n22441
$$ 86491996 86126614 85781968 85390729 84928721 84462166 84071100 83717412 83320814 82866955 82344514
3149.2H2344514n69302n08511m16934m26227m88854n26303n41126n47660n57679n70279
$$ 82344514 81775212 81266701 80849767 80423540 79934686 79408383 78867257 78319597 77761918 77191639
3169.6G7191639n76139n78367n84042n85956n77789n66983n59408n61404n69320n53447
$$ 77191639 76615500 76037133 75453091 74867135 74289346 73722363 73162955 72601551 72032231 71478784
3189.9G1478784n09947m77946m65179m42910m09943l78334l47257l11393k68101k24209
$$ 71478784 70968837 70490891 70025712 69582802 69172859 68794525 68447268 68135875 67867774 67643565
3210.3F7643565j89978j59419j29777j01387o1894l9303m8155n6004o5428r8413j10096
$$ 67643565 67453587 67294168 67164391 67063004 67001110 66961807 66913652 66857648 66792220 66693807 66583711
3232.8F6583711m0954J9705j9163q6683j30218j63722j62197j25348j25504j74123
$$ 66583711 66542757 66562462 66543299 66456616 66326398 66162676 66000479 65875131 65749627 65575504
3253.2F5575504j98143j77128j67709j89674k11376k28459k68077l15255k84022k01226
$$ 65575504 65377361 65200233 65032524 64842850 64631474 64403015 64134938 63819683 63535661 63334435
3273.6F3334435j77330k04050k41196k71714k85149k91246l07953l54046l84658l57485
$$ 63334435 63157105 62953055 62711859 62440145 62154996 61863750 61555797 61201751 60817093 60459608
3294F0459608l13085k86949l04347l87937m68660m45169l45451k73746k74485l17395
$$ 60459608 60146523 59859574 59555227 59167290 58698630 58253461 57908010 57634264 57359779 57042384
3314.4E7042384l47185l48300l39728l54070l74234l36843k75153k55984k61849k76077
$$ 57042384 56695199 56346899 56007171 55653101 55278867 54942024 54666871 54410887 54149038 53872961
3334.8E3872961k87056k41125j70725j36495j07336r2298j04177o0403L8677Q9377
$$ 53872961 53585905 53344780 53174055 53037560 52930224 52837926 52733749 52673346 52712023 52801400
3355.2E2801400P8172O8509J06282J52468J41984J29950J95545K88386L14414K84737
$$ 52801400 52879572 52948081 53054363 53206831 53348815 53478765 53674310 53962696 54277110 54561847
3375.5E4561847K63405K66594K80446K86615K73573K46787K11930K14863K65897K71523
$$ 54561847 54825252 55091846 55372292 55658907 55932480 56179267 56391197 56606060 56871957 57143480
3395.9E7143480K11149J76406K17110K58428K30044J84023J77843J86646J94162K02387
$$ 57143480 57354629 57531035 57748145 58006573 58236617 58420640 58598483 58785129 58979291 59181678
3416.3E9181678J93823J83338J83850J86896J93418K07632K21676K30253K40230K56253
$$ 59181678 59375501 59558839 59742689 59929585 60123003 60330635 60552311 60782564 61022794 61279047
3436.7F1279047K75945K89703K90006K97016L22777L25912L21120L49575L81947M02391
$$ 61279047 61554992 61844695 62134701 62431717 62754494 63080406 63401526 63751101 64133048 64535439
3457.1F4535439M27294M44597M58401M94516N42021N63025N62036N89538O37639O87289
$$ 64535439 64962733 65407330 65865731 66360247 66902268 67465293 68027329 68616867 69254506 69941795
3477.5F9941795P31796P64763P98822Q24058Q41826Q83126R44329R81771J000166J014233
$$ 69941795 70673591 71438354 72237176 73061234 73903060 74786186 75730515 76712286 77712452 78726685
3497.9G8726685J028526J064116J088690J062960J043182J038063R90462R32974R00209
$$ 78726685 79755211 80819327 81908017 82970977 84014159 85052222 86042684 86975658 87875867
3516.3H7875867Q67730Q06779P38770O89739O36917N80168N35923M99111M66496M39352
$$ 87875867 88743597 89550376 90289146 90978885 91615802 92195970 92731893 93231004 93697500 94136852
3536.7I4136852M12989L85195L65978L75390L94213L73102L33023L18378L10254L05045
$$ 94136852 94549841 94935036 95301014 95676404 96070617 96443719 96776742 97095120 97405374 97710419
3557.1I7710419L10093L15213L34054L42596K97445K30187K27219K74330K98727K84207
$$ 97710419 98020512 98335725 98669779 99012375 99309820 99540007 99767226 100041556 100340283 100624490
3577.5A00624490K57456K35736K33365K56943K80571K62642K35593K38157K31898K16210
$$ 100624490 100881946 101117682 101351047 101607990 101888561 102151203 102386796 102624953 102856851 103073061
3597.9A03073061K24304K32112K33603K55823K76541K60282K41542K35999K25913K04861
$$ 103073061 103297365 103529477 103763080 104018903 104295444 104555726 104797268 105033267 105259180 105464041
3618.3A05464041J65439J60789K29240L02982K87342J73128J28221J63842J85430J97565
$$ 105464041 105629480 105790269 106019509 106322491 106609833 106782961 106911182 107075024 107260454 107458019
3638.7A07458019K15686K41017K98703L49676K61343Q6808P8845J32442J24895J01388
$$ 107458019 107673705 107914722 108213425 108563101 108824444 108911252 108990097 109122539 109247434 109348822
3659A09348822J25324J80292K41626K85828K58219J86324J62375R4772l4535m5073
$$ 109348822 109474146 109654438 109896064 110181892 110440111 110626435 110788810 110883582 110849047 110803974
3679.4A10803974O091O1894J21057J18160N1630l994k5380M459O1428P4542J6725j6332
$$ 110803974 110810065 110871959 110993016 111111176 111162806 111158812 111133432 111137891 111199319 111273861 111290586 111274254
3703.9A11274254N6374J36590J06216l1483q5450k1803K8253L7992K1422p415o330
$$ 111274254 111330628 111467218 111573434 111541951 111456501 111434698 111462951 111500943 111522365 111514950 111508620
3726.4A11508620N4538J14882R8217j5116j15097n5241P9524J28985O6614M8363O6781
$$ 111508620 111563158 111678040 111776257 111761141 111646044 111590803 111670327 111799312 111865926 111914289 111981070
3748.8A11981070n2273j70434j02663j0478m554l7527j8525J2326J2410j4782o1512
$$ 111981070 111928797 111758363 111655700 111645222 111640668 111603141 111584616 111596942 111609352 111594570 111533058
3771.2A11533058n3895J1110L9793P438l612O759j8060l6788k5916J4138O9189Q0681
$$ 111533058 111479163 111490273 111530066 111537504 111533892 111540651 111522591 111485803 111459887 111474025 111543214 111623895
3795.7A11623895P4530O5267p475m2116k9206q2732q3041J9944Q6355N3704L5178K1673
$$ 111623895 111698425 111763692 111756217 111714101 111684895 111602163 111519122 111539066 111625421 111679125 111714303 111735976
3820.2A11735976p0906r0444l8767M745L6382L8016L6800L6645N01o3110j16515j08063
$$ 111735976 111665070 111574626 111535859 111540604 111576986 111615002 111651802 111688447 111688948 111625838 111509323 111401260
3844.6A11401260q655J25075K05588R2864j76430j80065l8624N9068O5136n36j1123
$$ 111401260 111392605 111517680 111723268 111816132 111639702 111459637 111421013 111480081 111545217 111544681 111533558
3867.1A11533558j5556n8103n1093k3151O402O688j8526k6500n2488k1124K8205k9909
$$ 111533558 111518002 111459899 111408806 111385655 111392057 111398745 111380219 111353719 111301231 111280107 111308312 111278403
3891.6A11278403o6292J0597P8821P5114K9516m4131j03950p5794k0301J395R286J1897
$$ 111278403 111212111 111222708 111301529 111376643 111406159 111362028 111258078 111182284 111161983 111163378 111172664 111184561
3916A11184561J967l052O581J0061k38m781j4972l9327l5537l34K6072K2375p152k3938
$$ 111184561 111186528 111183476 111190057 111200118 111199880 111195099 111180127 111140800 111105263 111104929 111131001 111153376 111146224 111122286
3944.6A11122286j0228M637K015r525j6367j5772q773l267k384m29K336O652O700M423
$$ 111122286 111112058 111116695 111118710 111109185 111092818 111077046 111068273 111065006 111062622 111062193 111064529 111071181 111077881 111082304
3973.1A11082304j526q309M387J5962P593M256l34k1827j6856J7595J2303j4258
$$ 111082304 111080778 111072469 111076856 111092818 111100411 111104667 111104333 111082506 111065650 111083245 111095548 111081290
3997.6A11081290
$$ 111081290
##END=$$ End of the data block
