##TITLE=Prato calcinado $$ Begin of the data block
##JCAMP-DX=5.00 $$ ACD/SpecManager v 10.08
##SPECTROMETER/DATA SYSTEM=Alpha
##DATE=29 Sep 2014 13:46:02
##DATA TYPE=INFRARED SPECTRUM
##DATA CLASS=XYDATA
##ORIGIN=
##OWNER=
##NPOINTS=1667
##FIRSTX=599.64648438
##LASTX=3997.64306641
##MAXX=3997.64306641
##MINX=599.64648438
##MAXY=1.10194647
##MINY=0.17124279
##XFACTOR=1.0000000000
##YFACTOR=0.000000010000000
##FIRSTY=0.55905461
##DELTAX=2.03961372
##XUNITS=1/CM
##YUNITS=ARBITRARY UNITS
##XYDATA=(X++(Y..Y))
599.6E5905461J38611K10500K78181K86859K63858K57390K36279K10691K10607J94978
$$ 55905461 56044072 56254572 56532753 56819612 57083470 57340860 57577139 57787830 57998437 58193415
620E8193415J58257J43683J37424J10752Q5359P9495Q2809R1624R3263Q6075Q7786
$$ 58193415 58351672 58495355 58632779 58743531 58828890 58908385 58991194 59082818 59176081 59262156 59349942
642.5E9349942R3639J03730J24323J32877J28824J20633J01918Q2875P3963N7060L7187
$$ 59349942 59443581 59547311 59671634 59804511 59933335 60053968 60155886 60238761 60312724 60369784 60406971
664.9F0406971J61719L35330J78373J04397J69111K00844K17956K26366K17516K04849
$$ 60406971 60568690 60904020 61082393 61186790 61355901 61556745 61774701 62001067 62218583 62423432
685.3F2423432J97303J87361J67257J66231J83642J91790J99527K11584K42818K87223
$$ 62423432 62620735 62808096 62975353 63141584 63325226 63517016 63716543 63928127 64170945 64458168
705.7F4458168L09974L19194L14081K62737J81741J48624J95843K92313L85231M23419
$$ 64458168 64768142 65087336 65401417 65664154 65845895 65994519 66190362 66482675 66867906 67291325
726.1F7291325L98964L55560L17311K83879K65151K58184K41691J97231J46967J02193
$$ 67291325 67690289 68045849 68363160 68647039 68912190 69170374 69412065 69609296 69756263 69858456
746.5F9858456L7968l4779p8351q3530n4955l2795n5390j08028j99049l22575l99917
$$ 69858456 69896424 69861645 69783294 69699764 69644809 69612014 69556624 69448596 69249547 68926972 68527055
768.9F8527055l69340k50131p7486J22583L12340M83101O41960P53093P94238Q05271
$$ 68527055 68157715 67907584 67830098 67952681 68265021 68748122 69390082 70143175 70937413 71742684
789.3G1742684Q14610Q24416Q32176Q14557P60299P01064O55443O18869N96434N80906
$$ 71742684 72557294 73381710 74213886 75028443 75788742 76489806 77145249 77764118 78360552 78941458
809.7G8941458N59330N45288N61833N85520N95623N94682N76872N37181M73970M17596
$$ 78941458 79500788 80046076 80607909 81193429 81789052 82383734 82960606 83497787 83971757 84389353
830.1H4389353L91882L77036L54659L37160L52818L90023L82477L21453K69640K54005
$$ 84389353 84781235 85158271 85512930 85850090 86202908 86592931 86975408 87296861 87566501 87820506
850.5H7820506K52116K28083J80501J43069J29550J33866J47415J57433J59622J48332
$$ 87820506 88072622 88300705 88481206 88624275 88753825 88887691 89035106 89192539 89352161 89500493
870.9H9500493J30892J27405J27339J19924J28305J44762J33044J17266J27536J36960
$$ 89500493 89631385 89758790 89886129 90006053 90134358 90279120 90412164 90529430 90656966 90793926
891.3I0793926J31934J31357J31613J13982Q6653O6930N9891P0870Q7440Q3900R1397
$$ 90793926 90925860 91057217 91188830 91302812 91389465 91456395 91516286 91587156 91674596 91758496 91849893
913.7I1849893J33831J63263J61719J54460J47491J25772R2602P4315O5106M3309J4931
$$ 91849893 91983724 92146987 92308706 92463166 92610657 92736429 92829031 92903346 92968452 93011761 93026692
936.2I3026692j2899l4690l8945l7283m6843o7127r3782j22058j40435j47831j53941
$$ 93026692 93013793 92979103 92940158 92902875 92856032 92788905 92695123 92573065 92432630 92284799 92130858
958.6I2130858j51867j58387j84679j98371j91378j77425j61076j46604j31833j08963
$$ 92130858 91978991 91820604 91635925 91437554 91246176 91068751 90907675 90761071 90629238 90520275
979I0520275r0760q5187q4824q7070r6882j21104j46479j70713k10303k67256l31866
$$ 90520275 90429515 90344328 90259504 90172434 90075552 89954448 89807969 89637256 89426953 89159697 88827831
1001.5H8827831m01265m73404n38891n95105o32459o40190o28107o08355n83875n52887
$$ 88827831 88426566 87953162 87414271 86819166 86186707 85546517 84918410 84310055 83726180 83173293
1021.8H3173293m99082m00442k62653j29670m7332k3812l0262m3541o5696j05876j66356
$$ 83173293 82674211 82273769 82011116 81881446 81834114 81810302 81780040 81736499 81670803 81564927 81398571
1044.3H1398571k12598k10405j72716j24484q4490p3880r4443j24819j45250j13547
$$ 81398571 81185973 80975568 80802852 80678368 80593878 80519998 80425555 80300736 80155486 80041939
1064.7H0041939k0206O1292P9512M6051p064m1335m8793o0957r0641j29128j74194
$$ 80041939 80021733 80083025 80162537 80208588 80201524 80160189 80111396 80050439 79959798 79830670 79656476
1087.1G9656476k24549k79975l38995l94678m45181m96120n47146n97203o52230p19816
$$ 79656476 79431927 79151952 78812957 78418279 77973098 77476978 76929832 76332629 75680399 74960583
1107.5G4960583q01527q84610r46373r80854r91887r75931r40609q95405q33338p38359
$$ 74960583 74159056 73274446 72328073 71347219 70355332 69379401 68438792 67543387 66710049 65971690
1127.9F5971690o22350n09566l89558k59357j29033R764J63138L13836M26859M93258
$$ 65971690 65349340 64839774 64450216 64190859 64061826 64071590 64234728 64548564 64975423 65468681
1148.3F5468681N31643N47553N39690N02151M34107L51339K66415J93203J46824J51819
$$ 65468681 66000324 66547877 67087567 67589718 68023825 68375164 68641579 68834782 68981606 69133425
1168.7F9133425K28786L65752N28628O68371P42739P41291O82926N94896N08160M36479
$$ 69133425 69362211 69727963 70256591 70924962 71667701 72408992 73091918 73686814 74194974 74631453
1189.1G4631453L55112K43950J23423J8162o5053j20109j52785j77234j99127k17748
$$ 74631453 74986565 75230515 75353938 75372100 75307047 75186938 75034153 74856919 74657792 74440044
1209.5G4440044k44659k88641l36749l77703m07981m18520m07708l92884l80832l75784
$$ 74440044 74195385 73906744 73569995 73192292 72784311 72365791 71958083 71565199 71184367 70808583
1229.9G0808583l72952l55452l30889l10201k88707k66915k43014k09040j78075j58888
$$ 70808583 70435631 70080179 69749290 69439089 69150382 68883467 68640453 68431413 68253338 68094450
1250.3F8094450j37585j03283m6766L1936J10346J67221K03890K34252K63107K90263
$$ 68094450 67956865 67853582 67806816 67838752 67949098 68116319 68320209 68554461 68817568 69107831
1270.7F9107831L16590L37177L52997L47697K85531J62529J5033j29062k72364m16338
$$ 69107831 69424421 69761598 70114595 70462292 70747823 70910352 70925385 70796323 70523959 70107621
1291.1G0107621n55921o75499p50202p59918p02518n93537m54956l02237j53339m8131
$$ 70107621 69551700 68876201 68125999 67366081 66663563 66070026 65615070 65312833 65159494 65111363
1311.5F5111363k0564o0796j21671j90789k75701l53748m08441m48674m87679n26821
$$ 65111363 65090799 65030003 64908332 64717543 64441842 64088094 63679653 63230979 62743300 62216479
1331.9F2216479n65440n82963n58394n17792m67366l71909k29525o6317R4146K42746
$$ 62216479 61651039 61068076 60509682 59991890 59524524 59152615 58923090 58856773 58950919 59193665
1352.3E9193665L86256N03450N66656O26838O90115O14398M50421L31008J81764J2660
$$ 59193665 59579921 60083371 60650027 61276865 61966980 62581378 63031799 63362807 63544571 63557231
1372.7F3557231j82545m31454o39129p80952q67891q60244p36040m87625j53774K18236
$$ 63557231 63374686 62943232 62304103 61523151 60655260 59795016 59058976 58571351 58417577 58635813
1393.1E8635813M96083M58324K21211j04832m32879o98668q53610q35669p01553m88662
$$ 58635813 59131896 59590220 59811431 59706599 59273720 58575052 57721442 56885773 56184220 55695558
1413.5E5695558j81765L46387J028341J246541J177818R87744N54568J33634k34914
$$ 55695558 55513793 55860180 56888521 58135062 59312880 60300624 60855192 60988826 60753912
1431.8F0753912m64756n86181p40773p81280p28112o71900n84673m89021m12339l25334
$$ 60753912 60289156 59702975 58962202 58180922 57452810 56780910 56196237 55707216 55294877 54969543
1452.2E4969543j59502J64277L16387O5756L9881K04259K47872K17653M17333P71207
$$ 54969543 54810041 54974318 55290705 55356461 55396342 55600601 55848473 56066126 56483459 57254666
1472.6E7254666O96254K88355J0604j76728l46827m72778n53358o82473r11039j023919
$$ 57254666 57950920 58239275 58249879 58073151 57726324 57253546 56700188 56017715 55106676 54082757
1493E4082757j048660j165950j258022j209548j054469q92877q88890r22940q24865
$$ 54082757 53034097 51868147 50610125 49400577 48346108 47453231 46564341 45641401 44816536
1511.4D4816536p22450o38914o19764o20210o31705p25937p63624p58088p44298o79448
$$ 44816536 44094086 43455172 42835408 42215198 41583493 40857556 40093932 39335844 38591546 37912098
1531.8C7912098o30299o67017n99954m01232l72663m77877m79102m13212l34850k85620
$$ 37912098 37281799 36614782 36014828 35613596 35240933 34763056 34283954 33870742 33535892 33250272
1552.2C3250272k68066k17864O8447J60730k34919k72608j69966q5691n9527k24355
$$ 33250272 32982206 32764342 32832789 32993519 32758600 32485992 32316026 32230335 32170808 31946453
1572.6C1946453k54228j72043l30949m96590n33098n63633n99582o23980o31296o06230
$$ 31946453 31692225 31520182 31189233 30692643 30159545 29595912 28996330 28372350 27741054 27134824
1593B7134824n70324n28074m84377m24367l76989l53674l25455k89406l02093l41852
$$ 27134824 26564500 26036426 25552049 25127682 24750693 24397019 24071564 23782158 23480065 23138213
1613.4B3138213k57878j41252k36761k63690j18556q5634j02023j05872j93198j83347
$$ 23138213 22880335 22739083 22502322 22238632 22120076 22034442 21932419 21826547 21633349 21450002
1633.7B1450002l5442j54281m07105m93795n10493m24804m07259n26196l95304r2014
$$ 21450002 21414560 21260279 20853174 20359379 19848886 19424082 19016823 18490627 18095323 18003309
1654.1A8003309k47312l52350k28980m7047K8754l2095J11227L12218K36800L02398
$$ 18003309 17755997 17403647 17174667 17127620 17156374 17124279 17235506 17547724 17784524 18086922
1674.5A8086922M47306L14065K09362M18671Q30962O13179L18630L70160L51951N79981
$$ 18086922 18534228 18848293 19057655 19476326 20307288 20920467 21239097 21609257 21961208 22541189
1694.9B2541189Q44440J035863J521114J365041J431245J889744J943812J963422K158454
$$ 22541189 23385629 24421492 25942606 27307647 28738892 30628636 32572448 34535870 36694324
1713.3C6694324K628082L557003L675353L086335L274971L604668L530753L392857
$$ 36694324 39322406 42879409 46554762 49641097 52916068 56520736 60051489 63444346
1729.6F3444346L215409L572368L306419K253157K119177K055115J666522J465756
$$ 63444346 66659755 70232123 73538542 75791699 77910876 79965991 81632513 83098269
1745.9H3098269J377505J360106J234281J003385R67556R69303R04345R05919Q12710
$$ 83098269 84475774 85835880 87070161 88073546 89041102 90010405 90914750 91820669 92633379
1764.3I2633379P41642P98351Q21006P98816O43897N10245N24414N38492M96089M50045
$$ 92633379 93375021 94173372 94994378 95793194 96437091 96947336 97471750 98010242 98506331 98956376
1784.7I8956376M11755L83574L92395L49009K44057K29013K60294K43878J98364J80161
$$ 98956376 99368131 99751705 100144100 100493109 100737166 100966179 101226473 101470351 101668715 101848876
1805.1A01848876J88947K05648J98269J68884J55103J53863J58382J74570J87731J77502
$$ 101848876 102037823 102243471 102441740 102610624 102765727 102919590 103077972 103252542 103440273 103617775
1825.5A03617775J60218J34909Q8572Q0026J01173R8979R9385J26302J21045O2323
$$ 103617775 103777993 103912902 104001474 104081500 104182673 104281652 104381037 104507339 104628384 104690707
1845.9A04690707M5061O0749N9438N7292O1178O4337O2513N9271P1550R3281P2789
$$ 104690707 104735768 104796517 104855955 104913247 104974425 105038762 105101275 105160546 105232096 105325377 105398166
1868.3A05398166J1921n698J9133M1234M5383L8243L8647M0877M1569M1926K8979K4569
$$ 105398166 105410087 105404389 105423522 105464756 105510139 105548382 105587029 105627906 105669475 105711401 105740380 105764949
1892.8A05764949K5499J9443J9765K5034L3093M0233L7813J8024l934M578L5286L3104
$$ 105764949 105790448 105809891 105829656 105854690 105887783 105928016 105965829 105983853 105979919 105984497 106019783 106052887
1917.3A06052887P201Q678J5545P677j502l135L803Q046L279N173J4949J6964N078
$$ 106052887 106060088 106068766 106084311 106091988 106090486 106087351 106091154 106099200 106102479 106107652 106122601 106139565 106144643
1943.8A06144643r751j7727j1718j407r42m863j2970j3614q881n460j1253l1567l8290
$$ 106144643 106134892 106117165 106105447 106104040 106103098 106098235 106085265 106071651 106062770 106057310 106046057 106014490 105976200
1970.3A05976200k4617j5747k0898k4628k3234k2185j9574j5342j0813p903k1470l2425
$$ 105976200 105951583 105935836 105914938 105890310 105867076 105844891 105825317 105809975 105799162 105791259 105769789 105737364
1994.8A05737364j8537o604l636l350p617j2755r680k694k742l481l22n293j3339j2076
$$ 105737364 105718827 105712223 105708587 105705237 105697620 105684865 105675185 105672491 105669749 105666268 105665946 105660653 105647314 105635238
2023.3A05635238p749l529p891j3614j2362j2123j5247j2136o056j4281k4021j6808
$$ 105635238 105627489 105623960 105616069 105602455 105590093 105577970 105562723 105550587 105544531 105530250 105506229 105489421
2047.8A05489421o759j3984k0527j1599k134n49J300N197L815R5J145O890O020R90
$$ 105489421 105482662 105468678 105448151 105436552 105434418 105433869 105435169 105440366 105444181 105444276 105445421 105452311 105458331 105459321
2076.4A05459321K98K372K062j728n353q190j0788j5438j8787j4710j0002j4782j5330
$$ 105459321 105459619 105461991 105464053 105462325 105456972 105448782 105437994 105422556 105403769 105389059 105379057 105364275 105348945
2102.9A05348945r299j3196j9920j9383j6690j6558k1017l2222m0877m1902n0413o9094
$$ 105348945 105339646 105326450 105306530 105287147 105270457 105253899 105232882 105200660 105159783 105117881 105067468 104998374
2127.3A04998374q0168q3125r4175j18542j50680j89877k44594l24714m25470n29718
$$ 104998374 104918206 104835081 104740906 104622364 104471684 104281807 104037213 103712499 103287029 102757311
2147.7A02757311o19793o70052o65080n87368m19796j82885Q5187L35461N19538O19960
$$ 102757311 102137518 101467466 100802386 100215018 99795222 99612337 99697524 100032985 100552523 101172483
2168.1A01172483O44910O05023N18370M17971L25275K45547J81055J30070Q7285N6684
$$ 101172483 101817393 102422416 102940786 103358757 103684032 103929579 104110634 104240704 104327989 104384673
2188.5A04384673M4834M2081L9184L2687K3163K1624K9910L5238K6167Q618K814J1563
$$ 104384673 104429507 104471588 104510772 104543459 104566622 104588246 104618156 104653394 104679561 104688179 104690993 104702556
2213A04702556J9443J5319M184J1194L6144M8435M4643M7851O2084O1429M8649M7350
$$ 104702556 104721999 104737318 104741502 104752696 104788840 104837275 104881918 104929769 104991853 105053282 105101931 105149281
2237.5A05149281M9377M4941M5526M7589L7122K6381K6869L2533M2104N5683O1321
$$ 105149281 105198658 105243599 105289125 105336714 105373836 105400217 105427086 105459619 105501723 105557406 105618727
2259.9A05618727N7686N5050N0366M4906M6325M3547L3832K9910K8658K4294K3222
$$ 105618727 105676413 105731463 105781829 105826735 105873060 105916607 105950439 105980349 106009007 106033301 106056523
2282.3A06056523L0017L1448K4771K1530J9705J6212J5331J7356J7000J6880K1958
$$ 106056523 106086540 106117988 106142759 106164289 106183994 106200206 106215537 106232893 106249893 106266773 106288731
2304.8A06288731L3963L7253K7966K5130L1077M5956N9580N7030M9484N3871O3753
$$ 106288731 106322694 106359947 106387913 106413043 106444120 106490076 106549656 106606686 106656170 106710041 106773794
2327.2A06773794N9485L6752L4368N8139N3835J9347l314l1531q6462p4101K0099J17636
$$ 106773794 106833279 106870031 106904399 106962538 107016373 107035720 107032406 107000875 106914413 106840312 106860411 106978047
2351.7A06978047J62160J39571R7715M7732k146k8872o0320j02878j05095q8227q6522
$$ 106978047 107140207 107279778 107377493 107425225 107423079 107394207 107333887 107231009 107125914 107037687 106951165
2374.1A06951165p4172m5502j4675P093J2338M709k980r42M173k099j2838j3650j2386
$$ 106951165 106876993 106831491 106816816 106823909 106836247 106840956 106837976 106837034 106841207 106839108 106826270 106812620 106800234
2400.6A06800234j6927j4913n150l779r203j2887j5640j7977j9693k3532k9039l0816
$$ 106800234 106783307 106768394 106763244 106759465 106750262 106737375 106721735 106703758 106684065 106660533 106631494 106600678
2425.1A06600678k0433n626p618j6927j6201j1527r954j1313j5903j9073j1230j073
$$ 106600678 106580245 106574619 106567001 106550074 106533873 106522346 106512392 106501079 106485176 106466103 106454873 106453800
2449.6A06453800O92k361m017K181P272K146m041n889M05O843j776r013n36R262J0848
$$ 106453800 106454492 106452131 106448114 106450295 106457567 106459713 106455672 106449783 106450188 106457031 106455255 106446242 106445706 106454968 106465816
2480.2A06465816P582N603N698J741n424j2398j5450m673Q321O950J31o580j0634q535
$$ 106465816 106473398 106479001 106484699 106486440 106481016 106468618 106453168 106448495 106456816 106463766 106463897 106457317 106446683 106438148
2508.7A06438148q488j2993j4711j0431l719J872P402O795K814L636Q58l22N114Q726
$$ 106438148 106429660 106416667 106401956 106391525 106387806 106389678 106397080 106403875 106406689 106410325 106411183 106410861 106415975 106424701
2537.3A06424701O688p63n639m244j31K230p415j9634j5843j6284k4748j8561j2409
$$ 106424701 106431389 106430626 106424987 106420743 106420612 106422842 106415427 106395793 106379950 106363666 106338918 106320357 106307948
2563.8A06307948k3306l5167l3187k4510k4104l1614l2306l3748l9590l2424k0814
$$ 106307948 106284642 106249475 106216288 106191778 106167674 106136060 106103754 106070006 106030416 105997992 105977178
2586.2A05977178k6715m3512m9984m4262l1794k8455l8123l8922l2973l7873l9959
$$ 105977178 105950463 105906951 105856967 105812705 105780911 105752456 105714333 105675411 105642438 105604565 105564606
2608.7A05564606k8968l1852m8054n4311m8376m0257m4548n0712m1854l1912l6765
$$ 105564606 105535638 105503786 105455732 105401421 105353045 105312788 105268240 105217528 105175674 105143762 105106997
2631.1A05106997m8077n3691n2631m0257l1054l9077m5550m8959n4562n8484o0738
$$ 105106997 105058920 105005229 104952598 104912341 104881287 104842210 104796660 104747701 104693139 104634655 104573917
2653.5A04573917n9235o2477p0620p2658p0369o9535p1251q3781r8502r0730q0193
$$ 104573917 104514682 104452205 104381585 104308927 104238558 104169023 104097772 104013991 103915489 103824759 103744566
2676A03744566r1266q6689n0473l5298n9903q1861q6105q5401p9024q2064r1386q1050
$$ 103744566 103653300 103566611 103516138 103480840 103420937 103339076 103252971 103167570 103088546 103006482 102915096 102834046
2700.5A02834046o8903p7140r2936r6238r1612r6869r9123r1803j05751j34420j43802
$$ 102834046 102765143 102688003 102595067 102498829 102407217 102310348 102211225 102119422 102013671 101879251 101735449
2722.9A01735449j37687j07562o7544p6247j12104j35779j43564j24145j14059j36304
$$ 101735449 101597762 101490200 101422656 101346409 101234305 101098526 100954962 100830817 100716758 100580454
2743.3A00580454j67108j77216j44410j01596r9826j30940j44511j38510j39510j36453
$$ 100580454 100413346 100236130 100091720 99990124 99890298 99759358 99614847 99476337 99336827 99200374
2763.7I9200374j23197j18387j32602j68133j92547j54060j09047j26993j60980j81830
$$ 99200374 99077177 98958790 98826188 98658055 98465508 98311448 98202401 98075408 97914428 97732598
2784.1I7732598k25109k68019k39783j83648j95306k52766k60073k14183k08175k45262
$$ 97732598 97507489 97239470 96999687 96816039 96620733 96367967 96107894 95893711 95685536 95440274
2804.5I5440274k72542k77048k25687j46186j11455r7239p3195n8883n9694p1544j00243
$$ 95440274 95167732 94890684 94664997 94518811 94407356 94310117 94236922 94178039 94118345 94046801 93946558
2826.9I3946558j53851k23887l03179m08322n58126p15119r35190j425761k158589
$$ 93946558 93792707 93568820 93265641 92857319 92299193 91584074 90648884 89223123 87064534
2845.3H7064534k506077j632756J97166J535154J593953R42201L67057J00893k7168
$$ 87064534 84558457 82925701 83122867 84658021 86251974 87194175 87561232 87662125 87634957
2863.6H7634957j69927l12132m50211n66990n35434l95602l39943l63398l61663l39913
$$ 87634957 87465030 87152898 86702687 86135697 85600263 85204661 84864718 84501320 84139657 83799744
2884H3799744l08657k51764j94353j86759k19542k18534j99819k47818l62188n19073
$$ 83799744 83491087 83239323 83044970 82858211 82638669 82420135 82220316 81972498 81610310 81091237
2904.4H1091237p87562j324022k150226k743530k241051o54316Q80349J570910J582581
$$ 81091237 80303675 78979653 76829427 74085897 71844846 71190530 72070879 73641789 75224370
2922.8G5224370J311010R36639N71537L79658L12948K16007J09792M1878j9109o5988
$$ 75224370 76535380 77472019 78043556 78423214 78736162 78952169 79061961 79103839 79084730 79018742
2943.2G9018742o7926o5422j39683k85310l18902j61523L3641J74522K63703K96265
$$ 79018742 78950816 78885394 78745711 78460401 78141499 77979976 78013617 78188139 78451842 78748107
2963.6G8748107K77811K37495K03222J67596J46652J68073J70773J41501J67728K12294
$$ 78748107 79025918 79263413 79466635 79634231 79780883 79948956 80119729 80261230 80428958 80641252
2984H0641252J72615P2360k1780m7814q446j6839m7099l0804m9019r6083j27828j93637
$$ 80641252 80813867 80886227 80864447 80816633 80808187 80791348 80744249 80713445 80664426 80568343 80440515 80246878
3008.4H0246878k73115k66534j80656j15788j01631j17648j62369j90437j81514k13450
$$ 80246878 79973763 79707229 79526573 79410785 79309154 79191506 79029137 78838700 78657186 78443736
3028.8G8443736k86579l25954k81132k16907k77358l77858l58188k66540k38055l11637
$$ 78443736 78157157 77831203 77550071 77333164 77055806 76677948 76319760 76053220 75815165 75503528
3049.2G5503528l58641l26526l15374l21240l16000l50505m11683m47935m10014l31462
$$ 75503528 75144887 74818361 74502987 74181747 73865747 73515242 73103559 72655624 72245610 71914148
3069.6G1914148l22491l88473m78333n13560m34875l51286l44646l42292l50886l71355
$$ 71914148 71591657 71203184 70724851 70211291 69776416 69425130 69080484 68738192 68387306 68015951
3090F8015951l35801l14992l69949m33784m30244l81631l88312m59433m91560m42564
$$ 68015951 67680150 67365158 66995209 66561425 66131181 65749550 65361238 64901805 64410245 63967681
3110.4F3967681m46934n39559n57464m86922m00299l37076l69043m60290n05609m87137
$$ 63967681 63520747 62981188 62423724 61936802 61536503 61199427 60830384 60370094 59864485 59377348
3130.8E9377348m74333n17655n81944n91790n27931m89181n19949n65148o26856o73347
$$ 59377348 58903015 58385360 57803416 57211626 56683695 56194514 55674565 55109417 54482561 53809214
3151.2E3809214o19209n33146n35709n84018o09374o21891o28087o27470o28581o30486
$$ 53809214 53190005 52656859 52121150 51537132 50927758 50305867 49677780 49050310 48421729 47791243
3171.6D7791243o28242o21751o14608o11209o06946n90458n70995n61675n43249n10382
$$ 47791243 47163001 46541250 45926642 45315433 44708487 44118029 43547034 42985359 42442110 41931728
3192D1931728m81964m52554m14330l82954l62968l44464l14474k66207k16031j77642
$$ 41931728 41449764 40997210 40582880 40199926 39836958 39492494 39178020 38911813 38695782 38518140
3212.4C8518140j50854j34742j11708p5215n5808n5498n4735o3997r4170j03247m6500
$$ 38518140 38367286 38232544 38120836 38045621 37989813 37934315 37879580 37815583 37721413 37618166 37571666
3234.8C7571666k179l9682q8516j12071j37937j41928j17504j20551j59573j81330
$$ 37571666 37569487 37529805 37441289 37329218 37191281 37049353 36931849 36811298 36651725 36470395
3255.2C6470395j60014j41475j55955j70687j87791k27326k59983k31016j66923j50666
$$ 36470395 36310381 36168906 36012951 35842264 35654473 35427147 35167164 34936148 34769225 34618559
3275.6C4618559j78080k06626k18832k21867k30381k48208k77537k86934k64037k41711
$$ 34618559 34440479 34233853 34015021 33793154 33562773 33314565 33037028 32750094 32486057 32244346
3296C2244346k30831k44937k93806l34194l19204k61170k15026k12783k37054k51606
$$ 32244346 32013515 31768578 31474772 31140578 30821374 30560204 30345178 30132395 29895341 29643735
3316.4B9643735k53600k52947k55689k58529k30840j98966j88393j70755j71122j99395
$$ 29643735 29390135 29137188 28881499 28622970 28392130 28193164 28004771 27834016 27662894 27463499
3336.8B7463499j87546j32737r7769p7400o1387o9207n2088J0922M9782L7873K8285
$$ 27463499 27275953 27143216 27045447 26968047 26906660 26837453 26785365 26796287 26846069 26883942 26912227
3359.2B6912227O4633J03491R6825Q3274J18583J82003K06834J96647J91561J89850
$$ 26912227 26976860 27080351 27177176 27260450 27379033 27561036 27767870 27964517 28156078 28345928
3379.6B8345928J88121J91280J92034J84390J63031J54942J77694J93145J70556J41671
$$ 28345928 28534049 28725329 28917363 29101753 29264784 29419726 29597420 29790565 29961121 30102792
3400C0102792J59660J85648J69814J44881J41885J46768J53321J51703J41415J44082
$$ 30102792 30262452 30448100 30617914 30762795 30904680 31051448 31204769 31356472 31497887 31641969
3420.4C1641969J46166J46514J54236J68922J80918J87990J97232K01935K00665K01344
$$ 31641969 31788135 31934649 32088885 32257807 32438725 32626715 32823947 33025882 33226547 33427891
3440.8C3427891K06289K31206K72823K67672K44910K71603L16289L41255L51518L57628
$$ 33427891 33634180 33865386 34138209 34405881 34650791 34922394 35238683 35579938 35931456 36289084
3461.2C6289084L79458M36136M90046M78476M41694M82384N67838O38774O96650P24981
$$ 36289084 36668542 37104678 37594724 38073200 38514894 38997278 39565116 40203890 40900540 41625521
3481.6D1625521P38719P90292Q54933Q92854R41372J008728J080471J120374J148373
$$ 41625521 42364240 43154532 44009465 44902319 45843691 46852419 47932890 49053264 50201637
3500E0201637J224803J259739J221710J253903J318687J306069J251924J188553J145422
$$ 50201637 51426440 52686179 53907889 55161792 56480479 57786548 59038472 60227025 61372447
3518.3F1372447J124001J100432J035446R43804Q92222Q44985P81924P59989P44313
$$ 61372447 62496448 63596880 64632326 65576130 66468352 67313337 68095261 68855250 69599563
3536.7F9599563O77639O40601O67906P01415O78999O05160N86545O12116N88912N66053
$$ 69599563 70277202 70917803 71585709 72287124 72966123 73571283 74157828 74769944 75358856 75924909
3557.1G5924909N82475N76490N55485O02728O72585N91082M92370N17654N65338N73796
$$ 75924909 76507384 77083874 77639359 78242087 78914672 79505754 79998124 80515778 81081116 81654912
3577.5H1654912N51945N15831N03671N78570O58816N68200M75806N28132N60123N23043
$$ 81654912 82206857 82722688 83226359 83804929 84463745 85031945 85507751 86035883 86596006 87119049
3597.9H7119049N20336N22012M96250N24336N91648N79840N45430N31060N16903N54800
$$ 87119049 87639385 88161397 88657647 89181983 89773631 90353471 90898901 91429961 91946864 92501664
3618.3I2501664N47314M64123M56095N60391O94299N89818M21381M55802N03224N18728
$$ 92501664 93048978 93513101 93969196 94529587 95223886 95813704 96235085 96690887 97194111 97712839
3638.7I7712839N41180N41937N68152O63382O97708N20861L81482M19068M56941M06373
$$ 97712839 98254019 98795956 99364108 100027490 100725198 101246059 101627541 102046609 102503550 102909923
3659A02909923M05585M52710M94229N41354N39243M32813L51155L09324J83785J40715
$$ 102909923 103315508 103768218 104262447 104803801 105343044 105775857 106127012 106436336 106620121 106760836
3679.4A06760836J84989K19011K49505K46775J92618J25456P8965Q5902J26791J36375
$$ 106760836 106945825 107164836 107414341 107661116 107853734 107979190 108058155 108144057 108270848 108407223
3699.8A08407223R0730N1189J02544J88040J76490K0933o4540N651P3599Q8990O7294
$$ 108407223 108497953 108549142 108651686 108839726 109016216 109037149 108972609 108978260 109051859 109140849 109208143
3722.3A09208143K5284Q869N8210J25659J36006K9575j02913o1822R3770J71876R5534
$$ 109208143 109233427 109242296 109300506 109426165 109562171 109591746 109488833 109427011 109520781 109692657 109788191
3744.7A09788191M5336Q6748j5318j72150j05965J8024K5380k6238p379L1995L5620
$$ 109788191 109833527 109920275 109904957 109732807 109626842 109644866 109670246 109644008 109636629 109668624 109704244
3767.1A09704244J8513l2425m4035J9371M9329P021o091J2326q94j0765m482K0027
$$ 109704244 109722757 109690332 109646297 109665668 109714997 109722018 109715927 109728253 109727359 109716594 109712112 109732139
3791.6A09732139O5124R0110R8908P9847j7071n4550j7202n9521p2098J7047Q3506
$$ 109732139 109797263 109887373 109986281 110066128 110049057 109994507 109977305 109917784 109845686 109862733 109946239
3814.1A09946239O5339N7709L6490q1277j02031l1722P558L3343M2951L7646L3593
$$ 109946239 110011578 110069287 110105777 110024500 109922469 109890747 109898305 109931648 109974599 110012245 110045838
3836.5A10045838M542n4598j02973r7572Q3J38998K03550N6779k04837j64616k0635
$$ 110045838 110050380 109995782 109892809 109795237 109795320 109934318 110137868 110194647 109989810 109825194 109804559
3858.9A09804559N2714N3775M781J3733To6698q7440l2580L6299M3917j3137l5810
$$ 109804559 109857273 109911048 109915829 109929562 109943295 109876597 109789157 109756577 109792876 109836793 109823656 109787846
3883.4A09787846n0509l1424P212l9124o0213K7657R9277Q8942K8789o2656j30034
$$ 109787846 109737337 109705913 109713125 109674001 109613788 109641445 109740722 109829664 109858453 109795797 109665763
3905.8A09665763r2399j5163K2816K2996R155n436k944J0633Q524m268q750j9002l7932
$$ 109665763 109573364 109558201 109581017 109604013 109613168 109607732 109604788 109615421 109623945 109619677 109610927 109591925 109553993
3932.3A09553993k7335M005J7608J6641M602j693J4603J2398j0824j2672l684r322
$$ 109553993 109526658 109530663 109548271 109564912 109569514 109567821 109582424 109594822 109583998 109571326 109567642 109558320
3956.8A09558320j8156j0645l135k253J0800J8597R513P844L922j0169l767J3328J1754
$$ 109558320 109540164 109529519 109526384 109524131 109534931 109553528 109563041 109570885 109574807 109564638 109560871 109574199 109585953
3983.3A09585953P546J0264o557k2340j514J6630J0181
$$ 109585953 109593499 109603763 109597206 109574866 109573352 109589982 109600163
3997.6A09600163
$$ 109600163
##END=$$ End of the data block
