##TITLE=Prato Melamina $$ Begin of the data block
##JCAMP-DX=5.00 $$ ACD/SpecManager v 10.08
##SPECTROMETER/DATA SYSTEM=Alpha
##DATE=25 Sep 2014 10:55:34
##DATA TYPE=INFRARED SPECTRUM
##DATA CLASS=XYDATA
##ORIGIN=
##OWNER=
##NPOINTS=1765
##FIRSTX=399.76428223
##LASTX=3997.64306641
##MAXX=3997.64306641
##MINX=399.76428223
##MAXY=1.00054622
##MINY=0.66867858
##XFACTOR=1.0000000000
##YFACTOR=0.000000010000000
##FIRSTY=1.00000000
##DELTAX=2.03961372
##XUNITS=1/CM
##YUNITS=ARBITRARY UNITS
##XYDATA=(X++(Y..Y))
399.8A00000000l2198j3358n66j22994k29723j24973j0132j03671k68590k17498n3632
$$ 100000000 99967802 99954444 99953878 99830884 99601161 99476188 99466056 99362385 99093795 98876297 98822665
422.2I8822665o0320j04916j4061J06532K259k51168k90394j09392p7391k43795k70259
$$ 98822665 98762345 98657429 98643368 98749900 98752159 98500991 98210597 98101205 98023814 97780019 97509760
444.6I7509760r6327o3962k32113k44349J3221J70010k9689k42597j16140N1731o0725
$$ 97509760 97413433 97349471 97117358 96873009 96886230 97056240 97026551 96783954 96667814 96719545 96658820
467.1I6658820j69063N0617K92825J24276j35964k4420J99318Q2540j80346j31440
$$ 96658820 96489757 96540374 96833199 96957475 96821511 96797091 96996409 97078949 96898603 96767163
487.5I6767163R2036L9708k14564k10977K5606L8898k08956k54977k3359M2993j73813
$$ 96767163 96859199 96898907 96684343 96473366 96498972 96537870 96328914 96073937 96050578 96093571 95919758
509.9I5919758k88504j37317l0196j43743k30616r2226M2146n5122j93441j26094n24
$$ 95919758 95631254 95493937 95463741 95319998 95089382 94997156 95039302 94984180 94790739 94664645 94664121
532.3I4664121n6607j88875j48487M738J7310j17845j72108r8854p0173j41537j87797
$$ 94664121 94607514 94418639 94270152 94274890 94292200 94174355 94002247 93903393 93833220 93691683 93503886
554.8I3503886j35827p3135p9232j07241q6259l7492l5083p7170q8555m9829j9557
$$ 93503886 93368059 93294924 93215692 93108451 93022192 92984700 92949617 92872447 92783892 92734063 92714506
577.2I2714506m3296r0284j01566p7420q3208j32239j13750M006L7449j10823k35128
$$ 92714506 92671210 92580926 92479360 92401940 92318732 92186493 92072743 92076749 92114198 92003375 91768247
599.6I1768247j51938k2763n4491j35314l4678J72597K11763J02115J22094K69306
$$ 91768247 91616309 91593546 91539055 91403741 91369063 91541660 91753423 91855538 91977632 92246938
620I2246938K62218P1115k9522P4553J29479j0723r6327P0280K48712J71924K5719
$$ 92246938 92509156 92580271 92550749 92625302 92754781 92744058 92647731 92718011 92966723 93138647 93164366
642.5I3164366J01024K52146J68633k8866J502J79076J46777o2466q7744Q5235P8916
$$ 93164366 93265390 93517536 93686169 93657303 93658805 93837881 93984658 93922192 93834448 93919683 93998599
664.9I3998599k06178k17718K75099M28218K45130P3957J71191L06433J93399O372
$$ 93998599 93792421 93574703 93849802 94278020 94523150 94597107 94768298 95074731 95268130 95274502
685.3I5274502N6046K29770J92833R084J6987J91289K05964L0268k9272J22928K10554
$$ 95274502 95330548 95560318 95753151 95762235 95779222 95970511 96176475 96206743 96177471 96300399 96510953
707.7I6510953P7802l8553O3569J82169Q5074n5307J5235J56850J11287k8330L4589
$$ 96510953 96588755 96550202 96613771 96795940 96881014 96825707 96840942 96997792 97109079 97080749 97115338
730.2I7115338K51418K86281J03110k8264N996K7216r9808k40207k21038j19597j20288
$$ 97115338 97366756 97653037 97756147 97727883 97733879 97761095 97661287 97421080 97200042 97080445 96960157
752.6I6960157j94532j52844J4079Q6498k2465j23423p7301n287l5543p1966M2504
$$ 96960157 96765625 96612781 96626860 96713358 96690893 96567470 96490169 96484882 96449339 96377373 96419877
775.1I6419877K41834L12185K43795K36887L31634L39985K09713J19740J59585J53154
$$ 96419877 96661711 96973896 97217691 97454578 97786212 98126197 98335910 98455650 98615235 98768389
795.4I8768389n3787k87718k94751j56515j26231j65212m0341K20085L38476K47032
$$ 98768389 98714602 98426884 98132133 97975618 97849387 97684175 97643834 97863919 98202395 98449427
815.8I8449427K01261L16638L57848J79964J2863P1472J73098O8945r2465m3780J14829
$$ 98449427 98650688 98967326 99325174 99505138 99518001 99589473 99762571 99831516 99739051 99695271 99810100
838.3I9810100R8180n3751n0324J12402J38015l7372j17994J7709Q3035l8624j89179
$$ 99810100 99908280 99854529 99804205 99916607 100054622 100017250 99899256 99916965 100000000 99961376 99772197
860.7I9772197j28114m0794j47700l12066l03209k17253k83438m29553l89355j51038
$$ 99772197 99644083 99603289 99455589 99143523 98840314 98623061 98339623 97910070 97520715 97369677
881.1I7369677K8056K2244j2022M1044M6241q2397j75709j08010j5813m7821j20019
$$ 97369677 97397733 97419977 97407955 97448999 97495240 97412843 97237134 97129124 97113311 97065490 96945471
903.5I6945471q9044l207j0842j06704j44547r3764q8126j75947k36904k09636j84589
$$ 96945471 96856427 96853220 96842378 96735674 96591127 96497363 96409237 96233290 95996386 95786750 95602161
926I5602161k29127k86269k76959k21794k10387k54238k68280k19858j83052k12013
$$ 95602161 95373034 95086765 94809806 94588012 94377625 94123387 93855107 93635249 93452197 93240184
946.4I3240184k53421k39081j97017k04009k51811k54399j93429j51241j79046k17843
$$ 93240184 92986763 92747682 92550665 92346656 92094845 91840446 91647017 91495776 91316730 91098887
966.8I1098887k03270j82384k35695l33553l83372l87263m20266m59975m18097l27045
$$ 91098887 90895617 90713233 90477538 90143985 89760613 89373350 88953084 88493109 88075012 87747967
987.2H7747967l01486l58337l94255l42214k83730l20405l95173l94386l55792l78936
$$ 87747967 87446481 87088144 86693889 86351675 86067945 85747540 85352367 84957981 84602189 84223253
1007.6H4223253m19093l64977k52366k15763k54577k32393r9671K8217N1952M1157
$$ 84223253 83804160 83439183 83186817 82971054 82716477 82484084 82384413 82412630 82464582 82505739
1028H2505739J01989J86509J87272J37436J47719K05248J93632J07807P6329J37455
$$ 82505739 82607728 82794237 82981509 83118945 83266664 83471912 83665544 83773351 83849680 83987135
1048.4H3987135J74820J25235Q3685J21212J61481J33544J07426J64175K40928K34640
$$ 83987135 84161955 84287190 84370875 84492087 84653568 84787112 84894538 85058713 85299641 85534281
1068.8H5534281J73276J57988J89424J86634J47140J45429J85472J87999J31905R0605
$$ 85534281 85707557 85865545 86054969 86241603 86388743 86534172 86719644 86907643 87039548 87130153
1089.2H7130153J01245J01572M2671l0565o3032p4309j04976j37913j39201j22118
$$ 87130153 87231398 87332970 87375641 87345076 87282044 87207735 87102759 86964846 86825645 86703527
1109.6H6703527j16658j12581q6946n1963k7555j4073K688L2789P5477J33061J87046
$$ 86703527 86586869 86474288 86387342 86335379 86307824 86293751 86296439 86329228 86404705 86537766 86724812
1132H6724812K05093J97846J92714J79213J38289Q3607M4775K3592r054n9593r0974
$$ 86724812 86929905 87127751 87320465 87499678 87637967 87721574 87766349 87789941 87780887 87721294 87630320
1154.4H7630320q4800p6204q8495q2678k7615K5213Q368o1488j12462j17570r7346
$$ 87630320 87545520 87469316 87380821 87298143 87270528 87295741 87304109 87242621 87130159 87012589 86915243
1176.9H6915243m6021O4242K01982K74164K56586K30211K36189K16782J43308Q8197
$$ 86915243 86869222 86933464 87135446 87409610 87666196 87896407 88132596 88349378 88492686 88580883
1197.3H8580883J05559J34176J02431N2422N5409O7907K033j12522j81162k05696k62540
$$ 88580883 88686442 88820618 88923049 88975471 89030880 89098787 89100820 88988298 88807136 88601440 88338900
1219.7H8338900l48497l75479l28923k97486l25293l43859l03912k71720l07756l56293
$$ 88338900 87990403 87614924 87286001 86988515 86663222 86319363 86015451 85743731 85435975 85079682
1240.1H5079682l43681k85702k36035j84929q3918M1897J13081J15252J13237J38634
$$ 85079682 84736001 84450299 84214264 84029335 83945417 83987314 84100395 84215647 84328884 84467518
1260.5H4467518J48636J24938J14715J43701J66875J41233R4128P4899P4369N1087
$$ 84467518 84616154 84741092 84855807 84999508 85166383 85307616 85401744 85476643 85551012 85602099
1280.9H5602099J1378J109L0333N5551N0116N1242R9581J71733K20782K47556K80326
$$ 85602099 85613477 85614586 85644919 85700470 85750586 85801828 85901409 86073142 86293924 86541480 86821806
1303.3H6821806L15023L26151L05885K77185K63959K47157K08467J69569J52916J46318
$$ 86821806 87136829 87462980 87768865 88046050 88310009 88557166 88765633 88935202 89088118 89234436
1323.7H9234436J16115O0118J7815J2422J3787j0640l1632O360N9819M0853k6721o8617
$$ 89234436 89350551 89410669 89428484 89440906 89454693 89444053 89412421 89418781 89478600 89519453 89492732 89424115
1348.2H9424115p5376j00648j53488j71709j37603j18101j39630j52325j49662j68723
$$ 89424115 89348739 89248091 89094603 88922894 88785291 88667190 88527560 88375235 88225573 88056850
1368.6H8056850k09182k50739k30884j43087j09113j42181j36494m9198N7912J45680
$$ 88056850 87847668 87596929 87366045 87222958 87113845 86971664 86835170 86785972 86843884 86989564
1389H6989564K35641L44830M14831L71027L33673L47876L08383K04992Q5181J2797
$$ 86989564 87225205 87570035 87984866 88355893 88689566 89037442 89345825 89550817 89635998 89648795
1409.4H9648795j6481o5648j44935j98376j72013j25647j72174k19845k12491k22665
$$ 89648795 89632314 89566666 89421731 89223355 89051342 88925695 88753521 88533676 88321185 88098520
1429.8H8098520k44290k54565k61921j94156j09696j14894j27250j31703j71625k17414
$$ 88098520 87854230 87599665 87337744 87143588 87033892 86918998 86791748 86660045 86488420 86271006
1450.2H6271006k33233k30593k52431j97721n7405k3532l8719k2024j0800l3814o1148
$$ 86271006 86037773 85807180 85554749 85357028 85299623 85276091 85237372 85215348 85204548 85170734 85109586
1472.6H5109586r6155j58244k19619k87700l77822m78655n81998n96708m29076k14737
$$ 85109586 85013431 84855187 84635568 84347868 83970046 83491391 82909393 82312685 81883609 81668872
1493H1668872j17857o9028j3113j1027n3697j18089r8711M3445Q1295N3477K6942J2284
$$ 81668872 81551015 81481987 81468874 81457847 81404150 81286061 81187350 81230795 81312090 81365567 81392509 81404793
1517.5H1404793j8048o3103p4238r7853j38754j50656j98156k60174k25443k01559
$$ 81404793 81386745 81323642 81249404 81151551 81012797 80862141 80663985 80403811 80178368 79976809
1537.9G9976809k06751l9708J14411J35481J03885P8875Q5706R3728P2294P3928J90657
$$ 79976809 79770058 79730350 79844761 79980242 80084127 80163002 80248708 80342436 80414730 80488658 80679315
1560.3H0679315J91361J15186Q5133J11151J85031J81132O4755o9291j04791p0732
$$ 80679315 80870676 80985862 81070995 81182146 81367177 81548309 81613064 81543773 81438982 81368250
1580.7H1368250K3740K25288M52798N82213N35416L54016J47504l0148j99420l64929
$$ 81368250 81391990 81617278 82070076 82652289 83187705 83541721 83689225 83659077 83459657 83094728
1601.1H3094728m87036n58716o26146p02298p26128o98137p57372q35520o46627n13608
$$ 83094728 82607692 82048976 81422830 80720532 79994404 79296267 78538895 77703375 77056748 76543140
1621.5G6543140n29569m86422m44734l91781k59113j61600j00118K1332R8324J10346
$$ 76543140 76013571 75527149 75082415 74690634 74431521 74269921 74169803 74191135 74289459 74399805
1641.9G4399805R5069J16706K12634K22349K03371L22151L47543K77341K38007K23845
$$ 74399805 74494874 74611580 74824214 75046563 75249934 75572085 75919628 76196969 76434976 76658821
1662.3G6658821K29216J95092J58685J70583J82473J97751K36433K33108K01911K29615
$$ 76658821 76888037 77083129 77241814 77412397 77594870 77792621 78029054 78262162 78464073 78693688
1682.7G8693688L97402M87184M69840N16021N07409N22750N58037N56469O56384N94407
$$ 78693688 79091090 79578274 80048114 80564135 81071544 81594294 82152331 82708800 83365184 83959591
1703.1H3959591N08994N38737N23227M76903M23300L91299M58801N10954M37618L80856
$$ 83959591 84468585 85007322 85530549 86007452 86430752 86822051 87280852 87791806 88229424 88610280
1723.5H8610280L63487L34137L01636K61336K82234L41272K97988K63089K63029K51359
$$ 88610280 88973767 89307904 89609540 89870876 90153110 90494382 90792370 91055459 91318488 91569847
1743.9I1569847K34353K13945K15620K43491K31147K00218J85501J67239J76668J94753
$$ 91569847 91804200 92018145 92233765 92477256 92708403 92908621 93094122 93261361 93438029 93632782
1764.3I3632782J63817J21337J06180J42014J89769J70714J32501J29616J41359J32614
$$ 93632782 93796599 93917936 94024116 94166130 94355899 94526613 94659114 94788730 94930089 95062703
1784.7I5062703J19668J00929Q0526J02436J32585J23071J05852J03736J05781J01882
$$ 95062703 95182371 95283300 95363826 95466262 95598847 95721918 95827770 95931506 96037287 96139169
1805.1I6139169R6673Q6569P7278Q0931Q9848R2542Q3494O3551N4282P0947P4232O4462
$$ 96139169 96235842 96322411 96399689 96480620 96570468 96663010 96746504 96810055 96864337 96935284 97009516 97073978
1829.6I7073978R4736J19144R7167O9094N8299M8041M5997P0054Q2606Q4263Q2522
$$ 97073978 97168714 97287858 97385025 97454119 97512418 97560459 97606456 97676510 97759116 97843379 97925901
1852I7925901O3485M5973M8399N9325N5170L4875J3220K1183O2842P5048N7030M9072
$$ 97925901 97989386 98035359 98083758 98143083 98198253 98233128 98246348 98267531 98330373 98405421 98462451 98511523
1876.5I8511523M6128L4630K8175L4833L3713K1773K9779M4399L9453L3366L2968L3128
$$ 98511523 98557651 98592281 98620456 98655289 98689002 98710775 98740554 98784953 98824406 98857772 98890740 98923868
1900.9I8923868L2550K8014K1476K2608L1221K8503J2427P576K3508K6375K1601L1036
$$ 98923868 98956418 98984432 99005908 99028516 99059737 99088240 99100667 99108243 99131751 99158126 99179727 99210763
1925.4I9210763K9427J4251Q112J6779K4772J7935K772J323J8912K3043R108J0502
$$ 99210763 99240190 99254441 99262553 99279332 99304104 99322039 99324811 99326134 99345046 99368089 99377197 99387699
1949.9I9387699K3246J6701j931j526J5074J5217n465j3090J0437K4563N782m947J1229
$$ 99387699 99410945 99427646 99425715 99424189 99439263 99454480 99449015 99435925 99446362 99470925 99476707 99471760 99482989
1976.4I9482989K1780M536j2839j401J5789L320k0587p802K5862K0153j3710j7672
$$ 99482989 99504769 99509305 99496466 99495065 99510854 99514174 99493587 99485785 99511647 99531800 99518090 99500418
2000.9I9500418Q857J7297n251j7077K987J6647o515k6381l606K1690N979k1941j1796
$$ 99500418 99509275 99526572 99521321 99504244 99507231 99523878 99517363 99490982 99487376 99509066 99515045 99493104 99481308
2027.4I9481308J7733J3602j5545j7852R769J6904q929j8882R089K7866O902j4806
$$ 99481308 99499041 99512643 99497098 99479246 99489015 99505919 99496990 99478108 99487197 99515063 99521965 99507159
2051.9I9507159M23K3014J0913j5652j0765J6553J9097l296p630J3364K1308J258j1015
$$ 99507159 99507582 99530596 99541509 99525857 99515092 99531645 99550742 99547446 99539816 99553180 99574488 99575746 99564731
2078.4I9564731R024K6357Q625j3065k706J9228J4293p337o896J3816J8442m77j0371
$$ 99564731 99573755 99600112 99608737 99595672 99592966 99612194 99626487 99619150 99612254 99626070 99644512 99644035 99633664
2104.9I9633664M810J5765K182j0234l94J3131P189p534p701N167P135n430q815M309
$$ 99633664 99638474 99654239 99656421 99646187 99645793 99658924 99666113 99658579 99650878 99656045 99663180 99657750 99648935 99653244
2133.5I9653244J3548M316n168J567J0276O187k521l34J0032J2379L249j782N036J1278
$$ 99653244 99666792 99671108 99665940 99667507 99677783 99683970 99681449 99681115 99691147 99703526 99706775 99704993 99710029 99721307
2162I9721307M893m852l63J4656J8806M565n269N413J5252O503k664N525J8013J2773
$$ 99721307 99726200 99721348 99720985 99735641 99754447 99759012 99753743 99759156 99774408 99780911 99778247 99783772 99801785 99814558
2190.6I9814558l809m643R620J2684K265N25J2141J7107O544k438L440J1670N812k772
$$ 99814558 99810749 99806106 99815726 99828410 99830675 99831200 99843341 99860448 99866992 99864554 99867994 99879664 99885476 99882704
2219.1I9882704M786J6159J3357K713j38O921J0150M596O49N669J1784P653j723j579
$$ 99882704 99887490 99903649 99917006 99919719 99919581 99926502 99936652 99941248 99941897 99947566 99959350 99967003 99965280 99963701
2247.7I9963701M351J568m650k050P379J0413J341o115j330L028j835l183L564R269
$$ 99963701 99968052 99969620 99964970 99962920 99970299 99980712 99982053 99975938 99974608 99977636 99975801 99972618 99976182 99985451
2276.2I9985451R822P099J943m315l618n555p063j0157r412p963j5205k6792k9361
$$ 99985451 99995273 100002372 100004315 100000000 99996382 99990827 99983764 99973607 99964195 99956232 99941027 99914235 99884874
2302.7I9884874k7544l2663m3988n0205l6878k4831m6360p7516p4417m4095l0780m6706
$$ 99884874 99857330 99824667 99780679 99730474 99693596 99668765 99622405 99544889 99470472 99426377 99395597 99348891
2327.2I9348891n0998k1124j436k1977m0525k7972q691J6696Q4358J19949L4719j03342
$$ 99348891 99297893 99276769 99275333 99253356 99212831 99184859 99176168 99192864 99277222 99397171 99431890 99328548
2351.7I9328548j84715j63716r3883l4541j824L5614Q9359J15686J04255J04392J27738
$$ 99328548 99143833 98980117 98886234 98851693 98849869 98885483 98974842 99090528 99194783 99299175 99426913
2374.1I9426913J34963J14119R7174R8300Q6516L8868p790q208J3387N758j6433j5539
$$ 99426913 99561876 99675995 99773169 99871469 99957985 99996853 99989063 99980855 99994242 100000000 99983567 99968028
2398.6I9968028J0032J5103j1354k4474l564J1223n758k0504m112J4799J932k2096
$$ 99968028 99978060 99993163 99981809 99957335 99953771 99964994 99959236 99938732 99934620 99949419 99951351 99929255
2423.1I9929255j5896R209Q690j5265j7136Q285J5944o658j9884l403J2082P98j5670
$$ 99929255 99913359 99922568 99931258 99915993 99898857 99907142 99923086 99916428 99896544 99893141 99905223 99906021 99890351
2449.6I9890351p504J0639M918j5062j2821O091P803p975j3429J585J0294m029j6189
$$ 99890351 99882847 99893486 99898404 99883342 99870521 99876612 99884415 99876440 99863011 99864596 99874890 99870861 99854672
2476.1I9854672o664N901O74j0765q953K277M930m846j0801k491M649l219j1891p134
$$ 99854672 99848008 99853909 99854583 99843818 99834865 99837142 99842072 99837226 99826425 99823934 99828583 99825364 99813473 99806339
2504.7I9806339K104j181j3452j5623p242q613k1994k3609o658O718m71j4460j1349
$$ 99806339 99808443 99807262 99793810 99778187 99770945 99762332 99740338 99716729 99710071 99716789 99716318 99701858 99690509
2531.2I9690509K408K205p874o246M858Q136j061q285k092P677L874o622p27J7667
$$ 99690509 99692917 99695122 99687248 99681002 99685860 99693996 99692935 99684650 99682558 99690235 99694109 99687487 99686760 99704427
2559.7I9704427J9586J484o098P361J4979m05j4419k837J2672L475j4466r185Q291
$$ 99704427 99724013 99725497 99719399 99726760 99741739 99741334 99726915 99724078 99736750 99740225 99725759 99716574 99724865
2586.2I9724865M512j1700p213R907Q547q064j4753m065K987j1021k3401j2225J246
$$ 99724865 99729377 99717677 99710464 99720371 99728918 99720854 99706101 99702036 99705023 99694002 99670601 99658376 99659622
2612.8I9659622m864k0331k2221j0770r257j8114j7029o497m142j3829j8990j0067
$$ 99659622 99654758 99634427 99612206 99601436 99592179 99574065 99557036 99550539 99546397 99532568 99513578 99503511
2637.2I9503511k795j2505k4194j6004j621o151k0105k0581j1868j1646j9378j8930
$$ 99503511 99500716 99488211 99464017 99448013 99446392 99440241 99420136 99399555 99387687 99376041 99356663 99337733
2661.7I9337733p451m291j4556j8286j0276q029j5843j8197j2374j2279j8692k1523
$$ 99337733 99330282 99325991 99311435 99293149 99282873 99274844 99259001 99240804 99228430 99216151 99197459 99175936
2686.2I9175936j9556j5152j3161j8805k4938k2287j8423k0945k2304k0791k0426k1142
$$ 99175936 99156380 99141228 99128067 99109262 99084324 99062037 99043614 99022669 99000365 98979574 98959148 98938006
2710.7I8938006k1791k2531k3967k4080k3914k3740k3013k7419l7646m0042l2926k8431
$$ 98938006 98916215 98893684 98869717 98845637 98821723 98797983 98774970 98747551 98709905 98669863 98636937 98608506
2735.1I8608506k8336l1531l5286l4183k8766k6822l5560m4215m0674l5554l9202m1371
$$ 98608506 98580170 98548639 98513353 98479170 98450404 98423582 98388022 98343807 98303133 98267579 98228377 98187006
2759.6I8187006l6192l2872l6443l9321l6639l2526l2693l9006m4316m3571m0596l9637
$$ 98187006 98150814 98117942 98081499 98042178 98005539 97973013 97940320 97901314 97856998 97813427 97772831 97733194
2784.1I7733194l6782l1782l8153n1426n3466m7195m7362n8096o5452o1154n3847n1290
$$ 97733194 97696412 97664630 97626477 97575051 97521585 97474390 97427028 97368932 97303480 97242326 97188479 97137189
2808.6I7137189n9497p0036o8825o4350o5344o7008p2497q5115r5946j03098j11127
$$ 97137189 97077692 97007656 96938831 96874481 96809137 96742129 96669632 96584517 96488571 96385473 96274346
2831I6274346j21623j32984j46693j87075k69938l77577m63081m20659k05732L1102
$$ 96274346 96152723 96019739 95873046 95685971 95416033 95038456 94575375 94154716 93948984 93980086
2851.4I3980086J30838J08695N5856J0496l0917o0070p6341r1702r7096q9317r3449
$$ 93980086 94110924 94219619 94275475 94285971 94255054 94194984 94118643 94026941 93929845 93840528 93747079
2873.8I3747079j09547j06174q9645q6898r3359r3221q3506p1764o3545n7548n5742
$$ 93747079 93637532 93531358 93441713 93354815 93261456 93168235 93084729 93012965 92949420 92891872 92836130
2896.3I2836130n9182o2078o6632p8958j06818j68133k73972m01777m58014l35545
$$ 92836130 92776948 92714870 92648238 92569280 92462462 92294329 92020357 91618580 91160566 90825021
2916.6I0825021q4889J16718J92744J95551J82616J73080J57744J34641J10662Q6307
$$ 90825021 90740132 90856850 91049594 91245145 91427761 91600841 91758585 91893226 92003888 92090195
2937I2090195P2122P1955O1548K5218j4448l2633l6067m5943m9508k0135K1977M7457
$$ 92090195 92162317 92234272 92295820 92321038 92306590 92273957 92237890 92191947 92142439 92122304 92144281 92191738
2961.5I2191738O0743P9900J06847J22947J29372J43134J53476J47480J33658J19084
$$ 92191738 92252481 92332381 92439228 92562175 92691547 92834681 92988157 93135637 93269295 93388379
2981.9I3388379J06412R3740Q0252P5888P2408N3257L0440J3965M101L338j574j1825
$$ 93388379 93494791 93588531 93668783 93744671 93817079 93870336 93900776 93914741 93918842 93922180 93920606 93908781
3006.4I3908781j0991m316j2123l3546m9793n4485n5379n5945n7476o0147n7716n2708
$$ 93908781 93897790 93893474 93881351 93847805 93798012 93743527 93688148 93632203 93574727 93514580 93456864 93404156
3030.9I3404156n2369n8311o3264n5707m8983n5629o5642p1580p0589o6525o5184o1351
$$ 93404156 93351787 93293476 93230212 93174505 93125522 93069893 93004251 92932671 92862082 92795557 92730373 92669022
3055.3I2669022n8716o2639o1744m9329l6323m0287n3930n3859m1366k7990k3764l5257
$$ 92669022 92610306 92547667 92485923 92436594 92400271 92359984 92306054 92252195 92210829 92182839 92159075 92123818
3079.8I2123818m3499l8767l7426l2812k0438k0302k9349k7025j1736n394j7715k5701
$$ 92123818 92080319 92041552 92004126 91971314 91950876 91930574 91901225 91874200 91862464 91857070 91839355 91813654
3104.3I1813654j5420n895j7428l1120k5540k0218l2860n7775p5752o9254n5445n7023
$$ 91813654 91798234 91792339 91774911 91743791 91718251 91698033 91665173 91607398 91531646 91462392 91406947 91349924
3128.8I1349924o9267p8970p7659p2271q0496j00350j09136j07301j10769j09631j02704
$$ 91349924 91280657 91201687 91124028 91051757 90971261 90870911 90761775 90654474 90543705 90434074 90331370
3151.2I0331370j15723j44279j55520j46187j39147j44058j53518j60003j62339j65289
$$ 90331370 90215647 90071368 89915848 89769661 89630514 89486456 89332938 89172935 89010596 88845307
3171.6H8845307j70213j71489j68794j71733j84286j90651j82522j76853j85531j94418
$$ 88845307 88675094 88503605 88334811 88163078 87978792 87788141 87605619 87428766 87243235 87048817
3192H7048817j90962j86765j89382j91801j88828j82050j80096j85430j87045j80519
$$ 87048817 86857855 86671090 86481708 86289907 86101079 85919029 85738933 85553503 85366458 85185939
3212.4H5185939j77628j85430j90478j82385j78545j89525j97953j91355j77026j75142
$$ 85185939 85008311 84822881 84632403 84450018 84271473 84081948 83883995 83692640 83515614 83340472
3232.8H3340472j93626k07305k01469j93203j89996j83397j77109j81818j85699j77246
$$ 83340472 83146846 82939541 82738072 82544869 82354873 82171476 81994367 81812549 81626850 81449604
3253.2H1449604j67626j65761j66624j62793j52886j41960j33771j25593j26981j38551
$$ 81449604 81281978 81116217 80949593 80786800 80633914 80491954 80358183 80232590 80105609 79967058
3273.6G9967058j42998j39385j32823j26326j24944j24240j19149j13476j14429j23471
$$ 79967058 79824060 79684675 79551852 79425526 79300582 79176342 79057193 78943717 78829288 78705817
3294G8705817j37156j48868j44798j28072j20449j33110j58333j80376j90246j87957
$$ 78705817 78568661 78419793 78274995 78146923 78026474 77893364 77735031 77554655 77364409 77176452
3314.4G7176452j84059j85127j88350j92678j97709k07746k22528k29394k26093k19851
$$ 77176452 76992393 76807266 76618916 76426238 76228529 76020783 75798255 75568861 75342768 75122917
3334.8G5122917k15435k27309k50375k60025k59662k56192k50471k57558k77793k92015
$$ 75122917 74907482 74680173 74429798 74169773 73910111 73653919 73403448 73145890 72868097 72576082
3355.2G2576082k90621k80231k72554k69270k61778k56335k67518k89065k91699k67654
$$ 72576082 72285461 72005230 71732676 71463406 71201628 70945293 70677775 70388710 70097011 69829357
3375.5F9829357k42913k30438k27093k19369j96547j64139j37192j43051j68890j60706
$$ 69829357 69586444 69356006 69128913 68909544 68712997 68548858 68411666 68268615 68099725 67939019
3395.9F7939019j17081r4015j18589j43242j21951q5783p0000p0011p6002p3874n3066
$$ 67939019 67821938 67727923 67609334 67466092 67344141 67258358 67188358 67118347 67042345 66968471 66915405
3418.4F6915405l0267j7280K33K4348M6033N5456O2287P7551P5746N6964O2257R2381
$$ 66915405 66885138 66867858 66868091 66892439 66938472 66993928 67056215 67133766 67209512 67266476 67328733 67421114
3442.9F7421114J19806J38104J44875J46466J51223J59759J76417J89692J78820J75536
$$ 67421114 67540920 67679024 67823899 67970365 68121588 68281347 68457764 68647456 68826276 69001812
3463.2F9001812K07603K26319J93208J49399J53124J85305K08193K09654J92731J92529
$$ 69001812 69209415 69435734 69628942 69778341 69931465 70116770 70324963 70534617 70727348 70919877
3483.6G0919877K07031K01172J95747K12515K26450K31224K27952K23291K24036K16043
$$ 70919877 71126908 71328080 71523827 71736342 71962792 72194016 72421968 72645259 72869295 73085338
3504G3085338K07877K19834K44319K65402K64943K49034K46203K57373K75248K75397
$$ 73085338 73293215 73513049 73757368 74022770 74287713 74536747 74782950 75040323 75315571 75590968
3524.4G5590968K53296K54166K80988K95657L01630L01981K89249K92814L10284L10915
$$ 75590968 75844264 76098430 76379418 76675075 76976705 77278686 77567935 77860749 78171033 78481948
3544.8G8481948K89429K82824L04782L20011L15047L13091L26550L32242L08061K96414
$$ 78481948 78771377 79054201 79358983 79678994 79994041 80307132 80633682 80965924 81273985 81570399
3565.2H1570399L60519M18764L92794L62325L66312L83026M02766M08292L87877L71796
$$ 81570399 81930918 82349682 82742476 83104801 83471113 83854139 84256905 84665197 85053074 85424870
3585.6H5424870L94893M23068M01652L86744M09025M22991M17602M14228L94219L54427
$$ 85424870 85819763 86242831 86644483 87031227 87440252 87863243 88280845 88695073 89089292 89443719
3606H9443719L52532L80629L88873L81559L50130L43281L89713L76242K95466K31421
$$ 89443719 89796251 90176880 90565753 90947312 91297442 91640723 92030436 92406678 92702144 92933565
3626.4I2933565K66898L61025L44831L02261K85995K66278K42329K13945J73544J41341
$$ 92933565 93200463 93561488 93906319 94208580 94494575 94760853 95003182 95217127 95390671 95532012
3646.8I5532012J88124K74706K52253J97899K09749K20931J73914J27763J06227O9231
$$ 95532012 95720136 95994842 96247095 96444994 96654743 96875674 97049588 97177351 97283578 97352809
3667.2I7352809L9613M4340k1500q0204Q4609K55007K43199J59591R4825P4810Q8841
$$ 97352809 97392422 97436762 97415262 97335058 97419667 97674674 97917873 98077464 98172289 98247099 98335940
3689.6I8335940J18553J32370J09482O8051L6603M0078O4522N6523J5635r388L8481
$$ 98335940 98454493 98586863 98696345 98764396 98800999 98841077 98905599 98962122 98977757 98968369 99006850
3712.1I9006850J02525Q5235L1185r06j996J3816L5500L9375M220l1411r966O6262
$$ 99006850 99109375 99194610 99225795 99224889 99222893 99236709 99272209 99311584 99315804 99284393 99274427 99340689
3736.5I9340689R4205K8539m6766l2007K9081M279n84O8867P6390L2353K1005M4900
$$ 99340689 99434894 99463433 99416667 99384660 99413741 99418020 99417436 99486303 99562693 99595046 99616051 99660951
3761I9660951L5536K253o127P397L1453L5751J2702J764R757J1683L302R400K6506
$$ 99660951 99696487 99698740 99692613 99700010 99731463 99767214 99779916 99781680 99791437 99803120 99806422 99815822 99842328
3787.5I9842328K3073M428j6015k6977k5934l5739j4967L0804K2369K3365M2838J4311
$$ 99842328 99865401 99869829 99853814 99826837 99800903 99765164 99750197 99781001 99803370 99826735 99869573 99883884
3812I9883884l5482m3959k3425k6428J4919N8776L4881Q648p409j3840q398k3514l3325
$$ 99883884 99848402 99804443 99781018 99754590 99769509 99828285 99863166 99871814 99864405 99850565 99842167 99818653 99785328
3838.5I9785328K938L9643N0259L1543k1607r3418j11109K0718J01680N2392p224l1513
$$ 99785328 99788266 99827909 99878168 99909711 99888104 99794686 99683577 99704295 99805975 99858367 99851143 99819630
3863I9819630j1801k128k0981o878K6291L8731J6362k7371k1046R400J1539J1235m184
$$ 99819630 99807829 99805701 99784720 99777842 99804133 99842864 99859226 99831855 99810809 99820209 99831748 99842983 99838799
3889.5I9838799r936J5927J0257l1834m9281k2942J5956M6354N0575L3682J4890j1492
$$ 99838799 99828863 99844790 99855047 99823213 99773932 99750990 99766946 99813300 99863875 99897557 99912447 99900955
3914I9900955l6681k0849J4632J4699J144O777P052q637n525J4257J5378O038n311
$$ 99900955 99864274 99843425 99858057 99872756 99873900 99880677 99887729 99879092 99873567 99887824 99903202 99909240 99903929
3940.5I9903929j5861o097P778Q804Q672J1790J3608P516q94m71M667O050On460J079
$$ 99903929 99888068 99881971 99889749 99898553 99907225 99919015 99932623 99940139 99939245 99938774 99943441 99949491 99949497 99944037 99945116
3971.1I9945116J2124J3101M476Q11J0365J4007l588j2988M840J6278O950P1K790
$$ 99945116 99957240 99970341 99974817 99975628 99985993 100000000 99996412 99983424 99988264 100004542 100011492 100011563 100014353
3997.6A00014353
$$ 100014353
##END=$$ End of the data block
