##TITLE=Poliol Resin ETMS1 $$ Begin of the data block
##JCAMP-DX=5.00 $$ ACD/SpecManager v 10.08
##SPECTROMETER/DATA SYSTEM=Alpha
##DATE=07 Jun 2016 08:10:12
##DATA TYPE=INFRARED SPECTRUM
##DATA CLASS=XYDATA
##ORIGIN=
##OWNER=
##NPOINTS=1667
##FIRSTX=599.64648438
##LASTX=3997.64306641
##MAXX=3997.64306641
##MINX=599.64648438
##MAXY=1.10831046
##MINY=0.09656744
##XFACTOR=1.0000000000
##YFACTOR=0.000000010000000
##FIRSTY=1.04168451
##DELTAX=2.03961372
##XUNITS=1/CM
##YUNITS=ARBITRARY UNITS
##XYDATA=(X++(Y..Y))
$$ plain form
599.6 104168451 104071975 103977191 103892779 103812528 103754699 103749156 103761971 103749561 103755903 103781843 103757036 103678024
624.1 103678024 103593481 103523290 103484786 103487873 103518975 103521061 103433418 103236949 102981484 102778864 102662182
646.6 102662182 102530348 102208555 101455593 99858421 97151583 94023901 91903383 91322505 91476917
664.9 91476917 91606814 91707832 91820246 91674715 91221607 90581256 89786255 88813418 87799853 87041420
685.3 87041420 86741865 86834264 87032127 87078804 86891413 86547518 86184120 85945815 86050034 86781579
705.7 86781579 88309723 90510076 92951536 95115596 96705419 97729093 98353821 98738182 98962826
724.1 98962826 99045670 99015760 98933589 98799360 98558080 98202473 97780931 97345644 96931863 96491563
744.5 96491563 95900077 95072931 94047284 93102056 92580491 92467076 92414474 92105901 91415775 90338182
$$ packed form
599.6A04168451r6476r4784q4412q0251n7829n543J2815j2410O342K5940k4807p9012
624.1A03678024q4543p0191l8504L087L1102K086q7643j96469k55465k02620j16682
646.6A02662182j31834l21793p52962j597172k706838l127682k120518n80878J54412
664.9I1476917J29897J01018J12414j45531m53108o40351p95001r72837j013565p58433
685.3H7041420k99555R2399J97863M6677j87391l43895l63398k38305J04219P31545
705.7H6781579J528144K200353K441460K164060J589823J023674O24728L84361K24644
724.1I8962826Q2844k9910q2171j34229k41280l55607m21542m35287m13781m40300
744.5I6491563n91486q27146j025647r45228n21565j13415n2602l08573o90126j077593
$$ plain form
764.9 90338182 88859701 86918658 84406871 81150079 76949292 71637589 65156859 57626581 49308676
783.2 49308676 40640286 32292175 24958488 19121820 14910004 12138590 10500401 9730419 9656744
801.6 9656744 10168420 11192691 12616906 14287743 16040026 17726859 19298999 20950738 23126131
819.9 23126131 26337168 30867130 36515701 42632127 48443258 53392833 57208294 59829193 61399078
838.3 61399078 62308061 63151407 64469832 66364187 68425500 70094627 71002847 71041983 70345718
856.6 70345718 69256711 68187571 67471600 67276210 67582017 68255007 69180959 70333934 71741349
875 71741349 73457068 75526035 77910447 80467784 83018816 85405827 87514824 89310771 90830523
893.4 90830523 92128599 93253666 94238985 95103258 95870882 96565568 97186756 97731906 98219526 98660398
$$ packed form
764.9I0338182j478481j941043k511787l256792m200787n311703o480730p530278q317905
783.2D9308676q668390q348111p333687n836668m211816k771414j638189p69982p3675
801.6I656744N11676J024271J424215J670837J752283J686833J572140J651739K175393
819.9B3126131L211037M529962N648571O116426N811131M949575L815461K620899J569885
838.3F1399078R08983Q43346J318425J894355K061313J669127R08220L9136o96265
856.6G0345718j089007j069140p15971j95390L05807O72990R25952J152975J407415
875G1741349J715719K068967K384412K557337K551032K387011K108997J795947J519752
893.4I0830523J298076J125067R85319Q64273P67624O94686O21188N45150M87620M40872
$$ plain form
913.7 98660398 99055481 99402517 99692386 99931240 100133932 100299323 100423622 100512457 100569570 100595498
934.1 100595498 100585425 100532365 100441098 100318444 100162613 99968612 99719822 99405074 99040627 98628652
954.5 98628652 98146403 97593313 96991897 96349406 95650601 94884026 94051832 93151218 92155254 91024065
974.9 91024065 89738560 88285357 86620635 84698194 82494950 79980952 77113879 73844129 70109004
993.3 70109004 65867239 61098808 55794537 50001436 43853199 37578708 31517395 26070297 21566561
1011.6 21566561 18161359 15813477 14355278 13577741 13272487 13274790 13480270 13818260 14243597 14730009
1032 14730009 15251283 15789081 16331194 16869293 17396888 17905374 18379949 18808526 19190450 19517380
1052.4 19517380 19771089 19944108 20044973 20072901 20013890 19858746 19616516 19296551 18894099 18411705
$$ packed form
913.7I8660398L95083L47036K89869K38854K02692J65391J24299Q8835N7113K5928
934.1A00595498j0073n3060r1267j22654j55831j94001k48790l14748l64447m11975
954.5I8628652m82249n53090o01416o42491o98805p66575q32194r00614r95964j131189
974.9I1024065j285505j453203j664722j922441k203244k513998k867073l269750l735125
993.3G0109004m241765m768431n304271n793101o148237o274491o061313n447098m503736
1011.6B1566561l405202k347882j458199p77537l05254K303K05480L37990M25337M86412
1032A4730009N21274N37798N42113N38099N27595N08486M74575M28577L81924L26930
1052.4A9517380K53709J73019J00865K7928n9011j55144k42230l19965m02452m82394
$$ plain form
1072.8 18411705 17866172 17274618 16643029 15989059 15346238 14745741 14213657 13777861 13466638 13304536
1093.2 13304536 13316505 13521788 13941199 14598301 15511046 16695099 18170910 19961502 22088829
1111.6 22088829 24562421 27371481 30487356 33855706 37400159 41039771 44694903 48286888
1127.9 48286888 51755291 55060595 58180761 61112428 63855338 66409218 68779904 70976835
1144.2 70976835 73014200 74907154 76668733 78320473 79883057 81362325 82763284 84092498
1160.5 84092498 85348302 86532313 87655181 88726884 89751756 90740967 91708058 92635536 93494952
1178.9 93494952 94289863 95029640 95705271 96315855 96877527 97394598 97850704 98249251 98609167 98922008
1199.3 98922008 99178910 99396580 99583101 99729526 99829495 99883747 99907923 99905705 99850440 99731439 99560177
$$ packed form
1072.8A8411705n45533n91554o31589o53970o42821o00497n32084m35796l11223j62102
1093.2A3304536J1969K05283M19411O57102R12745J184053J475811J790592K127327
1111.6B2088829K473592K809060L115875L368350L544453L639612L655132L591985
1127.9D8286888L468403L305304L120166K931667K742910K553880K370686K196931
1144.2G0976835K037365J892954J761579J651740J562584J479268J400959J329214
1160.5H4092498J255804J184011J122868J071703J024872R89211R67091R27478Q59416
1178.9I3494952P94911P39777O75631O10584N61672N17071M56106L98547L59916L12841
1199.3I8922008K56902K17670J86521J46425R9969N4252K4176k218n5265j19001j71262
$$ plain form
1221.7 99560177 99333471 99033481 98638350 98124993 97467220 96623200 95526004 94076741 92129362
1240.1 92129362 89435053 85582840 80073577 72497439 62561136 50300497 36916053 24989817
1256.4 24989817 16858794 13157615 13598381 18360199 27807200 40805981 54433680 65961498
1272.7 65961498 74481213 80490035 84771693 87908715 90273052 92111516 93587470 94797355
1289 94797355 95801526 96649218 97379529 98019630 98583478 99082476 99527395 99924582 100285304 100617898
1309.4 100617898 100917459 101184785 101427078 101646388 101853096 102054274 102239454 102399862 102535999 102654386
1329.8 102654386 102753758 102812743 102820373 102808297 102837670 102912307 102972281 103004777 103037369 103082812 103128660 103156304
1354.3 103156304 103167713 103144610 103062630 102992690 103010154 103030717 102986264 102902699 102798188 102729166 102713859
$$ packed form
1221.7I9560177k26706k99990l95131n13357o57773q44020j097196j449263j947379
1240.1I2129362k694309l852213n509263p576138r936303j2260639j3384444j1926236
1256.4B4989817q131023l701179M40766M761818R447001J2998781J3627699J1527818
1272.7F5961498Q519715O008822M281658L137022K364337J838464J475954J209885
1289I4797355J004171Q47692P30311O40101N63848M98998M44919L97187L60722L32594
1309.4A00617898K99561K67326K42293K19310K06708K01178J85180J60408J36137J18387
1329.8A02654386R9372N8985P630j2076K9373P4637N9974L2496L2592M5443M5848K7644
1354.3A03156304J1409k3103q1980o9940J7464K0563m4453q3565j04511o9022j5307
$$ plain form
1376.7 102713859 102664065 102534056 102318895 101973236 101473641 100868630 100097227 98973620 97567213
1395.1 97567213 96302789 95468056 95096505 94918275 94618446 94104445 93435329 92879617 92812341 93367052
1415.5 93367052 94558293 96356612 98111516 99437743 100436413 101114011 101545739 101810622 101862979
1433.9 101862979 101702225 101497388 101297987 101019430 100757992 100700366 100966716 101503575 102097332 102581990
1454.3 102581990 103039098 103668022 104253507 104623532 104868317 105079424 105195498 105150914 105044806 105042136
1474.7 105042136 105132163 105228293 105295539 105352223 105384946 105371940 105399799 105583417 105801570 105893278 105915654
1497.1 105915654 105992496 106081164 106043100 105784523 105569589 105725944 105946922 106038344 106025124 105988359 105949044
1519.5 105949044 105933881 105993080 106077063 106193066 106290770 106276524 106255519 106299305 106237018 106082034 106098700
$$ packed form
1376.7A02713859m9794j30009k15161l45659m99595o05011p71403j123607j406407
1395.1I7567213j264424q34733l71551j78230k99829n14001o69116n55712o7276N54711
1415.5I3367052J191241J798319J754904J326227R98670O77598M31728K64883N2357
1433.9A01862979j60754k04837j99401k78557k61438n7626K66350N36859N93757M84658
1454.3A02581990M57108O28924N85485L70025K44785K11107J16074m4584j06108k670
1474.7A05042136R0027R6130O7246N6684L2723j3006K7859J83618K18153R1708K2376
1497.1A05915654P6842Q8668l8064k58577k14934J56355K20978R1422j3220l6765l9315
1519.5A05949044j5163N9199Q3983J16003R7704j4246k1005M3786o2287j54984J6666
$$ plain form
1542 106098700 106249571 106417572 106517541 106534827 106521344 106456149 106291723 106122363 106294775 106571174 106670809
1564.4 106670809 106663132 106619644 106617630 106640065 106585550 106523561 106545389 106562424 106537879 106497264 106450844 106401718
1588.9 106401718 106356943 106321692 106305468 106315684 106333709 106342018 106354833 106381810 106414032 106464505 106535876 106578708
1613.4 106578708 106588495 106654692 106747210 106773913 106798255 106877649 106969488 107054842 107081640 107002044 106947029 107073152
1637.8 107073152 107231402 107289326 107217300 107099175 107130396 107192516 107097507 107114053 107356429 107518876 107546687
1660.3 107546687 107540357 107580936 107579875 107494235 107469416 107524860 107567155 107630384 107672751 107595098 107429659 107418847
1684.7 107418847 107596827 107722485 107780898 107748222 107613373 107493734 107427049 107456625 107551062 107598698 107649910
1707.2 107649910 107706642 107691896 107580042 107411349 107346439 107495165 107669508 107756853 107794023 107784283 107722223
$$ packed form
1542A06098700J50871J68001R9969J7286j3483o5195j64426j69360J72412K76399R9635
1564.4A06670809p677m3488k014K2435n4515o1989K1828J7035k4545m0615m6420m9126
1588.9A06401718m4775l5251j6224J0216J8025Q309J2815K6977L2222N0473P1371M2832
1613.4A06578708R787O6197R2518K6703K4342P9394R1839Q5354K6798p9596n5015J26123
1637.8A07073152J58250N7924p2026j18125L1221O2120r5009J6546K42376J62447K7811
1660.3A07546687o330M0579j061q5640k4819N5444M2295O3229M2367p7653j65439j0812
1684.7A07418847J77980J25658N8413l2676j34849j19639o6685K9576R4437M7636N1212
1707.2A07649910N6732j4746j11854j68693o4910J48726J74343Q7345L7170r740o2060
$$ plain form
1729.6 107722223 107632017 107597351 107704222 107798707 107810819 107805014 107808769 107805228 107764757 107740843 107830107 107934141
1754.1 107934141 107953799 107941747 107922447 107933593 107985270 107974672 107896483 107820141 107811606 107889044 107962024 107985342
1778.6 107985342 107993710 108007407 108031416 108080423 108089912 108036518 108050799 108163166 108249283 108270085 108290625 108377922
1803 108377922 108487940 108546162 108563948 108602178 108670914 108723164 108752334 108784175 108797204 108772421 108755767 108755243
1827.5 108755243 108762765 108829343 108909595 108932793 108928490 108915567 108857358 108797252 108825803 108892453 108935189 108956242
1852 108956242 108963728 108960426 108942056 108921170 108909678 108877194 108787620 108702338 108727336 108804166 108824766 108800888
1876.5 108800888 108779466 108768082 108756685 108737838 108699954 108652341 108640695 108652997 108651757 108649707 108649337 108639419
1900.9 108639419 108621943 108594573 108548546 108493674 108446431 108391249 108298254 108189189 108125412 108096516 108072782
$$ packed form
1729.6A07722223r0206l4666J06871R4485J2112n805L755l541m0471k3914Q9264J04034
1754.1A07934141J9658j2052j9300J1146N1677j0598p8189p6342q535P7438P2980K3318
1778.6A07985342Q368J3697K4009M9007R489n3394J4281J12367Q6117K0802K0540Q7297
1803A08377922J10018N8222J7786L8230O8736N2250K9170L1841J3029k4783j6654n24
1827.5A08755243P522O6578Q0252K3198m303j2923n8209o0106K8551O6650M2736K1053
1852A08956242P486l302j8370k0886j1492l2484q9574q5282K4998P6830K0600k3878
1876.5A08800888k1422j1384j1397j8847l7884m7613j1646J2302j240k050l70r918
1900.9A08639419j7476k7370m6027n4872m7243n5182r2995j09065o3777k8896k3734
$$ plain form
1923.4 108072782 108057320 108025837 107960892 107867110 107755446 107638562 107510853 107364118 107235384 107195044
1943.8 107195044 107239258 107307041 107379556 107460046 107536173 107605469 107672906 107732892 107790196 107853711 107934678
1966.2 107934678 108048904 108179796 108296311 108396244 108485496 108561599 108621967 108673918 108722806 108757770 108774674
1988.7 108774674 108778512 108786476 108811784 108843279 108878136 108920217 108968151 109021783 109078026 109133005 109184098 109222889
2013.1 109222889 109242165 109258425 109289193 109317768 109327567 109328759 109326756 109316301 109301591 109275770 109226322 109159636
2037.6 109159636 109077096 108980560 108884943 108804524 108751321 108723414 108714342 108721149 108735240 108754444 108779001 108804500
2062.1 108804500 108834350 108875966 108918285 108942139 108954704 108977652 109009898 109037125 109055829 109067523 109082294
2084.5 109082294 109107053 109130776 109153986 109180689 109200537 109214675 109229457 109247005 109267700 109282303 109288478 109292388
$$ packed form
1923.4A08072782j5462l1483o4945r3782j11664j16884j27709j46735j28734m0340
1943.8A07195044M4214O7783P2515Q0490P6127O9296O7437N9986N7304O3515Q0967
1966.2A07934678J14226J30892J16515R9933Q9252P6103O0368N1951M8888L4964J6904
1988.7A08774674L838P964K5308L1495L4857M2081M7934N3632N6243N4979N1093L8791
2013.1A09222889J9276J6260L0768K8575R799J192k003j0455j4710k5821m9448o6686
2037.6A09159636q2540r6536r5617q0419n3203k7907r072O807J4091J9204K4557K5499
2062.1A08804500K9850M1616M2319K3854J2565K2948L2246K7227J8704J1694J4771
2084.5A09082294K4759K3723K3210K6703J9848J4138J4782J7548K0695J4603O175L910
$$ plain form
2109 109292388 109297371 109299958 109286940 109267533 109266412 109275758 109278095 109275568 109277284 109286201 109293818 109305155 109326994 109345758
2137.5 109345758 109363425 109386325 109407568 109433138 109467149 109492052 109497738 109506106 109533393 109567046 109594381 109605432
2162 109605432 109597635 109590936 109602976 109620309 109626985 109635317 109649503 109656143 109651470 109643388 109644949 109655488 109664798 109671903
2190.6 109671903 109675539 109673166 109668708 109664130 109659183 109657586 109658837 109658694 109658468 109661639 109669411 109676123 109673989 109665787 109660101
2221.2 109660101 109657025 109652531 109653890 109666502 109674895 109671676 109666109 109656954 109645975 109636605 109626234 109615886 109602106
2247.7 109602106 109591436 109587657 109577370 109561920 109549487 109534574 109515953 109502685 109495783 109490466 109487212 109482181
2272.2 109482181 109474826 109474075 109478366 109481108 109483159 109480274 109467757 109454179 109445047 109428203 109395278 109352016 109304762
2298.7 109304762 109258258 109208858 109144557 109069479 108998013 108933306 108877671 108828557 108764017 108664775 108549774
$$ packed form
2109A09292388M983K587j3018j9407j121R346K337k527J716Q917P617J1337K1839J8764
2137.5A09345758J7667K2900K1243K5570L4011K4903N686Q368K7287L3653K7335J1051
2162A09605432p797o699J2040J7333O676Q332J4186O640m673q082J561J0539R310P105
2190.6A09671903L636k373m458m578m947j597J251j43k26L171P772O712k134q202n686
2221.2A09660101l076m494J359J2612Q393l219n567r155j0979r370j0371j0348j3780
2247.7A09602106j0670l779j0287j5450j2433j4913j8621j3268o902n317l254n031
2272.2A09482181p355p51M291K742K051k885j2517j3578r132j6844l2925m3262m7254
2298.7A09304762m6504m9400o4301p5078p1466o4707n5635m9114o4540r9242j15001
$$ plain form
2321.1 108549774 108462536 108409238 108355606 108296418 108265078 108257735 108239067 108208036 108179390 108159482 108172619 108281970
2345.6 108281970 108436358 108467364 108319306 108087420 107884824 107749784 107686639 107672918 107710838 107819355
2366 107819355 107976067 108149004 108323431 108491850 108669388 108874059 109085095 109265411 109398687 109481180
2386.4 109481180 109521329 109537590 109542620 109548461 109558618 109560907 109549809 109539115 109541070 109548140 109553468 109556997 109553349
2412.9 109553349 109547579 109552157 109561431 109565461 109565628 109563684 109562707 109568155 109577990 109588122 109594655 109591877 109588015 109590769
2441.4 109590769 109588718 109577799 109571779 109577274 109587181 109596181 109599996 109600949 109607220 109616160 109623945 109627855 109623611 109617007
2470 109617007 109620106 109639680 109660745 109664285 109658945 109653664 109644318 109631824 109616828 109591889 109549439 109494483 109444880
2496.5 109444880 109430838 109478319 109583795 109721851 109866905 109998381 110098755 110164142 110203946 110225451
$$ packed form
2321.1A08549774q7238n3298n3632n9188l1340p343j8668l1031k8646j9908J3137J09351
2345.6A08281970J54388L1006j48058k31886k02596j35040o3145j3721L7920J08517
2366A07819355J56712J72937J74427J68419J77538K04671K11036J80316J33276Q2493
2386.4A09481180M0149J6261N030N841J0157K289j1098j0694J955P070N328L529l648
2412.9A09553349n770M578R274M030J67j944r77N448R835J0132O533k778l862K754
2441.4A09590769k051j0919o020N495R907R000L815R53O271Q940P785L910m244o604
2470A09617007L099J9574K1065L540n340n281r346j2494j4996k4939m2450n4956m9603
2496.5A09444880j4042M7481J05476J38056J45054J31476J00374O5387L9804K1505
$$ plain form
2516.9 110225451 110239530 110261071 110285330 110296166 110291028 110272312 110243535 110210443 110172796 110130918 110087788 110043800
2541.4 110043800 110003245 109971213 109939969 109909153 109892213 109884834 109878373 109872651 109868228 109867465 109867036 109872210 109887028
2567.9 109887028 109891498 109882987 109882176 109886074 109880233 109868562 109863317 109865880 109872043 109878087 109879863 109883940 109893620 109900928
2596.4 109900928 109902155 109897923 109892869 109895718 109904563 109909666 109910631 109910524 109912932 109918272 109922075 109920490 109911537 109902394 109901941
2627 109901941 109906924 109903908 109891462 109879208 109866297 109852111 109838569 109817576 109782505 109741414 109707236 109679365
2651.5 109679365 109651566 109622431 109593761 109582555 109598231 109617531 109625673 109637070 109660578 109691060 109726000 109762323
2676 109762323 109798241 109834826 109869039 109901249 109931231 109948409 109951079 109948885 109948051 109952497 109959948 109963322 109962416 109963965
2704.5 109963965 109969711 109978998 109991837 109994078 109981072 109974408 109984684 110004568 110018718 110015202 110011494 110023463 110036564
$$ packed form
2516.9A10225451J4079K1541K4259J0836n138j8716k8777l3092l7647m1878m3130m3988
2541.4A10043800m0555l2032l1244l0816j6940p379o461n722m423p63m29N174J4818
2567.9A09887028M470q511q11L898n841j1671n245K563O163O044J776M077R680P308
2596.4A09900928J227m232n054K849Q845N103R65j07K408N340L803j585q953r143m53
2627A09901941M983l016j2446j2254j2911j4186j3542k0993l5071m1091l4178k7871
2651.5A09679365k7799k9135k8670j1206J5676J9300Q142J1397K3508L0482L4940L6323
2676A09762323L5918L6585L4213L2210K9982J7178K670k194q34M446P451L374r06J549
2704.5A09963965N746R287J2839K241j3006o664J0276J9884J4150l516l708J1969J3101
$$ plain form
2731.1 110036564 110034490 110019433 110004771 109993255 109981549 109972000 109958220 109939814 109930730 109929919 109925675 109916496 109900486
2757.6 109900486 109874415 109844732 109812129 109768856 109719765 109669876 109602380 109512365 109433365 109369051 109275281
2780 109275281 109135199 108970964 108805323 108645868 108512473 108432126 108385313 108338785 108311081 108325195 108344245
2802.4 108344245 108334720 108311427 108292103 108295786 108324504 108349323 108369863 108404481 108439767 108460259 108471012 108464360
2826.9 108464360 108430874 108382201 108333552 108278573 108205605 108159709 108170080 108176661 108148539 108120561 108110058 108096862
2851.4 108096862 108053088 107977760 107891524 107813776 107753277 107685506 107586062 107470191 107330990 107150269 106971705
2873.8 106971705 106822562 106658828 106453216 106208992 105921388 105584645 105178440 104667902 104022396 103226662
2894.2 103226662 102286649 101220059 100092602 99100697 98541242 98616529 99280679 100291431 101376700
$$ packed form
2731.1A10036564k074j5057j4662j1516j1706r549j3780j8406r084q11m244r179j6010
2757.6A09900486k6071k9683l2603m3273m9091m9889o7496r0015p9000o4314r3770
2780A09275281j40082j64235j65641j59455j33395q0347m6813m6528k7704J4114J9050
2802.4A08344245r525k3293j9324L683K8718K4819K0540L4618L5286K0492J0753o652
2826.9A08464360l3486m8673m8649n4979p2968m5896J0371O581k8122k7978j0503j3196
2851.4A08096862m3774p5328q6236p7748o0499o7771r9444j15871j39201j80721j78564
2873.8A06971705j49143j63734k05612k44224k87604l36743m06205n10538o45506p95734
2894.2A03226662r40013j066590j127457r91905n59455P5287O64150J010752J085269
$$ plain form
2912.6 101376700 102352524 103128624 103676271 104009938 104157925 104149592 103998661 103714800 103324080 102825928
2933 102825928 102193046 101390743 100364852 99041933 97335947 95138419 92278749 88521576 83633387
2951.3 83633387 77448976 70055389 62142885 55071110 50410545 49243039 51703084 57042789
2967.6 57042789 64052337 71520209 78508520 84492004 89338690 93149954 96119916 98434108
2984 98434108 100232077 101627743 102710378 103566134 104272854 104862630 105363238 105795979 106152713 106442356
3004.4 106442356 106675661 106840491 106948757 107055116 107196677 107356536 107501817 107608759 107673728 107735515
3024.7 107735515 107812107 107854974 107850885 107840323 107851100 107879496 107887638 107870221 107870567 107902908 107930994 107933831
3049.2 107933831 107943189 107968903 107987428 108009171 108042741 108064139 108064032 108051193 108056808 108105433 108162653 108186412
$$ packed form
2912.6A01376700R75824P76100N47647L33667J47987q333j50931k83861l90720m98152
2933A02825928o32882q02303j025891j322919j705986k197528k859670l757173m888189
2951.3H3633387o184411p393587p912504p071775m660565j167506K460045N339705
2967.6E7042789P009548P467872O988311N983484M846686L811264K969962K314192
2984I8434108J797969J395666J082635Q55756P06720N89776N00608M32741L56734K89643
3004.4A06442356K33305J64830J08266J06359J41561J59859J45281J06942O4969O1787
3024.7A07735515P6592M2867m089j0562J0777K8396Q142j7417L46L2341K8086K837
3049.2A07933831R358K5714J8525K1743L3570K1398j07j2839N615M8625N7220K3759
$$ plain form
3073.7 108186412 108167315 108131409 108128810 108160353 108189821 108217907 108249223 108280838 108319378 108345318 108341157 108318317
3098.2 108318317 108298838 108317339 108361006 108358383 108322322 108332217 108361590 108349526 108332324 108352840 108423913 108544016
3122.6 108544016 108654308 108717191 108762431 108816516 108880007 108933139 108952296 108965600 109026837 109111893 109167433
3145.1 109167433 109195495 109204400 109202361 109235764 109311438 109372938 109413004 109455800 109484351 109496176 109517586 109542429
3169.6 109542429 109557962 109579527 109611857 109635699 109639776 109642208 109661090 109684384 109699917 109718871 109748375 109778130
3194 109778130 109790635 109788013 109793973 109805775 109811783 109819758 109837258 109864056 109881091 109883118 109883177 109878945 109884572 109905839
3222.6 109905839 109924901 109944487 109952450 109920406 109884000 109908271 109973955 110027480 110052013 110038209 110001290 109989882
3247.1 109989882 110022330 110055423 110058916 110070240 110116768 110159612 110165942 110147166 110118532 110067022 110004938 110005701
$$ packed form
3073.7A08186412j9097l5906k599L1543K9468K8086L1316L1615L8540K5940m161k2840
3098.2A08318317j9479J8501M3667k623l6061R895K9373j2064j7202K0516P1073J20103
3122.6A08544016J10292O2883M5240N4085O3491N3132J9157J3304O1237Q5056N5540
3145.1A09167433K8062Q905k039L3403P5674O1500M0066M2796K8551J1825K1410K4843
3169.6A09542429J5533K1565L2330K3842M077K432J8882K3294J5533J8954K9504K9755
3194A09778130J2505k622N960J1802O008P975J7500K6798J7035K027N9m232N627K1267
3222.6A09905839J9062J9586P963l2044l6406K4271O5684N3525K4533j3804l6919j1408
3247.1A09989882L2448L3093L493J1324M6528M2844O330j8776k8634n1510o2084P63
$$ plain form
3271.5 110005701 110068369 110120320 110152876 110175443 110177183 110172546 110183346 110190392 110158670 110113502 110100853 110130262
3296 110130262 110189819 110217953 110166681 110084260 110041308 110068333 110150325 110230553 110269535 110285747 110295630 110288894
3320.5 110288894 110262227 110240269 110259926 110305512 110330725 110325944 110297191 110253024 110224354 110229814 110252345 110279787
3345 110279787 110297561 110285544 110287237 110332727 110363626 110357082 110343051 110331762 110314286 110282969 110254920 110268676
3369.4 110268676 110339320 110411942 110444772 110465026 110484028 110488784 110477507 110467196 110446262 110378563 110327888 110366166
3393.9 110366166 110409081 110366416 110309827 110347176 110450077 110512733 110500932 110457575 110438943 110472894 110531175
3416.3 110531175 110564590 110566664 110558140 110543275 110513306 110477197 110459793 110446107 110419571 110428870 110485613 110521913
3440.8 110521913 110517859 110513985 110532844 110560656 110562217 110535920 110516834 110512292 110501790 110487902 110464275 110405254
$$ packed form
3271.5A10005701O2668N1951L2556K2567J740m637J0800P046l1722m5168j2649K9409
3296A10130262N9557K8134n1272q2421m2952K7025Q1992Q0228L8982J6212R883o736
3320.5A10288894k6667k1958J9657M5586K5213m781k8753m4167k8670N460K2531K7442
3345A10279787J7774j2017J693M5490L0899o544j4031j1289j7476l1317k8049J3756
3369.4A10268676P0644P2622L2830K0254J9002M756j1277j0311k0934o7699n0675L8278
3393.9A10366166M2915m2665n6589L7349J02901O2656j1801m3357j8632L3951N8281
3416.3A10531175L3415K074q524j4865k9969l6109j7404j3686k6536R299N6743L6300
3440.8A10521913m054l874J8859K7812J561k6297j9086m542j0502j3888k3627n9021
$$ plain form
3465.3 110405254 110347474 110355735 110418022 110466933 110467029 110423934 110384738 110405004 110439980 110424745 110407102 110430825
3489.8 110430825 110449922 110429347 110395372 110380042 110362089 110326874 110333145 110380530 110397172 110385025 110381734 110392618
3514.2 110392618 110401595 110394394 110359764 110296369 110258317 110276020 110314715 110346782 110336685 110283113 110258746 110276175
3538.7 110276175 110258758 110176194 110090029 110096741 110175776 110223722 110237491 110242403 110222542 110182965 110142517 110079324
3563.2 110079324 109956086 109852767 109888327 109991181 110042322 110031641 109994316 109940040 109869671 109754157 109592247
3585.6 109592247 109531784 109625566 109698081 109695220 109675503 109651482 109645569 109679806 109702921 109669316 109624314 109621179
3610.1 109621179 109624851 109621501 109606791 109557426 109547651 109605420 109616029 109498179 109347022 109346318 109414601 109444797
3634.6 109444797 109458435 109457827 109433818 109399545 109328687 109170520 109032404 109120226 109318781 109437680 109503388
$$ packed form
3465.3A10405254n7780Q261O2287M8911R6m3095l9196K0266L4976j5235j7643K3723
3489.8A10430825J9097k0575l3975j5330j7953l5215O271M7385J6642j2147l291J0884
3514.2A10392618Q977p201l4630o3395l8052J7703L8695L2067j0097n3572k4367J7429
3538.7A10276175j7417q2564q6165O712P9035M7946J3769M912j9861l9577m0448o3193
3563.2A10079324j23238j03319L5560J02854N1141j0681l7325n4276p0369j15514j61910
3585.6A09592247o0463R3782P2515k861j9717k4021n913L4237K3115l3605m5002l135
3610.1A09621179L672l350j4710m9365r775N7769J0609j17850j51157p04O8283L0196
3634.6A09444797J3638o08k4009l4273p0858j58167j38116Q7822J98555J18899O5708
$$ plain form
3657 109503388 109579158 109654093 109715700 109716499 109619761 109494996 109443140 109402621 109349859 109390116 109461963 109475398
3681.5 109475398 109414685 109257030 109013462 108841157 108847737 108892393 108885038 108855057 108824968 108806956 108823192
3703.9 108823192 108838046 108809638 108764744 108796489 108908248 108981347 108985138 108961785 108950639 108979166 109052217
3726.4 109052217 109127223 109121549 109000540 108878112 108905077 109038770 109134591 109112716 109043944 109037554 108999550
3748.8 108999550 108923042 108947861 109018576 109031582 109032428 109076464 109108400 109103036 109096694 109111869 109171236 109248531
3773.3 109248531 109294236 109310281 109350228 109445894 109545958 109622264 109681284 109728456 109784496 109827471 109829843
3795.7 109829843 109827268 109836030 109872150 109941542 110012209 110114789 110219717 110241187 110176146 110092986 110024595
3818.1 110024595 109975541 110022283 110113096 110147297 110150528 110148108 110131216 110090780 110040963 110038185 110101998 110191607
$$ packed form
3657A09503388P5770P4935O1607P99r6738j24765n1856m0519n2762M0257P1847J3435
3681.5A09475398o0713j57655k43568j72305O580M4656p355k9981l0089j8012J6236
3703.9A08823192J4854k8408m4894L1745J11759P3099L791k3353j1146K8527P3051
3726.4A09052217P5006n674j21009j22428K6965J33693R5821k1875o8772o390l8004
3748.8A08999550p6508K4819P0715J3006Q46M4036L1936n364o342J5175N9367P7295
3773.3A09248531M5705J6045L9947R5666J00064P6306N9020M7172N6040M2975K372
3795.7A09829843k575Q762L6120O9392P0667J02580J04928K1470o5041q3160o8391
3818.1A10024595m9054M6742R0813L4201L231k420j6892m0436m9817k778O3813Q9609
$$ plain form
3842.6 110191607 110275006 110334146 110332942 110237265 110146642 110221994 110354018 110432041 110443699 110425651 110443509
3865 110443509 110456383 110425556 110423934 110486674 110563469 110580921 110535765 110509002 110508323 110520911 110559106 110576975
3889.5 110576975 110586393 110627866 110647070 110589862 110492218 110434937 110461748 110570168 110686958 110745442 110760534
3912 110760534 110744596 110691047 110657215 110683870 110710204 110720670 110748792 110754466 110723758 110715187 110748923 110792077
3936.4 110792077 110809815 110782123 110749936 110753691 110751200 110736299 110741794 110767663 110803342 110826552 110820448 110796463
3960.9 110796463 110791194 110815692 110831046 110813212 110782576 110761392 110753632 110753107 110758400 110771012 110779154 110787201 110801888
3987.4 110801888 110798585 110772407 110752821 110745943 110738862
3997.6 110738862
$$ packed form
3842.6A10191607Q3399N9140j204r5677r0623P5352J32024P8023J1658j8048J7858
3865A10443509J2874l0827j622O2740P6795J7452m5156k6763o79J2588L8195J7869
3889.5A10576975R418M1473J9204n7208r7644n7281K6811J08420J16790N8484J5092
3912A10760534j5938n3549l3832K6655K6334J0466K8122N674l0708q571L3736M3154
3936.4A10792077J7738k7692l2187L755k491j4901N495K5869L5679K3210o104k3985
3960.9A10796463n269K4498J5354j7834l0636k1184p760n25N293J2612Q142Q047J4687
3987.4A10801888l303k6178j9586o878p081
3997.6A10738862
##END=$$ End of the data block
