##TITLE=Polimero Denyo $$ Begin of the data block
##JCAMP-DX=5.00 $$ ACD/SpecManager v 10.08
##SPECTROMETER/DATA SYSTEM=Alpha
##DATE=10 Oct 2013 11:06:26
##DATA TYPE=INFRARED SPECTRUM
##DATA CLASS=XYDATA
##ORIGIN=
##OWNER=
##NPOINTS=1765
##FIRSTX=399.75695801
##LASTX=3997.56933594
##MAXX=3997.56933594
##MINX=399.75695801
##MAXY=1.03045249
##MINY=0.55472213
##XFACTOR=1.0000000000
##YFACTOR=0.000000010000000
##FIRSTY=1.00000000
##DELTAX=2.03957629
##XUNITS=1/CM
##YUNITS=ARBITRARY UNITS
##XYDATA=(X++(Y..Y))
399.8A00000000k45428m3589J32752K443k38388j55139J69563K51442J28073J26504
420.2A00128233K27201M28951M75216K32005O1763J61790L55578L45194N9140q1813
440.5A02393258J49333L39520J63138j61886k80667r7775O1321p6818l54100m17280
460.9A01718044k26938j03105k69520n15747m64928K09296j38092M0221j47724p6509
481.3A00024998J59013K16568O270j55949n1296J39976J32489r2757k73621j86789
501.7I9918902J3506K396k14374l41129k03347J2296M2820r3835j44178M3279L06654
524.2I9342990L97116K10494K60448K88403L85022K71714J4925j07229N615J04952
544.6A01174450n150j78718j88184l8517L5107r1588k40421k25652q6641j8191k02763
$$ y = [100000000, 99754572, 99710983, 99843735, 99846178, 99607790, 99452651, 99622214, 99873656, 100001729, 100128233, 100355434, 100784385, 101259601, 101491606, 101553369, 101715159, 102070737, 102415931, 102475071, 102393258, 102542591, 102882111, 103045249, 102883363, 102602696, 102504921, 102566242, 102489424, 102135324, 101718044, 101491106, 101388001, 101118481, 100602734, 100137806, 100347102, 100209010, 100249231, 100101507, 100024998, 100184011, 100400579, 100406849, 100250900, 100199604, 100339580, 100472069, 100379312, 100105691, 99918902, 99932408, 99934804, 99720430, 99379301, 99175954, 99188250, 99231070, 99137235, 98993057, 99036336, 99342990, 99740106, 99950600, 100211048, 100499451, 100884473, 101156187, 101171112, 101063883, 101069498, 101174450, 101169300, 100990582, 100802398, 100763881, 100798988, 100707400, 100466979, 100241327, 100154686, 100136495, 99933732]
567I9933732j36221j87772p7838p2152k26432l83550m01586m02397n64086q62926j194150
589.4I5424622j541799j955616k441365k838582k848095k280902j297057k26778P10833
607.8H0705261J486731K073413K314752K104134J532912Q03685J21540m22561p55728
626.1H9964139p59267m50325k0910K98417M07195L72213L30842L24338K71517J35976
646.5I0874135L589J2153J32537K24936K47478K86973M40705O26391N60999L93599
666.9I3803495O15466P73454O37477M93539K90989J32794J36756K33132K33817R6405
687.3I7447324j1099M6492J67507J58060j5450j64944j39272m6271j23447m08447o39320
709.8I6271133n03778r4265N6982k68298o93542q98611j007563j090032p34538L64625
$$ y = [99933732, 99797511, 99609739, 99531901, 99459749, 99233317, 98849767, 98448181, 98045784, 97481698, 96618772, 95424622, 93882823, 91927207, 89485842, 86647260, 83799165, 81518263, 80221206, 79994428, 80705261, 82191992, 84265405, 86580157, 88684291, 90217203, 91020888, 91142428, 90719867, 89964139, 89204872, 88754547, 88733637, 89032054, 89439249, 89811462, 90142304, 90466642, 90738159, 90874135, 90877724, 90889877, 91022414, 91247350, 91494828, 91781801, 92222506, 92848897, 93409896, 93803495, 94418961, 95192415, 95829892, 96323431, 96614420, 96747214, 96883970, 97117102, 97350919, 97447324, 97436225, 97482717, 97650224, 97808284, 97792834, 97627890, 97488618, 97442347, 97318900, 96910453, 96271133, 95767355, 95673090, 95730072, 95461774, 94768232, 93869621, 92862058, 91772026, 91037488, 91402113]
730.2I1402113J674176K321833K062053J295334N98275K92993K49827J61213j21606
748.5I9936211n7745o9028Q4329R3245p7540k07853j26433K2918P045j72019l06171
771I9126959k62803j59216k15393m73154p52997r40544j150918j491636j789754j718289
791.4I0172255j171625m24385J44929M02141M81653N62376O36261N69696L69697K04909
811.7I1947907J80990K24930J83171K8157r5224q6111j3590k0433j44696k60579k44558
834.2I1699964j58322j49089k51615l63594l78615l09622k76942k96390j77252j8304
854.6H9320219p1562j85275k42853l11822l66866m27831o12485r46236j255422j347870
875H3551997j210398r27656m53395L00586J072300J393824J191086P66403L83073J46490
$$ y = [91402113, 93076289, 95398122, 97460175, 98755509, 99353784, 99646777, 99896604, 100057817, 99936211, 99878466, 99809438, 99893767, 99987012, 99909472, 99701619, 99575186, 99598104, 99605149, 99433130, 99126959, 98864156, 98704940, 98489547, 98016393, 97263396, 96322852, 95171934, 93680298, 91890544, 90172255, 89000630, 88576245, 88721174, 89123315, 89604968, 90167344, 90803605, 91373301, 91742998, 91947907, 92128897, 92353827, 92536998, 92565155, 92469931, 92383820, 92370230, 92349797, 92205101, 91944522, 91699964, 91541642, 91392553, 91140938, 90777344, 90398729, 90089107, 89812165, 89515775, 89338523, 89320219, 89248657, 89063382, 88820529, 88508707, 88141841, 87714010, 87101525, 86155289, 84899867, 83551997, 82341599, 81413943, 80960548, 81261134, 82333434, 83727258, 84918344, 85684747, 86067820, 86214310]
895.4H6214310L0118n8418j80918l18414m06140m22126m28588m90534n85926o49046
915.8H2704318o54263o43062o90216q14510r41515r99736r91184r63914r38541q79836
936.2G4187541p61408o10357m67545l00926j5712M15159Q81433J195151J234334J053822
956.6G6811492Q21519O57183N61703M74816L76082K92515K28364J38378j3382j95920
977H0152750l42631m28033m92591n83076o85567p47573p63441p90035q76296j003563
997.3G3439944j112718j173180j200348j218122j210213j131058r55963p16972m86309
1015.7F4235061k95060j19663N6869K11906L04538L28392L24166L26401L15523K52176
1036.1F5940309J40374L1597k2048j0818M0579J14441K03234K88182L36027L23326
$$ y = [86214310, 86244428, 86186010, 86005092, 85686678, 85280538, 84858412, 84429824, 83939290, 83353364, 82704318, 82050055, 81406993, 80716777, 79902267, 78960752, 77961016, 76969832, 76005918, 75067377, 74187541, 73426133, 72815776, 72348231, 72047305, 72031593, 72446752, 73328185, 74523336, 75757670, 76811492, 77633011, 78290194, 78851897, 79326713, 79702795, 79995310, 80223674, 80362052, 80348670, 80152750, 79810119, 79382086, 78889495, 78306419, 77620852, 76873279, 76109838, 75319803, 74443507, 73439944, 72327226, 71154046, 69953698, 68735576, 67525363, 66394305, 65438342, 64721370, 64235061, 63940001, 63820338, 63877207, 64089113, 64393651, 64722043, 65046209, 65372610, 65688133, 65940309, 66080683, 66112280, 66090232, 66079414, 66119993, 66234434, 66437668, 66725850, 67061877, 67385203]
1056.5F7385203K59888J76221R7865L6251j5866o8880j13040j40601j59288j71732
1076.9F7286021j79583j84197j80190j75399j78546j74760j59878j54418j65224j72841
1097.3F5560985j46890q7124m0585l7074n5862o1970m9419l8439l5232k5749O050N3733
1121.8F5042424R5767J27488J75053K75225M07433N13506N81092O36679P11292Q23313
1142.2F9389272R67568J121354J258618J350349J338005J162493Q42255M79645J86223
1160.5G8095782l624j37830k71589m03887m95749n44995o02597o99139p98005q43590
1180.9G3294777q32975q17514q36497q75378q90916q64947q27998q18604q26151q00818
1201.3F4902979p22623o28024n63341n27668m76438l82841k75433k08330j91224j77204
$$ y = [67385203, 67645091, 67821312, 67919177, 67955428, 67939562, 67870682, 67757642, 67617041, 67457753, 67286021, 67106438, 66922241, 66742051, 66566652, 66388106, 66213346, 66053468, 65899050, 65733826, 65560985, 65414095, 65326971, 65286386, 65249312, 65193450, 65131480, 65082061, 65043622, 65008390, 64982641, 64988691, 65042424, 65138191, 65265679, 65440732, 65715957, 66123390, 66636896, 67217988, 67854667, 68565959, 69389272, 70356840, 71478194, 72736812, 74087161, 75425166, 76587659, 77429914, 77909559, 78095782, 78092158, 77954328, 77682739, 77278852, 76783103, 76238108, 75635511, 74936372, 74138367, 73294777, 72461802, 71644288, 70807791, 69932413, 69041497, 68176550, 67348552, 66529948, 65703797, 64902979, 64180356, 63552332, 62988991, 62461323, 61984885, 61602044, 61326611, 61118281, 60927057, 60749853]
1221.7F0749853j27614o4194m0186o1881p4959l8117K0438M3464J8078l397K5946Q2349
1246.2F0529780J07277P9101M1789M6766Q5902J03617P2926L7235N6434J21391J62285
1268.6F1444503J46413J18780J34838J92010K35140K27690K05332K20335K74580L15679
1289F3515300K98416K50691K44713K92278L22598K95347K53308K58225L08722L44026
1309.4F6383624L22604K76125K66921L12883L61109L57383L32070L40050L88390M32426
1329.8F9773585M27180L79533L31318K98619K51902J40595l1281k22736m25518o53594
1350.2G0269603r13275j146817j243371j159334j000434q75640p78002o94996o24466
1368.5F1833268n25468m26394l41898k30628j10579j7846M7303J21849K27464K89482
$$ y = [60749853, 60622239, 60558045, 60517859, 60455978, 60381019, 60342902, 60363340, 60406804, 60424882, 60421485, 60447431, 60529780, 60637057, 60716158, 60757947, 60804713, 60890615, 60994232, 61067158, 61104393, 61160827, 61282218, 61444503, 61590916, 61709696, 61844534, 62036544, 62271684, 62499374, 62704706, 62925041, 63199621, 63515300, 63813716, 64064407, 64309120, 64601398, 64923996, 65219343, 65472651, 65730876, 66039598, 66383624, 66706228, 66982353, 67249274, 67562157, 67923266, 68280649, 68612719, 68952769, 69341159, 69773585, 70200765, 70580298, 70911616, 71210235, 71462137, 71602732, 71571451, 71348715, 70923197, 70269603, 69356328, 68209511, 66966140, 65806806, 64806372, 63930732, 63152730, 62457734, 61833268, 61307800, 60881406, 60539508, 60308880, 60198301, 60180455, 60227758, 60349607, 60577071, 60866553]
1388.9F0866553K56478K08390J75893J36275J18136J07855P1454L3241O6l5894r9439
1411.4F1839008k08920l32570m51708n55104n81974o16270o71560o70105o42717n64581
1431.8E6543499m50998l53802k10017n6469L9709J05106J73396K71547L63314M03536
1452.2E6828821M19479N40227O75738N64170M81552N50383O00547N48124N51516O66898
1472.6F2427455O88464N97965N42319N21624N05895M60106M33206M69184N00906M33534
1493F7580658L95346M65095N00339M50105L75473M09818N87374N61929M50491M15558
1513.4G2192186L94690L89582L84837M19820L99452L28172L22496K99371K84505L04740
1533.7G5719851K44105J85090K85274L60525K86364K28584J99670K12967K17104J81771
$$ y = [60866553, 61123031, 61331421, 61507314, 61643589, 61761725, 61869580, 61941034, 61974275, 61974341, 61938447, 61839008, 61630088, 61297518, 60845810, 60290706, 59708732, 59092462, 58420902, 57750797, 57108080, 56543499, 56092501, 55738699, 55528682, 55472213, 55511922, 55617028, 55790424, 56061971, 56425285, 56828821, 57248300, 57788527, 58464265, 59028435, 59509987, 60060370, 60660917, 61209041, 61760557, 62427455, 63115919, 63713884, 64256203, 64777827, 65283722, 65743828, 66177034, 66646218, 67147124, 67580658, 67976004, 68441099, 68941438, 69391543, 69767016, 70176834, 70764208, 71326137, 71776628, 72192186, 72586876, 72976458, 73361295, 73781115, 74180567, 74508739, 74831235, 75130606, 75415111, 75719851, 75963956, 76149046, 76434320, 76794845, 77081209, 77309793, 77509463, 77722430, 77939534, 78121305]
1554.1G8121305J31124K07114L46237K45589J75435J86854K38836L18515K87253K52241
1574.5H0510503L24059L22622K81101K82258K60866K19357J96170J92678J72675J22482
1594.9H2884771O4754L9291M1140K9647j9485p0143p8862o1781o5815q2457p7498p7647
1619.4H2525915p6693o6919q4060j08755j03145r4271q1730l3289q571q339J0055L0238
1643.9H1900436Q8435J30886P8148K01171M73267L44914K22361K81412M02027M20386
1664.3H4543443K94161K57551K84970J96260J11741K2233j62965l27856m61972o43199
1684.7H4114367q00306r00179r67687r02617q39317p93058p53897q27790q86935j040339
1705.1G5402242j263148j323413j289261j195764j071006r36586p21294n08582l69752
$$ y = [78121305, 78252429, 78459543, 78805780, 79051369, 79226804, 79413658, 79652494, 79971009, 80258262, 80510503, 80834562, 81157184, 81438285, 81720543, 81981409, 82200766, 82396936, 82589614, 82762289, 82884771, 82949525, 82988816, 83029956, 83059603, 83040118, 82969975, 82891113, 82829332, 82763517, 82681060, 82603562, 82525915, 82449222, 82382303, 82298243, 82189488, 82086343, 81992072, 81910342, 81877053, 81868482, 81860143, 81870198, 81900436, 81988871, 82119757, 82197905, 82399076, 82872343, 83217257, 83439618, 83721030, 84123057, 84543443, 84837604, 85095155, 85380125, 85576385, 85688126, 85710359, 85547394, 85219538, 84757566, 84114367, 83314061, 82413882, 81446195, 80543578, 79704261, 78911203, 78157306, 77329516, 76442581, 75402242, 74139094, 72815681, 71526420, 70330656, 69259650, 68323064, 67601770, 67093188, 66723436]
1723.4F6723436k74354k23249k07657j63859k3270P8321K0855K9797R7894J39505J75798
1745.9F6373217K05642K77788L51488L62474M22168N00422N25874O08933O16664N62525
1766.3G0807195N53500N31626N80579N81241M84139M42034M35215M15081M17172M06301
1786.7G5654083L27433K81149L13860L07149K67988K68114K76130K64061K35152K10261
1807G8405380J83249J45286J07086J07139J46765J63096J38783J36447J91194K47616
1827.4G9972041L13759L43686K98792K90149L21007L05826K57206K73960L00247K69949
1847.8H2946622K53117K35159K01350J89704K05320K15381J95593J53649J39123J97327
1868.2H4932345K52867K17551J72794J75476K05242K24811K13486J88136J70666J91379
$$ y = [66723436, 66449082, 66225833, 66018176, 65854317, 65831047, 65909368, 65930223, 65960020, 66057914, 66197419, 66373217, 66578859, 66856647, 67208135, 67570609, 67992777, 68493199, 69019073, 69628006, 70244670, 70807195, 71360695, 71892321, 72472900, 73054141, 73538280, 73980314, 74415529, 74830610, 75247782, 75654083, 75981516, 76262665, 76576525, 76883674, 77151662, 77419776, 77695906, 77959967, 78195119, 78405380, 78588629, 78733915, 78841001, 78948140, 79094905, 79258001, 79396784, 79533231, 79724425, 79972041, 80285800, 80629486, 80928278, 81218427, 81539434, 81845260, 82102466, 82376426, 82676673, 82946622, 83199739, 83434898, 83636248, 83825952, 84031272, 84246653, 84442246, 84595895, 84735018, 84932345, 85185212, 85402763, 85575557, 85751033, 85956275, 86181086, 86394572, 86582708, 86753374, 86944753]
1888.6H6944753K21932K06703J77121J66702J72377J86723J82510J54412J34718J47355
1909H8695306J70266J57958J22273J17332J39898J51313J53029J28090R7913J03253
1929.4I0036631J23202J25969J03891P9584P8607J12670J36870J13225Q5229Q8912
1949.8I1084790J13172J25926J14107R7895J03802J22356J25790J11621R6607R2215
1970.2I2188281R9951J05524R6059Q2534Q0335R0582R2029P3654N0437M6587O1458
1992.6I3067431O1191L8117J5712J1330K1869L0077K4557J3047R048J2148J7535K1762
2017.1I3343824J9920K3526L8296M7195M8959N3495O1763P0315P3576P2885P7522Q8197
2041.6I4019473R3877Q9776Q4311Q6957R4068R5052Q9842Q8787R4074R7895J01715
$$ y = [86944753, 87166685, 87373388, 87550509, 87717211, 87889588, 88076311, 88258821, 88413233, 88547951, 88695306, 88865572, 89023530, 89145803, 89263135, 89403033, 89554346, 89707375, 89835465, 89933378, 90036631, 90159833, 90285802, 90389693, 90469277, 90547884, 90660554, 90797424, 90910649, 90995878, 91084790, 91197962, 91323888, 91437995, 91535890, 91639692, 91762048, 91887838, 91999459, 92096066, 92188281, 92288232, 92393756, 92489815, 92572349, 92652684, 92743266, 92835295, 92908949, 92959386, 93005973, 93067431, 93128622, 93166739, 93182451, 93193781, 93215650, 93245727, 93270284, 93283331, 93292379, 93304527, 93322062, 93343824, 93363744, 93387270, 93425566, 93472761, 93521720, 93575215, 93636978, 93707293, 93780869, 93853754, 93931276, 94019473, 94113350, 94203126, 94287437, 94374394, 94468462, 94563514, 94653356, 94742143, 94836217, 94934112, 95035827]
2064I5035827J01578R3007R0653R6882R6052Q6421Q0079Q3959R2817R0092P3641O3456
2088.5I6084464O7293P2593O7621N1624L8093L7927M2283M0138K9468J9783J9688K0694
2113I6591669J3680K753j895M703J3542R948k635r465m911J919k420j5235k1756j4239
2141.5I6565658L16M506n788j1098r54J4061K2924K4342K4432L2157M6492N4407N5337
2168I6826792O1148P3904Q6254R2262Q7881Q2636Q9621J01805J02085Q9324P9238P9620
2192.5I7852570Q6492R2399Q8853P7546P4917Q1390Q2189P3790O0702N1170M7678M9221
2217I8718917N1368M4959L1609K3776K4372K3699J5092J037r584q804k277o282j5944
2243.5I8891938j3167j603O962J0788Q810O055J5444L2198L6812K6936K0360L1466
$$ y = [95035827, 95137405, 95230412, 95321065, 95417947, 95513999, 95600420, 95680499, 95764458, 95857275, 95947367, 96021008, 96084464, 96151757, 96224350, 96291971, 96343595, 96381688, 96419615, 96461898, 96502036, 96531504, 96551287, 96570975, 96591669, 96605349, 96608102, 96606207, 96610910, 96624452, 96634400, 96631765, 96622300, 96617389, 96619308, 96616888, 96601653, 96579897, 96565658, 96565974, 96570480, 96564692, 96553594, 96552640, 96566701, 96589625, 96613967, 96638399, 96670556, 96717048, 96771455, 96826792, 96887940, 96961844, 97048098, 97140360, 97228241, 97310877, 97400498, 97502303, 97604388, 97693712, 97772950, 97852570, 97939062, 98031461, 98120314, 98197860, 98272777, 98354167, 98436356, 98510146, 98570848, 98622018, 98669696, 98718917, 98770285, 98815244, 98846853, 98870629, 98895001, 98918700, 98933792, 98934829, 98925245, 98916441, 98914164, 98907882, 98891938, 98878771, 98877168, 98884130, 98894918, 98903728, 98909783, 98925227, 98957425, 98994237, 99021173, 99041533, 99072999]
2268I9072999M9549N0497L3999K1505K5749L9882L4535l553l7128l8158k5100k5833
2292.5I9198943m6384o7657p1663o4248p0268r9283j26201j22517q2082l8278n0092
2314.9I8360270j14739j51795j13880m6868l5804p6741o6835Q601L7795n447m1724
2337.3I7752833k8461M7875K21991L67493J58518k08419l87496l54672k53719j54060
2357.7I7161883l2776R7072K09933K93595L32075L32362L31831L20541K70784K10369
2378.1I9527669J73730J46645J05196m83M6760k1881j5020m900j1128k3800k1279m720
2402.6I9896789O377L070n710m631J0192K5433K7508J8573J4871K1726K3603J2386
2427.1A00050187j430j0121j3733j5998k7895m7541n7423n2726m6456m8733n2690n0771
$$ y = [99072999, 99122548, 99173045, 99207044, 99228549, 99254298, 99294180, 99328715, 99325162, 99288034, 99249876, 99224776, 99198943, 99152559, 99084902, 99013239, 98948991, 98878723, 98779440, 98653239, 98530722, 98448640, 98410362, 98360270, 98245531, 98093736, 97979856, 97932988, 97897184, 97820443, 97753608, 97762209, 97800004, 97794557, 97752833, 97724372, 97772247, 97994238, 98361731, 98520249, 98311830, 97924334, 97569662, 97315943, 97161883, 97129107, 97226179, 97436112, 97729707, 98061782, 98394144, 98725975, 99046516, 99317300, 99527669, 99701399, 99848044, 99953240, 99952757, 99999517, 99977636, 99962616, 99957716, 99946588, 99922788, 99901509, 99896789, 99903166, 99906236, 99900526, 99895895, 99906087, 99931520, 99959028, 99977601, 99992472, 100014198, 100037801, 100050187, 100048757, 100038636, 100024903, 100008905, 99981010, 99933469, 99876046, 99823320, 99776864, 99728131, 99675441, 99624670]
2451.5I9624670m4507l7432l5989l6681k6715j2666j0538j7226j7863j0383m482n627
2476I9364561r823q869j508L415j675j6445l1829l9368m6158o1542q0621r1994r1201
2502.5I8886943r1374j09541j40620j69790j96164k13761k03120j57821q8960j4800
2522.9I7500992M1365O7115P3648P9196Q8680R6727R6410Q5432P3921P4196P8684O9553
2547.4I8425919N3793N9670R1815J24198J39195J40888J33699J18869R7210O4283K2638
2569.8I9472177q762j2886J633J2797J2982J0270J5515K7799L9643N0956O2383P6764
2594.3I9761271R3234Q9538J5277N5963r752j3768j7876l7610n6321o3044o5112o9326
2618.8I9682474p9483q9067p7373l3420J9467N0568N7698N8025O5583P2014O1763M1729
$$ y = [99624670, 99580163, 99542731, 99506742, 99470061, 99443346, 99430680, 99420142, 99402916, 99385053, 99374670, 99370188, 99364561, 99354738, 99345869, 99344361, 99347776, 99346101, 99329656, 99297827, 99258459, 99212301, 99150759, 99070138, 98978144, 98886943, 98795569, 98686028, 98545408, 98375618, 98179454, 97965693, 97762573, 97604752, 97515792, 97500992, 97542357, 97609472, 97683120, 97762316, 97850996, 97947723, 98044133, 98129565, 98203486, 98277682, 98356366, 98425919, 98479712, 98539382, 98631197, 98755395, 98894590, 99035478, 99169177, 99288046, 99385256, 99449539, 99472177, 99463415, 99450529, 99452162, 99464959, 99477941, 99488211, 99503726, 99531525, 99571168, 99622124, 99684507, 99761271, 99854505, 99944043, 99959320, 100015283, 100005531, 99991763, 99973887, 99936277, 99879956, 99816912, 99751800, 99682474, 99602991, 99513924, 99436551, 99403131, 99422598, 99473166, 99530864, 99588889, 99654472, 99726486, 99788249, 99829978]
2643.3I9829978K7567K4778K3001J1843n853k0969k4861k2751k9957m4984n3453m7231
2667.7I9667108l0923j7905j5318j7775r453J3060K8228K2263J1187J7846L3146L4559
2692.2I9736023K3287J3066J3816J8174J0836j925o849p814j1003j2887j5807k2924
2716.7I9735993k3270j6444j6284k3485l1966l6281l1143k5666k8914l3528l0375k2131
2741.2I9416506j9258k2966l0481l2771k1017o854j258m113o389M29R131J0997L845
2767.7I9295801l940j031N984P773N161k324o348j001j783j1229j4931j3059j4073
2794.2I9245000j9729k8527m0519n0009n4079o4182q5139j08755j24645j25575j21987
2816.6I8421854j31792j55950j77747j87373j95050k10005k33919k67881l05098l39431
$$ y = [99829978, 99857545, 99882323, 99905324, 99917167, 99911314, 99890345, 99865484, 99842733, 99812776, 99767792, 99714339, 99667108, 99636185, 99618280, 99602962, 99585187, 99575734, 99588794, 99617022, 99639285, 99650472, 99668318, 99701464, 99736023, 99759310, 99772376, 99786192, 99804366, 99815202, 99813277, 99806428, 99798614, 99787611, 99774724, 99758917, 99735993, 99712723, 99696279, 99679995, 99656510, 99624544, 99588263, 99557120, 99531454, 99502540, 99469012, 99438637, 99416506, 99397248, 99374282, 99343801, 99311030, 99290013, 99283159, 99281901, 99277788, 99271399, 99271828, 99280959, 99291956, 99295801, 99291861, 99290830, 99296814, 99304587, 99309748, 99307424, 99301076, 99300075, 99298292, 99287063, 99272132, 99259073, 99245000, 99225271, 99196744, 99156225, 99106216, 99052137, 98987955, 98902816, 98794061, 98669416, 98543841, 98421854, 98290062, 98134112, 97956365, 97768992, 97573942, 97363937, 97130018, 96862137, 96557039, 96217608]
2837I6217608l78716m30297m79436n01919m89521m48972l90262l30030k82509k39372
2857.4I2246574j97029j62131j23435p1800j6343L1167O3634Q6838J13124J33657J29247
2879.9I2233503R8407M4835k3115r4950j72871k61474l48556m12768m53949m94254
2900.2I0114808n55044o27596o88374p41916p90668q20273q16602p56383o31064m78387
2920.6H3208501l41713k29400j40155q0579n3454n1278n2803l6800O622O8623J21718
2943.1H2419282J52648J72996J90878J96123J80620J57774J42520J30588J07616P4131
2963.5H3925176M7916L9249M5586O6614R5958J23584J61564K17081K70944L14898L63516
2985.9H5672086M29905N03576N59616N84942N82415N59330N18775M56637L66682K59596
$$ y = [96217608, 95838892, 95408595, 94929159, 94427240, 93937719, 93488747, 93098485, 92768455, 92485946, 92246574, 92049545, 91887414, 91763979, 91692179, 91675836, 91707003, 91770637, 91857475, 91970599, 92104256, 92233503, 92331910, 92376745, 92353630, 92258680, 92085809, 91824335, 91475779, 91063011, 90609062, 90114808, 89559764, 88932168, 88243794, 87501878, 86711210, 85890937, 85074335, 84317952, 83686888, 83208501, 82866788, 82637388, 82497233, 82416654, 82363200, 82311922, 82259119, 82222319, 82228941, 82297564, 82419282, 82571930, 82744926, 82935804, 83131927, 83312547, 83470321, 83612841, 83743429, 83851045, 83925176, 83973092, 84012341, 84057927, 84124541, 84220499, 84344083, 84505647, 84722728, 84993672, 85308570, 85672086, 86101991, 86605567, 87165183, 87750125, 88332540, 88891870, 89410645, 89867282, 90233964, 90493560]
3006.3I0493560J63275R4831M3273l612k3079P194P1383J42949K02644K47246K97302
3028.7I1736966L48843L59720L21334K66951K25419K00665J73241J32555J00130R2178
3049.1I3958002Q7065P2586O0094M4739K5213K1463L0452K7985J2177J699K002j54
3073.6I4343323m083n675q017p248r930k3776l7813m0734l4773k8479k4289k4438k8211
3100.1I4065857l0869l0756k8861l4362m2486l6967k8223l3241m9651p1341q0454o7288
3124.6I3531358n9104p4231q9485q5109p7701p6163q1801r8497j04409r7871j01292
3147I2585695j04821r9188j06609j27470j37544j35070j29014j23090j23239j31738
3167.4I1367912j45286j51187j39386j26528j31935j49769j56712j44369j32513j36214
$$ y = [90493560, 90656835, 90751666, 90794939, 90791327, 90768248, 90775442, 90846825, 90989774, 91192418, 91439664, 91736966, 92085809, 92445529, 92766863, 93033814, 93259233, 93459898, 93633139, 93765694, 93865824, 93958002, 94045067, 94117653, 94177747, 94222486, 94247699, 94269162, 94299614, 94327599, 94339776, 94341475, 94343477, 94343323, 94339240, 94333565, 94325548, 94318300, 94308370, 94284594, 94246781, 94206047, 94171274, 94142795, 94118506, 94094068, 94065857, 94034988, 94004232, 93975371, 93941009, 93898523, 93861556, 93833333, 93800092, 93750441, 93679100, 93598646, 93531358, 93472254, 93398023, 93308538, 93223429, 93145728, 93069565, 92987764, 92889267, 92784858, 92686987, 92585695, 92480874, 92381686, 92275077, 92147607, 92010063, 91874993, 91745979, 91622889, 91499650, 91367912, 91222626, 91071439, 90932053, 90805525, 90673590, 90523821, 90367109, 90222740, 90090227, 89954013]
3187.8H9954013j49274j55378j50072j47200j55812j67179j66715j57976j57159j59598
3208.2H8387650j56772j55085j51682j49566j58739j67948j68300j64401j55390j45960
3228.6H6813807j41334j43766j57911j64759j55598j51640j45287j27017j26487j47200
3249H5352808j52027j33706j18923j23125j35404j36536j29074j21647j08040r7835
3269.4H4096491j11574j32936j37633j35595j35409j34135j30450j21403j09875j01954
3289.8H2845527j11252j34945j44231j41716j40936j25020j04279j12909j42401j66047
3310.2H1521791j71846j60539j52421j56266j59454j56546j54173j64086j76292j76615
3330.6G9893553j73545j61463j44422j57201j85323j91593j87862j76638j58847j72501
$$ y = [89954013, 89804739, 89649361, 89499289, 89352089, 89196277, 89029098, 88862383, 88704407, 88547248, 88387650, 88230878, 88075793, 87924111, 87774545, 87615806, 87447858, 87279558, 87115157, 86959767, 86813807, 86672473, 86528707, 86370796, 86206037, 86050439, 85898799, 85753512, 85626495, 85500008, 85352808, 85200781, 85067075, 84948152, 84825027, 84689623, 84553087, 84424013, 84302366, 84194326, 84096491, 83984917, 83851981, 83714348, 83578753, 83443344, 83309209, 83178759, 83057356, 82947481, 82845527, 82734275, 82599330, 82455099, 82313383, 82172447, 82047427, 81943148, 81830239, 81687838, 81521791, 81349945, 81189406, 81036985, 80880719, 80721265, 80564719, 80410546, 80246460, 80070168, 79893553, 79720008, 79558545, 79414123, 79256922, 79071599, 78880006, 78692144, 78515506, 78356659, 78184158]
3351G8184158k05827k04784j80489j68514j68067j64414j48755j38003j53386j78653
3371.4G6473266j81627j68509j56241j46640j43492j35034j19019j04350q8590q8835
3391.8G5140929j13290j15013p9787o3783q8293j09815r7233p3058o5261p3558q0794
3414.2G4181044p9286o5190m5764m7368n6869n0932m4584m7606n3829o2979p5411q4371
3438.7G3466855q1008p5210n8621k1761r078j0824J5652N3656Q8638J22958J51766
3461.1G3643023J70284J92964K21944K24626K12330K22754K35826K27672K25449K37721
3481.5G5814593K27183K10363K21693K23166J96910J85764K02888K04873J89066K08264
3501.9G7884763K16616J69962J72258K19959K15626J85340J72669J69128J75238J99002
$$ y = [78184158, 77978331, 77773547, 77593058, 77424544, 77256477, 77092063, 76943308, 76805305, 76651919, 76473266, 76291639, 76123130, 75966889, 75820249, 75676757, 75541723, 75422704, 75318354, 75229764, 75140929, 75027639, 74912626, 74832839, 74769056, 74680763, 74570948, 74473715, 74400657, 74335396, 74261838, 74181044, 74101758, 74036568, 73990804, 73943436, 73886567, 73835635, 73791051, 73743445, 73689616, 73626637, 73551226, 73466855, 73385847, 73310637, 73252016, 73230255, 73221177, 73210353, 73226005, 73279661, 73368299, 73491257, 73643023, 73813307, 74006271, 74228215, 74452841, 74665171, 74887925, 75123751, 75351423, 75576872, 75814593, 76041776, 76252139, 76473832, 76696998, 76893908, 77079672, 77282560, 77487433, 77676499, 77884763, 78101379, 78271341, 78443599, 78663558, 78879184, 79064524, 79237193, 79406321, 79581559, 79780561]
3522.3G9780561K10052K06149K19679K16985J90890J98257K27367K14845J82593K04450
3542.7H1851828K83337L07518K29377K15452K78694K62552K25270K49458K41398J80745
3563.1H4325629K83927N24479M51947K03394J87010K68978K85900K68024K00218J08212
3583.5H7107718K05123M45962L37619P4428J29891K41470J94013J83225J74934N2785
3603.9H9147168N1189K47228K92581J85430R6059K2078K22850L92675R2077k24966
3624.3I0524369r2315N80972P09737J26200L1102J56027J71703J70720O7294o4248
3644.7I2381561J69974P97803P82728P6705L8964M26423L10689J17487J28061J9717
3665.1I5250112J6767M07981M11332Q2433N34875O30086N5832p6354j23697j60694
$$ y = [79780561, 79990613, 80196762, 80416441, 80633426, 80824316, 81022573, 81249940, 81464785, 81647378, 81851828, 82135165, 82442683, 82672060, 82887512, 83166206, 83428758, 83654028, 83903486, 84144884, 84325629, 84609556, 85134035, 85585982, 85789376, 85976386, 86245364, 86531264, 86799288, 86999506, 87107718, 87312841, 87758803, 88096422, 88170850, 88300741, 88542211, 88736224, 88919449, 89094383, 89147168, 89198357, 89445585, 89738166, 89923596, 90019655, 90041733, 90264583, 90657258, 90749335, 90524369, 90432054, 91013026, 91722763, 91848963, 91880065, 92036092, 92207795, 92378515, 92445809, 92381561, 92551535, 93349338, 94132066, 94208771, 94247735, 94674158, 94984847, 95102334, 95230395, 95250112, 95266879, 95674860, 96086192, 96168625, 96703500, 97333586, 97389418, 97313064, 97189367, 97028673]
3685.5I7028673K47013O80560L65633o1345j16056n4461Q0395K73972J35196j89734
3705.9I8389846j68604K23667N28443J51574k79003k46304o7479J8639M7391L4190
3726.3I8632360j82057k84773l850L72761M39399n2499n57632j72036O15471J75369
3746.7I8982513j87028M51994M17299k31088k74467Q6176J03152j33836r0277L8462
3767.1I9162900J73235J91379p3516k10375m3380J76376Q7905n8681J4424K2078m6140
3789.5I9396205j03813j20461k2155p7528J4370L60352O0928n4431K36189j02162m67932
3811.9I9119562k00260K49756Q1074J00416L62932n4252k51591j47653j08784o0153
3832.3I9091047r1976J03295L71969J51598n6374p0429k86066n81253m12822O83058
$$ y = [97028673, 97275686, 97956246, 98321879, 98260534, 98144478, 98090017, 98170412, 98444384, 98579580, 98389846, 98221242, 98444909, 98973352, 99124926, 98845923, 98599619, 98532140, 98550779, 98598170, 98632360, 98450303, 98165530, 98161680, 98534441, 98973840, 98921341, 98363709, 98191673, 98807144, 98982513, 98795485, 99247479, 99664778, 99433690, 99159223, 99245399, 99348551, 99214715, 99124438, 99162900, 99336135, 99527514, 99453998, 99243623, 99200243, 99376619, 99464524, 99405843, 99420267, 99442345, 99396205, 99292392, 99171931, 99149776, 99072248, 99086618, 99446970, 99507898, 99453467, 99689656, 99587494, 99119562, 98919302, 99169058, 99250132, 99350548, 99713480, 99659228, 99407637, 99259984, 99151200, 99091047, 98999071, 99102366, 99474335, 99625933, 99569559, 99499130, 99213064, 98631811, 98218989, 98902047]
3852.7I8902047q7172J096982n74679k79027O9869J16688r3448J01542L12430P1853
3873.1I9637085r7269k12001m5968J26279J2302J71584P0518j37233J43724Q5175k88343
3895.5I9465853k08730J14769K83796L26019J58161j18851j65862j11795r3376M4685
3915.9I9694669J72091O6274m6933L1621N3686o2079j3160J36304P2109o6030q7350
3938.4I9951202l5125N3370l2586L0547K7085M7040j0467l0959k2483j3774L952J1515
3962.9I9979317q166k0659j2445N72J6731L7313M4614L6573M1139O1012N4991L2878
3987.3A00263870M1616N4764N1940N1653L4500
3997.5A00498343
$$ y = [98902047, 98814875, 99911857, 99337178, 99058151, 99128020, 99244708, 99151260, 99252802, 99565232, 99637085, 99539816, 99327815, 99281847, 99408126, 99420428, 99592012, 99662530, 99525297, 99669021, 99754196, 99465853, 99257123, 99371892, 99655688, 99981707, 100139868, 100021017, 99855155, 99743360, 99649984, 99694669, 99866760, 99933034, 99886101, 99917722, 99971408, 99909329, 99896169, 100032473, 100104582, 100038552, 99951202, 99916077, 99969447, 99936861, 99967408, 99994493, 100041533, 100031066, 100000107, 99977624, 99963850, 99967802, 99979317, 99971151, 99950492, 99938047, 99938619, 99955350, 99992663, 100037277, 100073850, 100114989, 100176001, 100230992, 100263870, 100305486, 100360250, 100412190, 100463843, 100498343]
##END=$$ End of the data block
