##TITLE=Poliestireno padrao $$ Begin of the data block
##JCAMP-DX=5.00 $$ ACD/SpecManager v 10.08
##SPECTROMETER/DATA SYSTEM=Alpha
##DATE=29 Apr 2015 14:13:22
##DATA TYPE=INFRARED SPECTRUM
##DATA CLASS=XYDATA
##ORIGIN=
##OWNER=
##NPOINTS=1765
##FIRSTX=399.76428223
##LASTX=3997.64306641
##MAXX=3997.64306641
##MINX=399.76428223
##MAXY=0.93767124
##MINY=0.00045843
##XFACTOR=1.0000000000
##YFACTOR=1.000000000000000e-9
##FIRSTY=0.93767124
##DELTAX=2.03961372
##XUNITS=1/CM
##YUNITS=ARBITRARY UNITS
##XYDATA=(X++(Y..Y))
399.8I37671244j4942944j3382018q963048n404770m558266n093514n958021n838394
416.1H73530269p466674j1588097j1459231r895981r079337q232057p508397o311595
432.4H01988900n071998m352570l265202j570284m74691J69277J093686K266526M019558
450.8G94803202N777002O519198P348180P923662P289827P100284P780910Q817673
467.1H53359938R239435Q984089Q063495O554663N648792M824161L443420J504183
483.4I01622176q82566k835572m291474o274164q774698j0997414j2976707j4606952
499.7H39982629j6523063j8792749k0582855k2090792k2617579k2175252k1451473
514F95748866k1744132k3985863k7196527l0931234l7609398m9067259n9785217o6767663
$$ y = [937671244, 922728300, 909346282, 900383234, 894978464, 890420198, 885326684, 879368663, 873530269, 866063595, 854475498, 843016267, 833120286, 824040949, 815808892, 808300495, 801988900, 796916902, 792564332, 789299130, 787728846, 787254155, 787423432, 788517118, 790783644, 794803202, 800580204, 807099402, 814447582, 822371244, 829661071, 836761355, 844542265, 853359938, 862599373, 871583462, 879646957, 886201620, 891850412, 896674573, 900117993, 901622176, 900739610, 897904038, 893612564, 887338400, 878563702, 867566288, 854589581, 839982629, 823459566, 804666817, 784083962, 761993170, 739375591, 717200339, 695748866, 674004734, 650018871, 622822344, 591891110, 554281712, 505214453, 445429236, 378661573]
530.3C78661573p0195526o4543799m7860413k5044695l400728J2678579K2415548K6263282
546.6B28973821K5519654K3171306K0731300J8604070J7413556J7449498J8543005
560.9C70406210K0218432K2065521K3711830K5862664K8918922L2204926L5040855
575.2E58429360L5789490L3808887L0268133K5245726K0249426J6573429J3736666
589.4G34101117J1608839J0023355Q831263P796526O079018L210604j12534l736734
605.8G77801454p475138j0589957j2959123j4946877j7430842j9401253j4669716l688574
622.1F76639974K828360K833783L412009N811572Q304953J1103988J3201296J2975931
638.4G37111866J0922790Q584082O945968O228506O336570O406307N441130L274381
$$ y = [378661573, 308466047, 243922248, 196061835, 171017140, 167616412, 180294991, 202710539, 228973821, 254493475, 277664781, 298396081, 317000151, 334413707, 351863205, 370406210, 390624642, 412690163, 436401993, 462264657, 491183579, 523388505, 558429360, 594218850, 628027737, 658295870, 683541596, 703791022, 720364451, 734101117, 745709956, 755733311, 764564574, 772361100, 778440118, 781650722, 781538188, 777801454, 770326316, 759736359, 746777236, 731830359, 714399517, 694998264, 680328548, 676639974, 679468334, 682302117, 685714126, 691525698, 699830651, 710934639, 724135935, 737111866, 748034656, 756618738, 763564706, 769793212, 776129782, 782536089, 787977219, 791251600]
654.7G91251600L0875m413307r492576j3636648j5874565k1892846k7421832j9204616
671F79346085j8380344k4786771l0201494l4921527l9203286m3516845n2499562p5975985
687.3C59860271j10658914j21929898q5710686l4495141o491903j15300N39098P436622
703.7H434149L3153945Q4735904J34295315J44024819J16313815Q1325710N4847776
717.9F57131433L5785079J9509018L964186j1953950l0095577n1011861p1774185q5073053
734.3D66481090q6332351q1008941p6509253p0340856n6165331l5651937j7991211
748.5D2481210q827720o042860m623696j814330K210248O896749J1709819J7127428
764.9E9116848K4924651L6446690M9485095O0105607O6232487O7154587O2200039N3211242
$$ y = [791251600, 791282475, 786869168, 777376592, 763739944, 747865379, 725972533, 698550701, 679346085, 660965741, 636178970, 605977476, 571055949, 531852663, 488335818, 435836256, 359860271, 249201357, 127271459, 41560773, 7065632, 573729, 458429, 997527, 8434149, 41588094, 126323998, 260619313, 404644132, 520957947, 602283657, 657131433, 692916512, 712425530, 716389716, 704435766, 674340189, 623328328, 551554143, 466481090, 380148739, 299139798, 222630545, 152289689, 96124358, 60472421, 42481210, 33653490, 27610630, 22986934, 21172604, 23382852, 30279601, 41989420, 59116848, 84041499, 120488189, 169973284, 230078891, 296311378, 363465965, 425666004, 478877246]
781.2D78877246M4445694L8668930L6143601L5476745L4748435L2518744K9070795
795.4G29950190K5726199K2540331J8834293J5179872J2400210J0436416Q991301P804513
811.8H51863325O391763M492283K385259K24054k096474m512072p118762j0511994
828.1H41117382j5869319k4094701l3252597l8127303l4289360k2270143o529451Q308351
844.4F74992859J9059122K3748398K1794081J5169858Q103252L706038J875818J188039
860.7G69637465J053691J457096K035617K440572K882004L422201L672719L548562
877G90149927L249347K661586J460493j84417j951039m140973p376850j3097643k4263680
895.4G46506751m2663157o3436091p4878276o7042529l9579749j457990L4598589N7956338
$$ y = [478877246, 523322940, 561991870, 598135471, 633612216, 668360651, 700879395, 729950190, 755676389, 778216720, 797051013, 812230885, 824631095, 835067511, 844058812, 851863325, 858255088, 862747371, 865132630, 865356684, 863260210, 858748138, 851629376, 841117382, 825248063, 801153362, 767900765, 729773462, 695484102, 673213959, 666684508, 674992859, 694051981, 717800379, 739594460, 754764318, 762867570, 766573608, 768449426, 769637465, 770691156, 772148252, 774183869, 776624441, 779506445, 782928646, 786601365, 790149927, 793399274, 796060860, 797521353, 797336936, 795385897, 791244924, 783868074, 770770431, 746506751, 703843594, 640407503, 565529227, 498486698, 458906949, 457448959, 492047548, 550003886]
911.7E50003886O4350307N6550563M1574359K6762485J6053498R011209L442406j994848
928G65753865p520973j2990952j7803609k0675779k0553648j7046452j0350168k381324
944.3F56430960L504574N254984L403008n88060o369352j4510512k3777127k9037416
960.7E94311059k4561346j0434687O673634J8891930K1554947J5154660N222082j110434
977F25701845l8088O799400J4842987K0048261K0404100J6708732J1597812O462336
993.3G22527385M5955j1358976k6759744l1161606j4023006P313311J0937869l28123
1009.6F57193065j2640238k1048308k7704060l4839987m3585420n5250764o7466497
1023.9C94657791o6086203l6224187J6070754O9995463J01726770R4871640O1133325
$$ y = [550003886, 614354193, 670904756, 712479115, 739241600, 755295098, 764306307, 767748713, 765753865, 758232892, 745241940, 727438331, 706762552, 686208904, 669162452, 658812284, 656430960, 659935534, 665190518, 668593526, 668005466, 661636114, 647125602, 623348475, 594311059, 569749713, 559315026, 565988660, 584880590, 606435537, 621590197, 626812279, 625701845, 625663757, 632463157, 647306144, 667354405, 687758505, 704467237, 716065049, 722527385, 722573340, 711214364, 684454620, 653293014, 639270008, 646583319, 657521188, 657193065, 644552827, 623504519, 595800459, 560960472, 517375052, 462124288, 394657791, 328571588, 292347401, 308418155, 378413618, 480140388, 575012028, 636145353]
1038.2F36145353K7886331P763446j909197o351411q634388j0145724j1519134j3117194
1054.5F20118082j5241266j8373072k2786081k7543604k9685438k5140494j2333870
1068.8D69014257N468577K2167832L1716794L1808376K7548671K5633514K6038170
1083F39396191K5119125K1958650J8199563J5221953J3370156J2442887J2008548J1347055
1099.4G69064128R873450P184804L148913j068473l247082j882315K699793Q190512
1115.7G93963730J1296332J0451973O779492K393663j234591l719151n265117o370425
1132H08295906p486165q766234j0408580j2593329j5162468j8213272k3590505l4825564
1148.3F77249789m8981666m9581826k3774922J5129983M0064335M0472627K7362168
$$ y = [636145353, 664031684, 671795130, 669885933, 663534522, 654900134, 644754410, 633235276, 620118082, 604876816, 586503744, 563717663, 536174059, 506488621, 481348127, 469014257, 474482834, 496650666, 528367460, 560175836, 587724507, 613358021, 639396191, 664515316, 686473966, 704673529, 719895482, 733265638, 745708525, 757717073, 769064128, 778937578, 786122382, 789271295, 788202822, 784955740, 783073425, 785773218, 793963730, 805260062, 815712035, 822491527, 824885190, 823650599, 819931448, 814666331, 808295906, 800809741, 792043507, 781634927, 769041598, 753879130, 735665858, 712075353, 677249789, 628268123, 578686297, 554911375, 570041358, 610105693, 650578320, 677940488]
1162.6F77940488J4637053O833076K200067k093792r427964k3260772m0213407m4910132
1178.9E81704617k5362909O752789K7119875K6782989J6085744P205188L413558L076196
1195.2F46778047N400360J0162890J5417158J8423319J8189848J5801131J2801648
1209.5G42974401R917140P149696M370808J564801j122355l211677m155755l903330
1225.8G53583729l005504k321542k436876l233969m246354n030692n130827m437149
1242.1G23740816l284335j981914o12438P35820J886308K563417K545952J945317J054287
1260.5G28593230J33813o84023j530349k685071m354834o449282q273423q684337o715536
1278.8F89350188k989590K13444J024723p12156l358841m675627m051805l172278m251957
$$ y = [677940488, 692577541, 699410617, 701610684, 699516892, 690088928, 666828156, 626614749, 581704617, 556341708, 563094497, 590214372, 616997361, 633083105, 640288293, 643701851, 646778047, 652178407, 662341297, 677758455, 696181774, 714371622, 730172753, 742974401, 752891541, 760041237, 764412045, 765976846, 764854491, 761642814, 757487059, 753583729, 750578225, 748256683, 745819807, 742585838, 738339484, 733308792, 728177965, 723740816, 720456481, 718474567, 717862129, 718597949, 720484257, 723047674, 725593626, 727538943, 728593230, 728727043, 728043020, 726512671, 723827600, 719472766, 713023484, 704750061, 696065724, 689350188, 686360598, 686574042, 687598765, 686886609, 683527768, 678852141, 674800336, 671628058, 667376101]
1297.2F67376101p747889j1610031j3819158j4524340j4413536j2439847p366836p00772
1313.5E84753692M066289M350185J90318o036640j1267840j3012469q889497O65904
1329.8E54819942J0425269J4688790J1977434M306317n285025j1965573j3648510j1948645
1346.2E53369999q103490l911316j445890k024233n122662q190214r191811q821846
1362.5E06558537p612496o266683n711139m400760L666P795632J5308261J9636273
1378.8E25311291K1376550K2851289K6932716L3887982L6127091L1248748K7790725
1393.1G25526392K4513662J7190039J0413826O228089M127622K964258J248300j04666
1409.4G92107522j648068l369927m273296n888223j0009528j2375712j4554918j9990206
$$ y = [667376101, 659628212, 648018181, 634199023, 619674683, 605261147, 592821300, 585454464, 584753692, 588819981, 593170166, 593360484, 587323844, 576056004, 563043535, 554154038, 554819942, 565245211, 579934001, 591911435, 596217752, 590932727, 578967154, 565318644, 553369999, 545266509, 541355193, 539909303, 537885070, 532762408, 524572194, 515380383, 506558537, 498946041, 492679358, 486968219, 482567459, 482571125, 490366757, 505675018, 525311291, 546687841, 569539130, 596471846, 630359828, 666486919, 697735667, 725526392, 750040054, 767230093, 777643919, 783872008, 787999630, 790963888, 792212188, 792107522, 790459454, 787089527, 782816231, 776928008, 766918480, 754542768, 739987850, 719997644]
1425.7G19997644k7382433m0390551n3299666o0597598p7629566q8746190p2968275
1440B98983365o5413311o3670650n6026921m7637678l3927184j1334786L0478766J25009127
1456.3A76460728J99877605J26660436O3811481M4167877K9641926J6888559J2042045
1470.6F69550657Q983135J115561q256018j9574702l9827526o9946646r9359900j26256764
1486.9C16427797j41929626j09628253l5077998M4945674J39213547J82360500J39490902
1501.2E35802543Q6443305O3733936N8117151L0691445J4144599J2245894J1746764
1515.4H12925637R935975O923973L666640o53506m262983p522941r345114j0829866
1531.8H00837815j5135169j4215231r032786q343458p268191j830458K723992O220698
$$ y = [719997644, 692615211, 652224660, 598924994, 538327396, 460697830, 371951640, 298983365, 233570054, 169899404, 113872483, 66234805, 32307621, 20972835, 51451601, 176460728, 376338333, 502998769, 566810250, 610978127, 640620053, 657508612, 669550657, 678533792, 679649353, 671393335, 651818633, 611991107, 542044461, 442684561, 316427797, 174498171, 64869918, 29791920, 74737594, 213951141, 396311641, 535802543, 622245848, 685979784, 744096935, 774788380, 788932979, 801178873, 812925637, 822861612, 829785585, 833452225, 832798719, 828535736, 821012795, 811667681, 800837815, 785702646, 771487415, 762454629, 754111171, 746842980, 745012522, 747736514, 753957212]
1548.1G53957212Q747339R081066Q720934Q765221Q731782K555013k424955j912952
1564.4G96220660j730144l518164q672297j2277901j7640829l8397312o5159023p5520754
1580.7E73304236m7683001J5994013M9229383K4135530k1453678n8938861r1061086
1595D43526536j12852126j00812093m5892223L2984391J01327464J34975165J27751916
1609.3E81009030R1121197N4599345L5805642K5723100J3606608P954001O675244M724145
1625.6H21218312L271639K042771J326620J367867j081943m833103m524409k973378
1641.9H15814376j622439k373635n352855m556000l680527q878828r562492o748021
1658.2G73039579n428791n077362m506230j823306J283407K530694K412140L627241
$$ y = [753957212, 762704551, 771785617, 780506551, 789271772, 798003554, 800558567, 798133612, 796220660, 794490516, 790972352, 782300055, 770022154, 752381325, 713984013, 648824990, 573304236, 525621235, 541615248, 590844631, 614980161, 593526483, 534587622, 443526536, 330674410, 229862317, 183970094, 216954485, 318281949, 453257114, 581009030, 672130227, 726729572, 762535214, 788258314, 801864922, 809818923, 816494167, 821218312, 824489951, 826532722, 827859342, 829227209, 828145266, 823312163, 818787754, 815814376, 814191937, 811818302, 806465447, 801909447, 798228920, 789350092, 779787600, 773039579, 767610788, 762533426, 758027196, 756203890, 757487297, 760017991, 762430131, 766057372]
1674.5G66057372M350960M360795N609751P955253Q621156M679025L358543L787398
1690.9H08780253L674328L912628K890766Q84354p19190q97705O437k12193p55727
1709.2H17563951l08871L15249P2360k991021o195068n617857m976332n212784n188704
1727.6G87460923n318820o100834j0324299j3507724j0528684r487092q658290n574703
1743.9G17960477k017737J704753M930496O763637P867158R828508J0732591R954095
1760.2G67723978R125769O834209N062580M097998K378225L38376l52979J498759M029035
1778.6H00735950M859746L043354k14458l971398p265925j2037337j9140065k1028161
1794.9G44981706j7806530j3867795q559645k031803M048884Q715153J1718690J2793780
$$ y = [766057372, 770408332, 774769127, 780378878, 788334131, 796955287, 801634312, 804992855, 808780253, 812454581, 816367209, 819257975, 820142329, 819423139, 818525434, 818531871, 818319678, 817563951, 817255080, 817570329, 817642689, 814651668, 808456600, 802838743, 797862411, 792649627, 787460923, 782142103, 776041269, 765716970, 752209246, 741680562, 732193470, 723535180, 717960477, 715942740, 717647493, 722577989, 729341626, 737208784, 747037292, 757769883, 767723978, 776849747, 783683956, 788746536, 792844534, 795222759, 795561135, 795208156, 796706915, 800735950, 805595696, 808639050, 808424592, 804453194, 797187269, 785149932, 766009867, 744981706, 727175176, 713307381, 704747736, 702715933, 706764817, 715479970, 727198660, 739992440]
1811.2G39992440J2093961J1374533J1273563J0932207J0532379J0539532J0098636
1825.5H16837251Q648992P099986M656315K502918J467466J66357r29356j293421k643287
1843.8H36513221n003750o155431p059157q556605j0756790j3587475j6573250j8904806
1860.2G49915957j9440710j7211199j2897909q141577l319323J205385M626572O427407
1876.5G01164603O928087P084190P719815R017229J0925591J3378322J4926374J4856875
1892.8G86001086J4685095J3679444J1562527R488582P412315N471885L821552K107739
1909.1H54230225J86801j382828k492130m170358o270945p622897r168566j0989666
1925.4H12319636j2965798j6362309k1046699k5714457k8360605k7040124k1119773
$$ y = [739992440, 752086401, 763460934, 774734497, 785666704, 796199083, 806738615, 816837251, 825486243, 832586229, 837242544, 839745462, 841212928, 841379285, 840449929, 839156508, 836513221, 831509471, 825354040, 818294883, 809738278, 798981488, 785394013, 768820763, 749915957, 730475247, 713264048, 700366139, 692224562, 688905239, 690110624, 694737196, 701164603, 708092690, 715176880, 722896695, 731913924, 742839515, 756217837, 771144211, 786001086, 800686181, 814365625, 825928152, 835416734, 842829049, 848300934, 852122486, 854230225, 854417026, 853034198, 850542068, 846371710, 840100765, 832477868, 823309302, 812319636, 799353838, 782991529, 761944830, 736230373, 707869768, 680829644, 659709871]
1939.7F59709871j2315333k450168O363153J2071431J3952494J2794554J0417342Q453012
1956G08996356P932305R035408J1137843J3461948J5430570J5830636J4264583J1823893
1972.3H07913542Q922279N847871L451347K086640J624346K098321L614724N502343
1988.7H41061413O583751O205976M980027M011274L259062K487302J835466J379490
2005H71803761J154661J124084J084745R77277P95424L26634l41177q21948j067221
2023.3H75036240j290083j447022j423240j357436j356661j343608j308263j297652
2039.6H64212275j378417j493812j467884j344263j223862j110554r51886p61152n58078
2058H53922367l31223o8009J94133L13580L98039O35565R19997J124800J312971J473963
$$ y = [659709871, 647394538, 644944370, 651307523, 663378954, 677331448, 690126002, 700543344, 708996356, 716928661, 725964069, 737101912, 750563860, 765994430, 781825066, 796089649, 807913542, 816835821, 822683692, 826135039, 828221679, 829846025, 831944346, 835559070, 841061413, 847645164, 853851140, 858831167, 862842441, 866101503, 868588805, 870424271, 871803761, 872958422, 874082506, 875167251, 876144528, 876939952, 877266586, 876925409, 876103461, 875036240, 873746157, 872299135, 870875895, 869518459, 868161798, 866818190, 865509927, 864212275, 862833858, 861340046, 859872162, 858527899, 857304037, 856193483, 855241597, 854480445, 853922367, 853591144, 853523135, 853717268, 854030848, 854428887, 855064452, 855984449, 857109249, 858422220, 859896183]
2078.4H59896183J524627J554907J614451J609325J523316J408816J282751J164913
2094.7H71579289J075924J003861Q84235P11620N16653L07977J14382p0751k06828
2113.1H75916362l18349m76181o45220p94769r14693j053929j270473j462459j537800
2131.4H67442489j585901j683653j797378j830160j758635j655936j516581j326919
2147.7H54287326j180529j075089q83997o57499m86970l27527j68145o5803M3452K37226
2168.1H49722445L61621L62099L51786L17872K14398J92642M52757Q99732J312971
2186.5H54188323J615942J800954J805961J626372J366794J054466O95110L45349j1981
2204.8H64487290k80857k57313q0466j8120p5638k31684n17726q24451j037896j208126
$$ y = [859896183, 861420810, 862975717, 864590168, 866199493, 867722809, 869131625, 870414376, 871579289, 872655213, 873659074, 874543309, 875254929, 875771582, 876079559, 876193941, 876123190, 875916362, 875598013, 875121832, 874476612, 873681843, 872767150, 871713221, 870442748, 868980289, 867442489, 865856588, 864172935, 862375557, 860545397, 858786762, 857130826, 855614245, 854287326, 853106797, 852031708, 851147711, 850490212, 850003242, 849675715, 849507570, 849441767, 849485219, 849722445, 850084066, 850446165, 850797951, 851115823, 851330221, 851522863, 851975620, 852875352, 854188323, 855804265, 857605219, 859411180, 861037552, 862404346, 863458812, 864153922, 864499271, 864487290, 864206433, 863949120, 863868654, 863850534, 863774896, 863543212, 863025486, 862201035, 861163139, 859955013]
2225.2H59955013j384735j485646j485229j494169j569807j674712j808047j980007
2241.6H47072661k083898k130329k200365k105296j711845j163841o30915k05278J55329
2259.9H34996223N01514P30574Q46326R89497J122713J118064J036227R68039Q72672
2278.3H43181849P14957M32074j2278m09305n39422l84689M4167N69821P91728M62830
2298.7H44851732m01973j772285l506124m935145n070746l419936o28352J655817K097308
2317H28870296J007379l91603j601040l097534n152107p342458q960485q862078o309807
2335.4G88160563k115787J862169M446804N928338O655454N095602J314044k450943
2351.7H08896244m500628m395246l048599j177013P55727K588093M043639M734814
$$ y = [859955013, 858570278, 857084632, 855599403, 854105234, 852535427, 850860715, 849052668, 847072661, 844988763, 842858434, 840658069, 838552773, 836840928, 835677087, 835046172, 834840894, 834996223, 835497737, 836228311, 837074637, 838064134, 839186847, 840304911, 841341138, 842309177, 843181849, 843896806, 844328880, 844316602, 843907297, 843367875, 842983186, 843027353, 843597174, 844388902, 844851732, 844449759, 842677474, 839171350, 834236205, 829165459, 825745523, 825117171, 826772988, 828870296, 829877675, 829486072, 827885032, 824787498, 819635391, 812292933, 803332448, 794470370, 788160563, 786044776, 787906945, 792353749, 798282087, 804937541, 810033143, 811347187, 808896244, 804395616, 800000370, 796951771, 795774758, 796530485, 799118578, 803162217, 807897031]
2368H07897031M868448M847825M557013M050791L727019L509224L107071K591192K018094
2386.4H41173708J424492J037657R19104R10878R10044Q68916Q21769Q34942Q64744
2404.7H49766254Q30651O67810M72844L73244K44141k9028l04460m73857o61671q92818
2425.1H49993110j049102j150906j260042j306832j258433j195192j145184j078010
2441.4H40549409j009106j007021j031041j015067r03666o04451k93374k36988l51846
2459.8H34096849m07815m41015n83291p18772p42197p54237p74861p46250o63400n18381
2480.2H27746630l46661k10225j24813o0439R477O9261J11938J10626l2962l11792
2500.6H26961040n53071o23405n13136k45691N6565K06053K30670K39730K00451Q9526
$$ y = [807897031, 812765479, 817613304, 822170317, 826221108, 829948127, 833457351, 836564422, 839155614, 841173708, 842598200, 843635857, 844554961, 845465839, 846375883, 847244799, 848066568, 848901510, 849766254, 850596905, 851264715, 851737559, 852110803, 852354944, 852325916, 852021456, 851547599, 850885928, 849993110, 848944008, 847793102, 846533060, 845226228, 843967795, 842772603, 841627419, 840549409, 839540303, 838533282, 837502241, 836487174, 835583508, 834979057, 834685683, 834448695, 834096849, 833689034, 833248019, 832664728, 831945956, 831203759, 830449522, 829674661, 828928411, 828265011, 827746630, 827399969, 827189744, 827064931, 827004492, 827013969, 827083230, 827195168, 827305794, 827272832, 826961040, 826407969, 825784564, 825271428, 825025737, 825082302, 825288355, 825519025, 825758755, 825959206, 826048732]
2521H26048732P0691J57535M8280k40267l95596m89950p75337j115978j333534j536072
2541.4H20438504j611948j207888m36783J25051K49982J99616O9081j85847k80976
2559.7H17358792o8724Q0645M5418J08600Q8215m37617j348138k232909k526403j495898
2580.1H09571981P08759K578259K932250K120555R10997m69506j851499k808153l047586
2598.5H10646057k512634j131832Q80182K627491L315509K994358K139926J086176
2614.8H20045233L7074q31545j618921k551496l556073m228771l968537k291441K41816
2633.2H01277339K085627K473294J864493R31680J59026k16604k68459j95801j35482
2651.5H07975113j26600p4327L3140J1981j70291l32653m27485n10573m55320j64866
$$ y = [826048732, 826119423, 826276958, 826325238, 826084971, 825689375, 825199425, 824424088, 823308110, 821974576, 820438504, 818826556, 817618668, 817181885, 817306936, 817556918, 817756534, 817825615, 817639768, 817358792, 817290068, 817370713, 817416131, 817524731, 817612946, 817175329, 815827191, 813594282, 811067879, 809571981, 810280740, 812858999, 815791249, 817911804, 818822801, 818353295, 816501796, 813693643, 810646057, 808133423, 807001591, 807881773, 810509264, 813824773, 816819131, 818959057, 820045233, 820082307, 819250762, 817631841, 815080345, 811524272, 807295501, 803326964, 801035523, 801277339, 803362966, 805836260, 807700753, 808632433, 808791459, 808574855, 808306396, 808110595, 807975113, 807848513, 807774186, 807807326, 807819307, 807649016, 807316363, 806888878, 806378305, 805922985, 805758119]
2671.9H05758119J27852K08973J81139J32203O0737N2393J77860L78489N12958N69165
2692.3H08159888O30021O57201O15120N19693L54528J46925l3497j46270k27094l29137
2712.7H10347378l55661k74360k21371j86325n3763R1434J50442K66134M76957O16491
2733.1H10857356O61969O79135N62012K62142k8432k90096n65767p66635q99315r44137
2753.5H09528232r47893j001954j048505j098037j215875j408816j742840k222955
2769.8G98841357k650916k824128k593279j912713r87232k00331J44780j19m69268
2788.2G87348151j055836j653612k174914k574623k933561l290117l582359l656685
2804.5G66426444l386974k883911k326787j962125k096772k703369l673375n113005
$$ y = [805758119, 805885971, 806094944, 806276083, 806408286, 806469023, 806521416, 806699276, 807077765, 807590723, 808159888, 808789909, 809447110, 810062230, 810581923, 810936451, 811083376, 811049879, 810903609, 810676515, 810347378, 809991717, 809717357, 809495986, 809309661, 809255898, 809347332, 809497774, 809763908, 810240865, 810857356, 811519325, 812198460, 812760472, 813022614, 812994182, 812704086, 812138319, 811371684, 810472369, 809528232, 808580339, 807578385, 806529880, 805431843, 804215968, 802807152, 801064312, 798841357, 796190441, 793366313, 790773034, 788860321, 787873089, 787672758, 787817538, 787817419, 787348151, 786292315, 784638703, 782463789, 779889166, 776955605, 773665488, 770083129, 766426444, 763039470, 760155559, 757828772, 755866647, 753769875, 751066506, 747393131, 742280126]
2820.8G42280126p080079r730458j3469159j8876613k6857972l8202107n2440822o6915810
2837.1E08707106p6803028p7049077o6122025m7760561k7834356j0167092M538133
2851.4B07509100J6798243K6712641L3915043L7557543L6895245L2184362K4525643
2865.7D16097820J5326947O023198k253622q970171j4078319j7530054j9257605j9732386
2882C55625808j9763767j9847513k0278573k1358639k3253500k5863722k8585598l0290678
2898.3A66383818k9904649k7295977k3385487j9310817j5693915j2582059r826299
2912.6B8384615p370280n328337l773542k529788j314099j4853J509321L421033N773782
2930.9A8757852Q969191J3389698J8767096K4456296K9958948L4994327L9175048M2029888
$$ y = [742280126, 735200047, 725469589, 712000430, 693123817, 666265845, 628063738, 575622916, 508707106, 431904078, 354855001, 288732976, 240972415, 213138059, 202970967, 207509100, 224307343, 251019984, 284935027, 322492570, 359387815, 391572177, 416097820, 431424767, 437447965, 435194343, 426224172, 412145853, 394615799, 375358194, 355625808, 335862041, 316014528, 295735955, 274377316, 251123816, 225260094, 196674496, 166383818, 136479169, 109183192, 85797705, 66486888, 50792973, 38210914, 28384615, 21014335, 15685998, 11912456, 9382668, 8068569, 8053716, 9563037, 12984070, 18757852, 27727043, 41116741, 59883837, 84340133, 114299081, 149293408, 188468456, 230498344]
2947.2B30498344M3345779M3184429M1685403L9320886L6701381L3935666L0905932
2961.5D99577820K7617276K4049044K0077109J5652180J1147082P643997O404281P284880
2977.8F19453669Q252084P273912M019797q92818p355630j6192973k8771400m5156062
2994.2E40630579n9275389n8601588l6808103m339457J9912839K4610013J1143118
3008.4D37272012j2738943l9883911o4808637q1908763q4599718o9779277m3926958
3022.7C9625805j9099273j126341J3743382L0338279M7213853N8389321O0426935N4785595
3039B84297556M3891430K8466820R318143j0682940k7900398m0876120m9515262n1088080
3055.3A85911149m1109875j9730702O935894L1719685M8340335N1992313M2890310
$$ y = [230498344, 273844123, 317028552, 358713955, 398034841, 434736222, 468671888, 499577820, 527195096, 551244140, 571321249, 586973429, 598120511, 605764508, 612168789, 619453669, 627705753, 634979665, 638999462, 638106644, 630751014, 614558041, 585786641, 540630579, 481355190, 422753602, 385945499, 381606042, 401518881, 426128894, 437272012, 424533069, 384649158, 319840521, 237931758, 153332040, 83552763, 39625805, 20526532, 19400191, 33143573, 63481852, 110695705, 169085026, 229511961, 284297556, 328188986, 356655806, 365973949, 355291009, 327390611, 286514491, 236999229, 185911149, 144801274, 125070572, 132006466, 163726151, 212066486, 264058799, 306949109]
3069.6C06949109K5829583M763991j7939687l6371142l9297804j9143209J7776043
3083.9B42566884N4953724P7131450P7722371O1009854L7123203J4276862k871633
3098.2E61912715j0701119o226778R375631K8213859M0476501M2001068L6142290K8181374
3114.5G29375541K0724476J4638841J0225355P200539N330265M320741L626108K941012
3130.8G98382878K311230J887918J705288J490713R91642M87328K99394K92301K21789
3149.2H08070481j68562j085341k346337l408492l456056j794696J185179L882408
3165.5H00878584M940391M376054L107130J933217J121879O23167K83539J37091K43484
3183.8H17644536L38674K94685K26021J66834O0320o6400m7088J56999M68731Q08954
$$ y = [306949109, 332778692, 337542683, 319602996, 283231854, 243934050, 224790841, 242566884, 297520608, 374652058, 452374429, 513384283, 550507486, 564784348, 561912715, 551211596, 544984818, 554360449, 582574308, 623050809, 665051877, 701194167, 729375541, 750100017, 764738858, 774964213, 782164752, 787495017, 791815758, 795441866, 798382878, 800694108, 802582026, 804287314, 805778027, 806769669, 807256997, 807556391, 807848692, 808070481, 807901919, 806816578, 804470241, 801061749, 797605693, 795810997, 796996176, 800878584, 805818975, 810195029, 813302159, 815235376, 816357255, 816980422, 817263961, 817401052, 817644536, 817983210, 818277895, 818503916, 818670750, 818731070, 818664670, 818617582, 818774581, 819243312, 820052266]
3204.2H20052266J034558J049936R14871O88553M25577L28303L66270K85149J98364
3222.6H25343847K30789K14220J80661K26856K02775L4928q6904j06632j29402p8797
3243H26032341N662p7426k32935k45512j78635k35617l75808l84986k37882j32561
3263.4H23936641j27852r417J46866N5372j26838k88725m58420m04119j88947j09672
3283.8H22424889j51635p8380J19388J61529J7881j20699k36571k32458Q7261M35710
3304.2H22426915L30687q4043l70681l86477k39789j51694j15752R954J81556K43365
3324.6H21844041L6359k22325k34306j41978n424J61588M4823k44677k98679k08497
3345H20730925q4639Q2195l398l20017m14908k52128j12414j60098k87712k48015k07126
$$ y = [820052266, 821086824, 822136760, 823051631, 823740184, 824165761, 824494064, 824860334, 825145483, 825343847, 825574636, 825788856, 825969517, 826196373, 826399148, 826434076, 826347172, 826240540, 826111138, 826032341, 826038003, 825960577, 825727642, 825482130, 825303495, 825067878, 824692070, 824307084, 824069202, 823936641, 823808789, 823799372, 823946238, 824001610, 823874772, 823586047, 823127627, 822723508, 822534561, 822424889, 822273254, 822194874, 822314262, 822475791, 822493672, 822372973, 822136402, 821903944, 821991205, 822426915, 822757602, 822673559, 822302878, 821916401, 821676612, 821524918, 821409166, 821419120, 821600676, 821844041, 821880400, 821658075, 821423769, 821281791, 821276367, 821437955, 821482778, 821238101, 820939422, 820730925, 820646286, 820728481, 820725083, 820405066, 819990158, 819738030, 819625616, 819465518, 819177806, 818929791, 818722665]
3367.4H18722665m43220p96854q75533o44743m49658l59356l26336l58641l14355j31130
3387.8H14022839J10209J17242j74641k80738j03951J3411p9751k05576p8499Q8334
3408.2H13428879M1663N0724J37687J08957O1393r6023m32790o31809n02884k94745
3428.6H11871052l73304n78523n75185m79698l91066j40130K55823N53787N09917K27094
3449H10879767J16885J71899J89662J90914J93894J29104J27375K51829K02477M1485
3469.4H12495291O6340K18272L29256M46916N54204M01616K03788K97070L97027L57806
3489.8H15767586M07577N50449O26564O01291P03693P91907L97563O2347K38835M03643
3510.2H20551455M29153M30942L77178M66943Q20816J107990Q97706M27306J36852
$$ y = [818722665, 818279445, 817482591, 816607058, 815962315, 815512657, 815153301, 814826965, 814468324, 814153969, 814022839, 814133048, 814250290, 814075649, 813794911, 813690960, 813704371, 813624620, 813419044, 813340545, 813428879, 813470542, 813521266, 813658953, 813767910, 813829303, 813733280, 813300490, 812668681, 812165797, 811871052, 811497748, 810919225, 810344040, 809864342, 809473276, 809333146, 809588969, 810142756, 810652673, 810879767, 810996652, 811168551, 811358213, 811549127, 811743021, 811872125, 811999500, 812251329, 812453806, 812495291, 812561631, 812779903, 813109159, 813556075, 814110279, 814511895, 814715683, 815012753, 815409780, 815767586, 816175163, 816725612, 817352176, 817953467, 818657160, 819449067, 819846630, 819908977, 820147812, 820551455, 820980608, 821411550, 821788728, 822255671, 823076487, 824184477, 825082183, 825509489, 825646341]
3528.5H25646341M5001K67864O40094O23584M22597P27057J302958J200437K87533
3546.9H31163466j56581J46567J29044q4042J82629O10411P93040J020014J250326
3565.2H35054874L14534j246273j373828p56204m54783l03507j10150J57237P60436
3583.6H32042336J271964M80115o90401k10702O77347O85036M40240L66092J38819
3601.9H35200846K25067P26879N12362n16534j393140k169847k263308j652181j218498
3620.3H27451646k24232J631200L272653K936184L3915j591086j835585k351999l078461
3638.7H26244235l587007l034294j048207J347482K126157O01351K15292J396716J840293
3657H26102018J137019O28113N87762R72926J558662J392066L72231L45588K48075
$$ y = [825646341, 825691342, 825959206, 826599300, 827222884, 827645481, 828372538, 829675496, 830875933, 831163466, 831006885, 831153452, 831282496, 831198454, 831381083, 831991494, 832784534, 833804548, 835054874, 835369408, 834123135, 832749307, 831993103, 831538320, 831234813, 831124663, 831281900, 832042336, 833314300, 833794415, 833104014, 832893312, 833570659, 834255695, 834695935, 835062027, 835200846, 835425913, 836152792, 836665154, 836148620, 834755480, 832585633, 830322325, 828670144, 827451646, 827227414, 828858614, 832131267, 835067451, 835101366, 833510280, 831674695, 829322696, 826244235, 822657228, 819622934, 818574727, 819922209, 822048366, 822649717, 822865009, 824261725, 826102018, 827239037, 827867150, 828454912, 829427838, 830986500, 832378566, 832750797, 833096385, 833344460]
3675.4H33344460r88901j088202k44200P75456J908124K550125R81092j731217k218067
3693.7H33288670j381934m97878L49999P07447O78122J303316K257525K236247L90411
3712.1H39331925j425743j447201p22170m8518M42505O76751O25312Q64268J808762
3730.4H40105891K715945J907468m27484j051367K75314J243115O56545p749K87831
3748.8H45705509n19633j993775j623929o92129o78837j007736n73814M1067K32041
3767.1H38888764N8055n98073q17954q8096N29587J56105n67436o87361p80225j009285
3787.5H35084081r30190o09637p4982L41236M00961M44948j00314q07226p23124r16182
3807.9H32109571q88408M0472R63807J105368R19938P40707l64423q51512j07348M36247
$$ y = [833344460, 832355559, 831267357, 831023157, 831798613, 833706737, 836256862, 837237954, 835506737, 833288670, 831906736, 831408858, 831758857, 832466304, 833144426, 834447742, 836705267, 838941514, 839331925, 837906182, 836458981, 835736811, 835688293, 836130798, 836807549, 837432861, 838297129, 840105891, 842821836, 844729304, 844301820, 843250453, 843525767, 844768882, 845425427, 845417678, 845705509, 845185876, 843192101, 841568172, 840876043, 840197206, 839189470, 838615656, 838656723, 838888764, 838946819, 838348746, 837530792, 837442696, 837972283, 838128388, 837560952, 836873591, 836093366, 835084081, 834153891, 833544254, 833469272, 833810508, 834211469, 834656417, 834556103, 833748877, 833025753, 832109571, 831221163, 831261635, 832225442, 833330810, 834250748, 834991455, 834627032, 833775520, 833668172, 834104419]
3828.3H34104419P12692R14991J101375J272738P72417j89305p40945q34107k49804
3846.7H36864471R84908K107501J472950j309336j871824o69420L10719N43416P3612
3865H38506997O3121L44276j63257p68721q11398k12431N25415L73364j20223n75542
3885.4H37161601r49443m54664j96278p09295m29511N58137Q77202K51472o54042j363992
3905.8H34091187j331628p72953k24352K34664L74615j24991n84543l88622l02613
3924.2H30970764n64039l49760j6331l15011o94930n44429L5465O28829O15954K20299
3944.6H29986811K05218J71066k18868l96371l15190k48432k19107k70426l88980m19140
3965H27886581l72290l95417m80235m82142l41117j75298p1406L874Q941k25365o99639
$$ y = [834104419, 834817111, 835732102, 836833477, 838106215, 838878632, 838689327, 837948382, 837114275, 836864471, 837849379, 839956880, 841429830, 840120494, 838248670, 837579250, 837889969, 838433385, 838506997, 838570118, 838914394, 838751137, 837982416, 837171018, 836958587, 837484002, 837857366, 837737143, 837161601, 836212158, 835757494, 835561216, 834851921, 834422410, 834980547, 835857749, 836109221, 835455179, 834091187, 832759559, 831986606, 831762254, 831996918, 832371533, 832246542, 831661999, 831273377, 830970764, 830406725, 830056965, 830040634, 829725623, 829030693, 828486264, 828521729, 829150558, 829766512, 829986811, 830192029, 830363095, 830144227, 829747856, 829432666, 829184234, 828965127, 828694701, 828305721, 827886581, 827514291, 827118874, 826638639, 826156497, 825815380, 825640082, 825568676, 825572550, 825581491, 825356126, 824656487]
3987.4H24656487j184643j599490j973331k103389j849532
3997.6H15946102
$$ y = [824656487, 823471844, 821872354, 819899023, 817795634, 815946102]
##END=$$ End of the data block
