##TITLE=Poli Rio Liso $$ Begin of the data block
##JCAMP-DX=5.00 $$ ACD/SpecManager v 10.08
##SPECTROMETER/DATA SYSTEM=Alpha
##DATE=14 Apr 2015 15:41:24
##DATA TYPE=INFRARED SPECTRUM
##DATA CLASS=XYDATA
##ORIGIN=
##OWNER=
##NPOINTS=1765
##FIRSTX=399.76428223
##LASTX=3997.64306641
##MAXX=3997.64306641
##MINX=399.76428223
##MAXY=0.78825611
##MINY=0.01036785
##XFACTOR=1.0000000000
##YFACTOR=1.000000000000000e-9
##FIRSTY=0.78105944
##DELTAX=2.03961372
##XUNITS=1/CM
##YUNITS=ARBITRARY UNITS
##XYDATA=(X++(Y..Y))
399.8G81059444L466427M75765j060188j595855p31051n48184k845943n576491n935371
418.1G66708553k526105j286745j893520M24325K970934L012956R83953j708567l474176
436.5G63211608m188299l942430k171278j303137l982544o666898n225957o29544K092421
454.8G37193942J562178K35737k877415n689144l708362J407504M797339N767405O473839
473.2G45163023O253779M975975L832817K662182K017438K261937K360105J930357
489.5G71457613J451849J064837L62516n09620j156747j116097k68042p8857j59800
507.9G71047652M68492M23491q05676j775145j301885o66737j469732k777278l171623
526.2G59971559k996147l521204m390955m575431l729701k064109m61340M49598J173198
$$ y = [781059444, 784525871, 785001636, 783941448, 782345593, 781614542, 781066358, 778220415, 772643924, 766708553, 764182448, 762895703, 761002183, 761426508, 764397442, 767410398, 768394351, 766685784, 763211608, 759023309, 755080879, 752909601, 751606464, 747623920, 740957022, 735731065, 735101521, 737193942, 738756120, 738991857, 736114442, 730425298, 726716936, 728124440, 732921779, 738689184, 745163023, 751416802, 756392777, 760225594, 762887776, 764905214, 767167151, 769527256, 771457613, 772909462, 773974299, 774336815, 773827195, 772670448, 771554351, 771286309, 771207452, 771047652, 771516144, 771939635, 771133959, 769358814, 768056929, 767390192, 765920460, 763143182, 759971559, 756975412, 753454208, 749063253, 744487822, 740758121, 738694012, 738232672, 738682270, 739855468]
544.6G39855468J737595J933396K165496K011359J281857N62668N16713J164615J771629
562.9G53000796J768768J394868J339495J284122R17018R45925J195610Q43048N64337
581.3G63253987P90357P92742L76880n31554j043618j58488M41432k12491q13722r01819
601.7G61993706p17282k63155M5062m1247j51336k52545m01795m96089k40147K10225
622.1G59685397J62721M887o437l53694o94215k45750O72698Q13782L47555K97904
642.5G60684848K21073l41177q33034q12709o00756q71837j650989k482533k999485
660.8G50313401l651917m627168o716847n974591N46098L484428L277003K024830R22262
679.2G39597499K19405m39942j495719l779232r183169k2244811m4857681o0858070
$$ y = [739855468, 741593063, 743526459, 745691955, 747703314, 748985171, 749547839, 750064552, 751229167, 753000796, 754769564, 756164432, 757503927, 758788049, 759705067, 760650992, 761846602, 762689650, 763253987, 764044344, 764837086, 765213966, 764682412, 763638794, 763480306, 763921738, 763709247, 762895525, 761993706, 761276424, 761013269, 761058331, 761017084, 760865748, 760613203, 760211408, 759715319, 759475172, 759685397, 759848118, 759853005, 759846568, 759492874, 758798659, 758552909, 759225607, 760039389, 760386944, 760684848, 760905921, 760564744, 759731710, 758919001, 758318245, 757446408, 755795419, 753312886, 750313401, 746661484, 742034316, 735317469, 729342878, 729888976, 733373404, 736650407, 738675237, 739597499, 739816904, 739376962, 737881243, 734102011, 724918842, 702674031, 657816350, 596958280]
695.5E96958280m5423150m048765L2175004M5893908M0755749K6401281J0331571k651453
711.8G00392425j5102088l9633513n6299567j5301943M5871615M6551407K699196l4895897
728.1F34281635k4229169L1395913N7931065L5442829J1004627J239359k530276m505694
744.5G40030289m687965k959728j612664j476407j435220o59406J310110L719270N298674
762.8G37526953O014228O369889O592274O614208O084502N054950M016340L205299
779.1G81478643K414525J421571N35011R6023j69039n11586o92427o93322p46190r38118
799.5G82195091j600325l094554m619241l870904K50280M807889O156087M506529K405643
817.9G87136495J010656J08958m96507j039743j565755k031922k715826m519642r871840
$$ y = [596958280, 551535130, 547486365, 579661369, 625555277, 666311026, 692712307, 703043878, 700392425, 685290337, 645656824, 589357257, 574055314, 619926929, 666478336, 669177532, 634281635, 610052466, 641448379, 699379444, 734822273, 745826900, 747066259, 744535983, 740030289, 735342324, 732382596, 730769932, 729293525, 727858305, 727198899, 728509009, 732228279, 737526953, 743541181, 749911070, 756503344, 763117552, 769202054, 774257004, 778273344, 781478643, 783893168, 785314739, 785849750, 785945773, 785776734, 785265148, 784572721, 783879399, 783133209, 782195091, 780594766, 777500212, 772880971, 769010067, 769260347, 774068236, 780224323, 784730852, 787136495, 788147151, 788256109, 787759602, 786719859, 785154104, 783122182, 780406356, 775886714, 766014874]
836.2G66014874j7576933j4237225M378557J6712666J2863219O066560K867222J243830
852.6G78332770M19021j2875m73440r41634j579344k557934m244208p146537j0024071
870.9G51771748r891391n691349K58684M709363O028771O072998O550670N834520L201127
889.3G68845141J23799k904594n990982p195235m310011L57747K250373J200020L27349
907.6G52703607R59873K036870K456903K193809J646697J076639N26011n007m78744
926G63116658j031041j996100l518343m926324m946828l078282k88367J708507K025068
944.3G47064948J288056M45426k51234r33706j676917k500594l368676m299164n345821
962.7G30422318p016420j0953546j7478168j9534111q692205Q356750J7199457J5502691
$$ y = [766014874, 748437941, 734200716, 738579273, 755291939, 768155158, 774221718, 777088940, 778332770, 778751791, 778738916, 778265476, 777323842, 775744498, 773186564, 768942356, 761795819, 751771748, 741880357, 736189008, 736447692, 741157055, 747185826, 753258824, 759809494, 765644014, 768845141, 768968940, 766064346, 760073364, 752878129, 748568118, 748925865, 751176238, 752376258, 752703607, 753663480, 755700350, 758157253, 760351062, 761997759, 763074398, 763600409, 763595402, 763116658, 762085617, 760089517, 756571174, 751644850, 746698022, 743619740, 743331373, 745039880, 747064948, 748353004, 748798430, 748547196, 747613490, 745936573, 743435979, 740067303, 735768139, 730422318, 723405898, 712452352, 694974184, 675440073, 666747868, 675104618, 692304075, 707806766]
979G07806766R787083M564285Q99315j888394m841388r021997j4936328j8651664j2213529
997.4F61504149K480448J1384129Q898020K353847k748549o250560q584917r231925
1013.7F59804642p370412l160775J622319M770339N489588M980921N104065O421626
1030F77662313P891953Q066952O542325M213870K078831Q42631R97245J940131K411187
1048.4G12647438K344132K319395K059639J378893O74487O7114m60207p99656q49247
1066.7G19381988m99546J98304R19759J291395J141905P66397O75559P92861N58138
1085.1G25226760k39015j265228j860260j693547j392544j686215k210438j751602
1101.4G13127911Q2731J890719K335906J699865Q77857M32969M55677P92027J289725
$$ y = [707806766, 717593849, 722158134, 723057449, 721169055, 716327667, 707305670, 692369342, 673717678, 661504149, 663984597, 675368726, 684266746, 686620593, 683872044, 677621484, 669036567, 659804642, 652434230, 649273455, 650895774, 655666113, 661155701, 666136622, 671240687, 677662313, 685554266, 693621218, 700163543, 704377413, 706456244, 707298875, 708296120, 710236251, 712647438, 714991570, 717310965, 719370604, 720749497, 721423984, 721491098, 721030891, 720231235, 719381988, 718882442, 719080746, 720000505, 721291900, 722433805, 723200202, 723875761, 724668622, 725226760, 724987745, 723722517, 721862257, 720168710, 718776166, 717089951, 714879513, 713127911, 713210642, 715101361, 717437267, 719137132, 720014989, 720447958, 720903635, 721695662, 722985387]
1119.8G22985387J667440J721978J573563J355290J099169Q37744M79519n0008o96183
1138.1G30973899j515507k564550l697335m906774o126404o560087n495966l595173
1154.4F96512103k386630k939403n298614q475244r878814n328060N744577J5739679
1170.7F83689594J7109454J1867702O349921L175557J856148J504660J268863P37310
1187.1G27559209J83880j18553j15216Q2731K92182M45008N03242L93212J06275k50339
1207.5G29081631o11365r97782j454234j877487j981735j550317q60035n18024p23899
1225.8G18506753j117408j440465j772762k119302k205074j692772q25405k64585l03626
1244.2G06765354o94573j302183k389848l650487l129661J83761L374517L845990K667427
$$ y = [722985387, 724652827, 726374805, 727948368, 729303658, 730402827, 731240571, 731720090, 731670082, 730973899, 729458392, 726893842, 723196507, 718289733, 712163329, 705603242, 700107276, 696512103, 694125473, 691186070, 685887456, 677412212, 667533398, 662205338, 667949915, 683689594, 700799048, 712666750, 719016671, 722192228, 724048376, 725553036, 726821899, 727559209, 727743089, 727624536, 727509320, 727592051, 727884233, 728329241, 728832483, 729225695, 729331970, 729081631, 728470266, 727472484, 726018250, 724140763, 722159028, 720608711, 719748676, 719230652, 718506753, 717389345, 715948880, 714176118, 712056816, 709851742, 708158970, 707333565, 707068980, 706765354, 706070781, 704768598, 702378750, 698728263, 695598602, 695782363, 699156880, 703002870, 705670297]
1262.5G05670297J580060R37640N69046L65436K89500J74403r4593l29137n37931q04246
1282.9G07820475j167238j529038j835584k144814k341985k010584j270414j440227
1299.2F94080591l045380l378749K28107M289270M351556J996398M20451j79887o04510
1317.6F98157847q42810j373231k460838l141045k581239r74834P23303Q99910p04646
1336F87702417k510190k847015k423645l380537n288183p167638r116709j2027025
1352.3F42941475j5994668j7361462j1667729j851141M610598K647936p589936k5395095
1368.6E70339978n0349653p7664286p8382641j9060791N3504527Q2968712P0532858
1382.9E51888704M5162440K5147259J2685299M885554P928k122999j859128j300395
$$ y = [705670297, 707250357, 708187997, 708757043, 709122479, 709411979, 709586382, 709491789, 709162652, 708624721, 707820475, 706653237, 705124199, 703288615, 701143801, 698801816, 696791232, 695520818, 694080591, 691035211, 687656462, 687884569, 692173839, 696525395, 698521793, 698942244, 698762357, 698157847, 697315037, 695941806, 693480968, 690339923, 687758684, 686783850, 687507153, 688407063, 687702417, 685192227, 682345212, 679921567, 676541030, 671252847, 664085209, 654968500, 642941475, 626946807, 609585345, 597917616, 596066475, 600677073, 603325009, 595735073, 570339978, 519990325, 442326039, 363943398, 344882607, 398387134, 481355846, 551888704, 597051144, 622198403, 634883702, 639769256, 639777184, 637654185, 635795057, 634494662]
1399.2F34494662j313150k735972m216850m254758m510582n101859n208373n692602
1415.5F01460516o636619n579710l349662l729224n140007p305503j2158572j7208457
1431.8E40352762j8248737j4211238o337225n259544j2840092k2662818l1343848l6012083
1448.1C93437177l0544549j9568414j0178864p988632k3553043l6036581j5876368
1462.4B49690726L1944737N7601571L4257412K155870R06766N9886098Q9732975N9409201
1478.7E85585356K7052164J2873709N199850j972437j0266781j3383210k760410J3337433
1495F15665674K5214553K2313476J2225389M502952j129746L43323P514000P192611
1511.4F93842232L859997J106143N82695P81894J269400L401279L704906L381431K436280
$$ y = [634494662, 633181512, 630445540, 626228690, 621973932, 617463350, 612361491, 607153118, 601460516, 594823897, 589244187, 585894525, 582165301, 577025294, 569719791, 557561219, 540352762, 522104025, 507892787, 501555562, 496296018, 483455926, 460793108, 429449260, 393437177, 362892628, 343324214, 333145350, 325156718, 301603675, 265567094, 249690726, 281635463, 339237034, 373494446, 375650316, 376557082, 436443180, 526176155, 585585356, 612637520, 625511229, 630711079, 628738642, 618471861, 605088651, 602328241, 615665674, 640880227, 663193703, 675419092, 679922044, 678792298, 679135621, 686649621, 693842232, 697702229, 698808372, 699391067, 700172961, 701442361, 704843640, 708548546, 711929977, 714366257]
1529.7G14366257j9669m58658O15418k351225n320787O92368N711615N383789L005564
1548.1G21624672J071930L56317r04679l368915m331409M071414P095277L225983M65750
1566.4G29306340q38101L42667J305044j168609j989781N71787L77953k88904J056075
1584.8G28674471J903475R22084n90086j980365l435909n004764n579233k970159K593815
1603.2G14533329O629705O761253N162239L441513J123846j163960m5717K086520N07236
1621.5G39035964o00576O70671J254261J342594K18690k901256l360033K207636M038275
1639.9G41906226J816630j201928l304779l75211J478016j957238N24581O306410L972947
1658.2G49165654K66493r97425N03779J22011k250374j259982J230895J006067J243234
$$ y = [714366257, 714346588, 713887930, 714503348, 712152123, 706831336, 707523704, 713235319, 718619108, 721624672, 722696602, 723052919, 722148240, 718779325, 714447916, 718519330, 725614607, 728840590, 729306340, 728468239, 728810906, 730115950, 728947341, 726957560, 727529347, 727907300, 727618396, 728674471, 730577946, 731500030, 730909944, 728929579, 725493670, 720488906, 714909673, 711939514, 714533329, 721163034, 727924287, 733086526, 736528039, 737651885, 736487925, 736442208, 738528728, 739035964, 738435388, 739106059, 740360320, 741702914, 741921604, 739020348, 735660315, 737867951, 741906226, 743722856, 742520928, 739216149, 738840938, 740318954, 738361716, 738886297, 745192707, 749165654, 749432147, 748434722, 748938501, 749060512, 746810138, 745550156, 746781051, 747787118, 749030352]
1676.6G49030352J022279j390815l939688j363099L875137L247797J474083m77314
1692.9G51478732l520489m015386j686394J037716K168656P26640N22673O43611j208484
1711.3G46147275l816783n703688l964305J248062K096533j49905j564682k603829
1727.6G31688678l752231m047394k585352J817286L061235K402008L392637M227638
1743.9G36204505L783226L114521M261494O383777N374431K930761J944065J373529
1760.2G65370309J377404J963139P12692j241624k017558m61340K656162K954245J210153
1778.6G72523582L86596O97732P01785K06828j354933l508747k713799K44558N13136
1796.9G67696738m11391M13299K295851K541542J320124L02851N68509J365424J132965
$$ y = [749030352, 750052631, 748661816, 744722128, 743359029, 747234166, 750481963, 751956046, 751478732, 747958243, 743942857, 742256463, 743294179, 745462835, 746189475, 746712148, 747355759, 746147275, 742330492, 736626804, 732662499, 733910561, 736007094, 735857189, 734292507, 731688678, 727936447, 723889053, 721303701, 723120987, 726182222, 728584230, 731976867, 736204505, 739987731, 743102252, 747363746, 753747523, 759121954, 762052715, 763996780, 765370309, 766747713, 768710852, 769423544, 768181920, 766164362, 765703022, 768359184, 771313429, 772523582, 772910178, 773607910, 774309695, 774516523, 773161590, 769652843, 766939044, 767183602, 767696738, 767285347, 767698646, 769994497, 772536039, 773856163, 774159014, 774727523, 776092947, 777225912]
1815.3G77225912N10811M24564J18792o03854m86791p0036K55525J807690K219856
1833.6G81402469R27984L26276J57833r82999j597941L28898J771688J328052N96284
1852G84258544Q5295k22445m36604m97579n42224j044452k020955j730561Q17000K106846
1872.4G80772865J165926K82884O4909m7505j73330k87115o71924j049518l85523L05951
1892.8G79977620K40862N58913Q83937O95884M63366K62201n4240o7294M15027N08845
1913.2G83885121k35080p99597k66313J67191K81572O87957M78923j17004l90708n10037
1933.6G83182025n83291o76572j033783j151383j12474R62436R80973O28591L23117
1951.9G82519639J41978J91092L00825L06129K94984J62065P4863N26965R20057O44505
$$ y = [777225912, 777736723, 778161287, 778280079, 777676225, 777189434, 777119398, 777374923, 779182613, 781402469, 782330453, 782656729, 782814562, 781831563, 780233622, 780562520, 782334208, 783662260, 784258544, 784343839, 784121394, 783684790, 783187211, 782644987, 781600535, 779579580, 777849019, 778666019, 780772865, 781938791, 782221675, 782286584, 782239079, 782065749, 781778634, 781106710, 780057192, 779671669, 779977620, 780218482, 780777395, 781661332, 782357216, 782820582, 783082783, 783028543, 782961249, 783376276, 783885121, 783650041, 782850444, 782584131, 782751322, 783032894, 783720851, 784199774, 784082770, 783692062, 783182025, 782598734, 781922162, 780888379, 779736996, 779624522, 780586958, 781567931, 782196522, 782519639, 782661617, 782852709, 783153534, 783459663, 783754647, 783916712, 783991575, 784518540, 785438597, 786083102]
1972.3G86083102K63989J32978O7711j5199k1994l6598j79767l08812l21328O4194
1992.7G85728276N44488L79443J5319n8830j22428k96712m17411m63188n90026q28862
2013.1G83890069r89676o61135O4373M57049M61399M24266L80278L44693L09110K41399
2033.5G84921825J96040J80184J18196J00673J91867K04086J29044J20283J64747J59859
2053.9G86486804J04070O0499L4511k9445r0301M351J24336Q5294P868j9193l159M172
2078.4G86769807m9650r7633r2268o3777p2181n8949J4663K1696j4901J0371L7789
2100.8G86404967K4259p093n8710o2704m3154p1883r3818j20819j77025k75374l82602
2123.3G85136044l78430l04460k47837j64210r0778o6579l337L8087l6895r2447r8527
$$ y = [786083102, 786347091, 786480069, 786547780, 786532581, 786510587, 786473989, 786294222, 785985410, 785664082, 785728276, 786272764, 786652207, 786667526, 786608696, 786486268, 786189556, 785772145, 785308957, 784718931, 783890069, 782900393, 782239258, 782303631, 782760680, 783222079, 783646345, 784026623, 784371316, 784680426, 784921825, 785117865, 785298049, 785416245, 785516918, 785708785, 785912871, 786041915, 786162198, 786326945, 786486804, 786590874, 786651373, 786685884, 786656439, 786566138, 786570489, 786694825, 786780119, 786787987, 786768794, 786765635, 786769807, 786720157, 786622524, 786530256, 786466479, 786394298, 786335349, 786350012, 786371708, 786356807, 786367178, 786404967, 786429226, 786422133, 786363423, 786300719, 786257565, 786185682, 786091864, 785971045, 785794020, 785518646, 785136044, 784757614, 784453154, 784205317, 784041107, 783950329, 783883750, 783880413, 783918500, 783881605, 783789158, 783690631]
2145.7G83690631j34050j35065q2492l4810k1398k7775n0664o1035m2618n3406p2717
2168.1G82974601n4419k504L4929k146o3777q1658p8500m8756J8894N0009L8206J9610
2192.6G82804489j1146N484M5776J9252K087L4391M9472J2279l9041k5332j2338p4685
2217.1G82810688j43766j41263q7083p9334j72436l47078n37097o74248o76155m63724
2237.5G79488504j17362J79649L44693L42191J82032J908o4791m6432l0815K563M1842
2259.9G80323982m828q9168j49012k05576j84834j08719m5061Q6963J89483J19269
2280.3G79932499j5557j18673k05755k47359k44856k65122l01182l14414l28303l42428
2300.7G77548850l99054n92768p63416p67291p18772o51062o16610p06613r21964j150370
$$ y = [783690631, 783556581, 783421516, 783339024, 783304214, 783282816, 783255041, 783204377, 783143342, 783100724, 783047318, 782974601, 782920182, 782917678, 782952607, 782950461, 782886684, 782805026, 782726526, 782677770, 782696664, 782746673, 782784879, 782804489, 782793343, 782798827, 782844603, 782863855, 782865942, 782900333, 782949805, 782962084, 782923043, 782897711, 782885373, 782810688, 782666922, 782525659, 782438576, 782359242, 782186806, 781839728, 781302631, 780628383, 779952228, 779488504, 779371142, 779550791, 779895484, 780237675, 780419707, 780421615, 780356824, 780310392, 780279577, 780282140, 780323982, 780319154, 780229986, 780080974, 779875398, 779690564, 779581845, 779536784, 779623747, 779813230, 779932499, 779916942, 779798269, 779592514, 779345155, 779100299, 778835177, 778533995, 778219581, 777891278, 777548850, 777149796, 776557028, 775793612, 775026321, 774307549, 773656487, 773039877, 772333264, 771411300, 770260930]
2321.1G70260930j107812q29577o72639o70671n97298m20332l62337m20451m23253
2339.5G64756560k90453R2745P52628J157105P10547k86818j019239j007557n97239
2357.8G64268279j00553K69651N19336Q34763J096546J185716J145482J070976J114488
2376.2G71404684J170873J082421Q72671N84603K72929L5286n5671p6353j44422k04325
2396.6G74942696j90794j48416j09136q8036q7142j18852j91688k34604j97351j45912
2417G73430765j21832o9142q940J1801K5332N5075J26541K23219K81572K86460K06948
2439.4G74447799R3996N5909N0843K2292l9994q7023p3016n3167l2246J609l7134j77324
2463.9G74172544k94268l87847n18620n21541l48627j94907j80722k58267l15189l35097
$$ y = [770260930, 769153118, 768323541, 767650902, 766980231, 766382933, 765962601, 765600264, 765179813, 764756560, 764466107, 764558852, 765311480, 766468585, 767179132, 766892314, 765873075, 764865518, 764268279, 764167726, 764437377, 764956713, 765791476, 766888022, 768073738, 769219220, 770290196, 771404684, 772575557, 773657978, 774530649, 775115252, 775388181, 775423467, 775367796, 775291443, 775147021, 774942696, 774751902, 774603486, 774494350, 774406314, 774319172, 774200320, 774008632, 773774028, 773576677, 773430765, 773308933, 773239791, 773230851, 773242652, 773267984, 773323059, 773449600, 773672819, 773954391, 774240851, 774447799, 774541795, 774597704, 774648547, 774670839, 774630845, 774543822, 774470806, 774417639, 774385393, 774387002, 774349868, 774172544, 773878276, 773490429, 772971809, 772450268, 772101641, 771906734, 771726012, 771467745, 771152556, 770817459]
2484.3G70817459l53396l64662l87489m28677m34279m02749m25160m99010n48959n77926
2504.7G66395152n80311n42224m83334m48644m73976n08726n09917m68016l68714j93775
2525.1G61817515M6193K31028L06845L39031L21507K20538k7657m09126o94931p22408
2545.5G61428535n94854m82202l76999k49505k08378k33412k27451k66195l93867n27501
2565.8G57868171p16031r88364j207709j335502j421571j402199j089633m53293K30849
2584.2G49484718O40213O39320L76820J25707j8240j22606k86997n28216p63476r78529
2604.6G48568714j133204j173436j158059j078427r23872p99298p48992p03275o24240
2623G40225911n88119o18636o32227n68628l81410j19865O8783R4057j3888j04547
$$ y = [770817459, 770464063, 770099401, 769711912, 769283235, 768848956, 768446207, 768021047, 767522037, 766973078, 766395152, 765814841, 765272617, 764789283, 764340639, 763866663, 763357937, 762848020, 762380004, 762011290, 761817515, 761863708, 762094736, 762401581, 762740612, 763062119, 763282657, 763255000, 762845874, 762150943, 761428535, 760833681, 760351479, 759974480, 759724975, 759516597, 759283185, 759055734, 758789539, 758395672, 757868171, 757152140, 756163776, 754956067, 753620565, 752198994, 750796795, 749707162, 749253869, 749484718, 750124931, 750764251, 751141071, 751266778, 751248538, 751125932, 750838935, 750310719, 749547243, 748568714, 747435510, 746262074, 745104015, 744025588, 743101716, 742302418, 741553426, 740850151, 740225911, 739637792, 739019156, 738386929, 737818301, 737436891, 737317026, 737385809, 737479866, 737465978, 737361431]
2643.4G37361431j34885k29299m74453p76232r43899r33826p63416m53710r5964K67625
2663.7G32823372M75824M40120L84510L69668L20137L04818L43144L23534K14934R8765
2684.1G36098826L5703P9334J59264J08838o1870k90990o05345r78172j301586j452565
2704.5G31791437j489520j614631j896202k291739k770305l261149l385186k588332
2720.9G12494373q86142R26435J933873J917004J439810J073063R50932J003563J094282
2739.2G21947193J080930R62913P89583N29051K12848q8036l96192p39992j059889
2757.6G23238409j273394j396775j444757j400590j368821j480222j740217k092838
2773.9G11040795k524078k990842l398657l799677m312515m866838n361677n694389
$$ y = [737361431, 737226546, 736997247, 736522794, 735746562, 734802663, 733868837, 733105421, 732651711, 732555747, 732823372, 733299196, 733739316, 734123826, 734493494, 734813631, 735118449, 735461593, 735785127, 736000061, 736098826, 736134529, 736213863, 736373127, 736481965, 736420095, 736129105, 735523760, 734545588, 733244002, 731791437, 730301917, 728687286, 726791084, 724499345, 721729040, 718467891, 715082705, 712494373, 711608231, 712534666, 714468539, 716385543, 717825353, 718898416, 719849348, 720852911, 721947193, 723028123, 723991036, 724780619, 725309670, 725522518, 725434482, 725038290, 724298298, 723238409, 721965015, 720568240, 719123483, 717722893, 716354072, 714873850, 713133633, 711040795, 708516717, 705525875, 702127218, 698327541, 694015026, 689148188, 683786511, 678092122]
2790.2F78092122n613208n083739m550815m594684n409479o605923p538796p812023
2806.5F30883455p599234p430911p694066q485913r795726j1631012j3981223j7005682
2822.8E47259688k1238684k7371973l6060572m7040432n7095558o0259014n3414256
2837.1B44779199m2062521l6592364m0903285m5469627l6799963j4903732R424314
2851.4C7472021K9654343M3562315M7637127L9086372K1145686M584656n86525M140377
2867.7B26696372Q802772O954357m99905q525699j2142226j1135414r329319r064853
2884A91756085r743050j0404542j1106193j2114555j3199508j3982654j4232576j3925075
2900.3I3047932j3350584j2763545j2219641j1776213j1170637r656326o913301l723677
$$ y = [678092122, 672478914, 667395175, 662844360, 658249676, 652840197, 646234274, 638695478, 630883455, 623284221, 615853310, 608159244, 599673331, 589877605, 578246593, 564265370, 547259688, 526021004, 498649031, 462588459, 415548027, 358452469, 298193455, 244779199, 202716678, 166124314, 125221029, 79751402, 42951439, 28047707, 37472021, 67126364, 110688679, 158325806, 197412178, 218557864, 223142520, 222555995, 226696372, 235499144, 242453501, 241953596, 233427897, 221285671, 210150257, 200820938, 191756085, 182013035, 171608493, 160502300, 148387745, 135188237, 121205583, 106973007, 93047932, 79697348, 66933803, 54714162, 42937949, 31767312, 22110986, 15197685, 11474008]
2916.6A1474008j106154O51189J911070L251805N371423Q916153J4028722J9934688
2933F4432904K4798788K6232258K2065468J1341244l812149j7306730k2053242j5057191
2949.3I0641350n88835J1609115J3648607P119231K328314P782146K1951720L7584916
2965.6A92076564N0266817N8674410O1506480N8449984N1348745M2912841L4961283
2979.9E50197124K8117776K2475005J8040418J4627159J1831939R395123P185220N275190
2996.2F67144954M064083L837645M289151M640758M364192L496647K205372O14107
3012.5F94656909j303912l827929o830394r247005r133399n067110J653731P755041
3028.8F68655932J0969102J1091829R283423O949544M931271L549874K516687J366973
$$ y = [11474008, 10367854, 11019043, 12930113, 16181918, 21553341, 30469494, 44498216, 64432904, 89231692, 115463950, 137529418, 148870662, 145058513, 127751783, 105698541, 90641350, 90052515, 101661630, 115310237, 122429468, 124757782, 132539928, 154491648, 192076564, 242343381, 301017791, 362524271, 420974255, 472323000, 515235841, 550197124, 578314900, 600789905, 618830323, 633457482, 645289421, 654684544, 661869764, 667144954, 671209037, 675046682, 679335833, 683976591, 688340783, 691837430, 694042802, 694656909, 693352997, 689525068, 682694674, 673447669, 664314270, 659247160, 660900891, 668655932, 679625034, 690716863, 700000286, 706949830, 711881101, 715430975, 717947662, 719314635]
3045.1G19314635J98424p58529j685917k791107l656030l323436j378238J417339L775477
3063.5G11112618M800857M426479L210962J794994M69207p97808j942515k307475j024246
3081.9G19743073J464307L571987M339874L873110K832294J840889J144350P09772
3098.2G39519656L99232L30150O98209J226425J489818J344442R97782P24673N10514
3116.5G47240901L20017J44661o4492j77622j47403r2983j02043j53482j34051m9174
3136.9G46784329L279p1228j54793o5506L9220Q8811J50085J04665m6193r2745J073
3159.4G46740997N2988M0949N0008O4552Q4937N5253o9559j94549k27571j52349j13547
3181.8G46332109j95086k18034j34528q8810n7400k4855k1934Q3148K53856L17335
$$ y = [719314635, 719513059, 718754530, 717068613, 714277506, 710621476, 707298040, 705919802, 707337141, 711112618, 715913475, 720339954, 723550916, 725345910, 725815117, 725017309, 723074794, 720767319, 719743073, 721207380, 724779367, 729119241, 732992351, 735824645, 737665534, 738809884, 739519656, 739918888, 740249038, 740947247, 742173672, 743663490, 745007932, 746005714, 746730387, 747240901, 747560918, 747705579, 747641087, 747463465, 747316062, 747223079, 747121036, 746967554, 746833503, 746784329, 746787608, 746716380, 746561587, 746496081, 746535301, 746624112, 746774197, 746878862, 746832669, 746739924, 746740997, 746793985, 746834934, 746884942, 746949494, 747034431, 747089684, 747020125, 746825576, 746598005, 746445656, 746332109, 746137023, 745918989, 745784461, 745695651, 745638251, 745613396, 745591462, 745674610, 745928466, 746245801]
3202.2G46245801K66493K20358K51472K89321K98321L23594L71635L90470L89814M06683
3222.6G49453962L69549L02255K99930L23654K76684J61827Q3089M9293J073L636R8168
3245G51423120R5726r1017k31743j99437q7321n6922j28210j53839j56880j84178j10209
3267.5G50119090l517j24752l36170l60549k28643m9532o556j12117k00212k27451
3287.8G48469591j24693K4796j9551j97053k46763j19567K3604R8407M5717j11997
3308.2G47842491k29955k30551n8353J17302P6533r0957j79827j73271k07245k33829
3328.6G46632338k04742k25485k30789n7280R7692j0550j86980k13384o2704J41203
3349G45679319J18732q6724j22190L398N7876m5777j57416Q345K49207J87516k5391
$$ y = [746245801, 746512294, 746732652, 746984124, 747273445, 747571766, 747895360, 748266995, 748657465, 749047279, 749453962, 749823511, 750125766, 750425696, 750749350, 751026034, 751187861, 751270950, 751320243, 751321316, 751324952, 751423120, 751518846, 751427829, 751196086, 750996649, 750909328, 750852406, 750724196, 750570357, 750413477, 750229299, 750119090, 750115573, 749990821, 749654651, 749294102, 749065459, 749015927, 749009371, 748897254, 748697042, 748469591, 748344898, 748369694, 748350143, 748153090, 747906327, 747786760, 747810364, 747908771, 747954488, 747842491, 747612536, 747381985, 747323632, 747440934, 747517467, 747426510, 747246683, 747073412, 746866167, 746632338, 746427596, 746202111, 745971322, 745914042, 746011734, 746001184, 745814204, 745600820, 745538116, 745679319, 745798051, 745711327, 745589137, 745592535, 745650411, 745604634, 745447218, 745455563, 745704770, 745892286, 745866895]
3371.5G45866895o5863K8908J02281J47462Q1659k9743K6822J36137J36495O1452m1783
3393.9G46450722n5134J19567K31445j4484k54870j04487O6340M0651M6909L5226r0718
3416.3G46471167j83285j54435J8954K24650K73764J87337P1288O7830J59323J30951
3436.7G47267544n2929k11239j81674j22309p332L80278N85795L61025J02043K2709
3457.1G48143911L0458J5378J05322K94924L81946K40028m7088q7440Q5056R2387j15096
3479.6G49139786j60694J39534K48969O6936R1910K20895Q4460n9426o6698k90394
3500G49415278m93526j10805L06785J50323J37269M79937M11153o139k52068m34876
3520.4G49603331o20603m91798j62065K26080O46055O14285J98186P4803K30909m2975
$$ y = [745866895, 745801032, 745829940, 745932221, 746079683, 746161342, 746131599, 746158421, 746294558, 746431053, 746492505, 746450722, 746395588, 746515155, 746746600, 746732116, 746477246, 746372759, 746439099, 746479750, 746526659, 746561885, 746471167, 746287882, 746133447, 746152401, 746377051, 746650815, 746838152, 746909440, 746977270, 747136593, 747267544, 747214615, 747003376, 746821702, 746699393, 746692061, 747072339, 747658134, 748019159, 748121202, 748143911, 748174369, 748189747, 748295069, 748589993, 748971939, 749211967, 749164879, 749077439, 749162495, 749254882, 749139786, 748979092, 749118626, 749367595, 749434531, 749526441, 749747336, 749831796, 749772370, 749705672, 749415278, 748921752, 748810947, 749117732, 749268055, 749405324, 749885261, 750296414, 750290275, 750038207, 749603331, 748982728, 748490930, 748328865, 748554945, 749201000, 749815285, 750013471, 750088274, 750319183, 750276208]
3540.8G50276208p47025r61423j97947N55098L30567R1136M36544L22163k83956p61688
3561.1G49059677j451075k267599j066506J917124K447069R17375o3837p5817K8074
3579.5G49444485k46823j090944k199113j670540O99580R09030p89105j340032q36134
3597.9G42880404o86288m12226j95145q70288j227200l56674R9540O2525r1731m25935
3618.3G38776982R73522K472640J153409j637220k879083L85999K741873J796902P18832
3636.6G44503856Q1360m75287j045585k325177m208803l366173K010644M340529K361477
3655G41876841J093566J711726J349390J83463q42393k414405l730357k248942j253188
3673.3G35725701j778484J766623M545986L250838J006841j093685l037751k623081
$$ y = [750276208, 749529183, 748567760, 748369813, 748924911, 749255478, 749346614, 749783158, 750105321, 749821365, 749059677, 747608602, 745341003, 744274497, 746191621, 748638690, 749556065, 749492228, 749416411, 749444485, 749197662, 748106718, 745907605, 744237065, 744936645, 745845675, 745056570, 743716538, 742880404, 742194116, 741781890, 741586745, 740716457, 739489257, 739132583, 739232123, 739294648, 739202917, 738776982, 739750504, 742223144, 743376553, 741739333, 738860250, 739246249, 741988122, 743785024, 744503856, 744585216, 744109929, 743064344, 740739167, 736530364, 733164191, 735174835, 739515364, 741876841, 742970407, 744682133, 746031523, 746214986, 745372593, 742958188, 739227831, 736978889, 735725701, 733947217, 735713840, 740259826, 743510664, 744517505, 743423820, 740386069, 737762988]
3689.6G37762988R83476K663970J693785L56734o21974n69582O14047M30047j475155
3708G41838336k605975n56767K495587K297163K67625j160443j319229n88775L19898
3726.4G40987420N38826j001716l347933l080368N56111K723813J486958j402736k851844
3744.7G34608531o53327j61170n76199K093077L017426J167297R8765R24647R66668
3763.1G41485715l00646o39617q8215R39727J586139N96881q32796r83000J21116M40240
3783.5G42325544K16604N55753N03302j83225j223027k209664j965880j709879j314044
3801.8G34995484Q65579J235664Q97467J562715N82099j773179k927482j662254q79944
3820.2G32896149N98908K444625J624047M37379m07278j254976j448572j756608j361668
$$ y = [737762988, 738746464, 741410434, 743104219, 743460953, 742838979, 742269397, 742883444, 743313491, 741838336, 739232361, 738675594, 741171181, 743468344, 743735969, 742575526, 741256297, 740667522, 740987420, 741526246, 740524530, 737176597, 734096229, 734652340, 737376153, 738863111, 737460375, 734608531, 733955204, 733794034, 733217835, 735310912, 738328338, 739495635, 739594400, 740519047, 741485715, 741185069, 740545452, 740457237, 741396964, 742983103, 743579984, 742747188, 741764188, 741885304, 742325544, 742542148, 743097901, 743601203, 743417978, 742194951, 739985287, 738019407, 736309528, 734995484, 735861063, 737096727, 737994194, 739556909, 740139008, 738365829, 735438347, 733776093, 732896149, 733495057, 735939682, 737563729, 738001108, 737593830, 736338854, 734890282, 733133674, 731772006]
3838.5G31772006P95066K244770K268970J339376o54518l258050m406452O8903L807604
3856.9G33977675K449036j70886j679361r90153j47402q83996n38767J085460J669109
3875.2G34770715R03070j053512j217663K41101K48074N36263M17054l33190N15878
3893.6G35027790P38502j109124k503514j640797L92855K222597K591729J393497N1439
3912G37164974p74443j280308q61883K10464L68893p1943R8646J05798m17828J8656
3932.3G34561026J199722J239479K04504o93799p74443r9778J34051j10328K07543
3950.7G35867977N91576M10378k8431k81811k48849n5313L5762j65581l30687k95460
3971.1G35499561k18153p4566K1160o9499j33038j09434j49428k24948k70665k33531
$$ y = [731772006, 732567072, 734811842, 737080812, 738420188, 737765670, 734507620, 730101168, 730170071, 733977675, 736426711, 736255825, 734576464, 733586311, 733438909, 732554913, 732016146, 733101606, 734770715, 735673785, 734620273, 733402610, 733643711, 733891785, 734428048, 734845102, 734511912, 735027790, 735766292, 734657168, 732153654, 730512857, 730905712, 733128309, 735720038, 737113535, 737164974, 736390531, 735110223, 734248340, 734458804, 734827697, 734755754, 734854400, 734960198, 734542370, 734561026, 735760748, 737000227, 737204731, 736510932, 735736489, 735636711, 735770762, 735660434, 735867977, 736459553, 736869931, 736841500, 736559689, 736310840, 736255527, 736291289, 736125708, 735795021, 735499561, 735281408, 735206842, 735228002, 735158503, 735025465, 734916031, 734766603, 734541655, 734270990, 734037459]
3991.5G34037459j08123J0073M9949
3997.6G33989358
$$ y = [734037459, 733929336, 733939409, 733989358]
##END=$$ End of the data block
