##TITLE=Poli Rio Quebrado $$ Begin of the data block
##JCAMP-DX=5.00 $$ ACD/SpecManager v 10.08
##SPECTROMETER/DATA SYSTEM=Alpha
##DATE=14 Apr 2015 15:41:22
##DATA TYPE=INFRARED SPECTRUM
##DATA CLASS=XYDATA
##ORIGIN=
##OWNER=
##NPOINTS=1765
##FIRSTX=399.76428223
##LASTX=3997.64306641
##MAXX=3997.64306641
##MINX=399.76428223
##MAXY=0.84216774
##MINY=0.08832467
##XFACTOR=1.0000000000
##YFACTOR=1.000000000000000e-9
##FIRSTY=0.83414352
##DELTAX=2.03961372
##XUNITS=1/CM
##YUNITS=ARBITRARY UNITS
##XYDATA=(X++(Y..Y))
399.8 834143519 838418543 840567708 841143429 840787113 840727448 841096878 840394557 837170899 832711160
418.1 832711160 832348704 835122049 837181211 838611960 839545846 840219080 840851068 841236234 841824651
436.5 841824651 842167735 840967774 839356065 838696599 838068187 837051570 835801482 834842801 833809733
454.8 833809733 831843734 830762804 830792725 830208838 829233348 828546464 828091443 827775836 828811526
473.2 828811526 831227660 833257794 834393620 834943414 835538030 836837888 838504374 839664817 840112925
491.5 840112925 840407491 840677261 840468466 839534581 838429332 838036239 838018298 838001430 838058829 837705255
511.9 837705255 836674333 835260570 834033608 833311439 832561314 831031024 829278886 828259528 827442288
530.3 827442288 826227844 824730039 823440909 822705150 822436750 822552204 823015153 823593974 823938668
548.7 823938668 824130356 824395657 824697971 824994981 825332165 825651526 826035619 826633036 827288091 827935696
569.1 827935696 828535080 828825951 828869760 829049468 829253852 829464853 829949737 830427706 830559015 830214858
589.4 830214858 829719841 829772770 830282986 830523193 830364585 830231428 830233872 830333233 830543637 830849051
609.8 830849051 831144452 831120312 830914676 830925643 831039965 831122696 831204951 831248462 831269383 831329048 831440270
632.3 831440270 831516206 831545472 831713498 832160234 832669437 832867444 832819819 832755268 832608402 832292140
652.7 832292140 831893623 831529379 831150651 830733836 830250263 829418302 827906489 826830804 827235401
671 827235401 827818573 828120828 828239202 828296542 828222394 827851772 827164114 826131225 824336350 820460439
691.4 820460439 812748015 802007437 793676436 792888701 798824430 806809187 813162565 816222608
707.7 816222608 815568447 811594903 803140581 784392238 760255456 756909549 779810250 799715519
724.1 799715519 799295485 784132898 775890589 791919410 817135513 831118643 834994316 835609436
740.4 835609436 835330069 834751308 834092915 833589971 833325744 833081603 832737505 832512140 832576513 832956016
760.8 832956016 833665252 834619582 835695684 836769760 837680519 838379562 838896513 839215815 839397609
779.1 839397609 839408755 839079022 838494539 837807477 837041020 836229920 835372567 834607005 834148407 833863258
799.5 833863258 833330631 832287669 830838740 829732597 830194175 832388282 834957421 836670160 837475836
817.9 837475836 837876260 838032663 837806404 837333858 836860299 836252391 835328102 833850741 830561280
836.2 830561280 824690104 820335031 822452784 828311563 832451642 834156573 834821999 835080743 835056484
854.6 835056484 834823668 834549963 834265828 833786607 832899868 831387162 828937888 825558186 822195947
873 822195947 820227146 820303023 821915269 823912084 825861216 827933490 829628706 830318391 829968572
891.3 829968572 828552008 826007545 823230147 821949601 822672427 824020863 824741602 824887693 825081766
909.7 825081766 825628281 826361299 827063322 827684462 828175366 828475654 828600168 828564763 828353226 827896774
930.1 827896774 827098787 826020241 824873686 823991001 823773801 824220479 824823976 825127423 825074732 824804783
950.5 824804783 824368656 823727787 822830379 821648240 820145130 818246424 815683067 811629415 805236757
968.8 805236757 798362255 795757949 799249411 805451155 810633183 813595653 814661026 814451873 813315094
987.2 813315094 811193109 807595253 801925182 795153618 791106641 792620122 797259808 800833762
1003.5 800833762 802098691 801903963 801052213 799836278 798409462 797119200 796445727 796616912 797335148
1021.8 797335148 798078597 798588634 798947036 799476922 800503671 801891744 803178906 804105461 804634750
1040.2 804634750 804960847 805479825 806306779 807210505 808093786 808999419 809803605 810350776 810622454 810692549
1060.6 810692549 810663998 810567260 810391009 810174346 810002804 809931219 809912324 809800625 809542179 809330940
1081 809330940 809294164 809219301 808881879 808273613 807547569 806892753 806243062 805421054 804500222 803869486
1101.4 803869486 803976655 804763079 805689454 806314766 806524098 806492686 806535125 806881130 807561457 808400571
1121.8 808400571 809145629 809676886 810014188 810202360 810261846 810160935 809837043 809232473 808294892 806988299
1142.2 806988299 805350840 803420961 801230073 799107134 797535002 796595216 795843005 794603050 792381763
1160.5 792381763 789137065 785703778 784326255 787184179 793387771 799526632 803469479 805508018
1176.9 805508018 806605935 807228625 807488024 807490528 807317972 807007015 806663811 806435168 806348860 806346297
1197.3 806346297 806391299 806456327 806468904 806358516 806119621 805740893 805191040 804420292 803444743 802479029
1217.7 802479029 801827013 801570654 801499546 801377356 801088154 800604522 799968004 799254656 798572123 798038244
1238.1 798038244 797673285 797399521 797090173 796667993 796050489 795057833 793661416 792468309 792365909
1256.4 792365909 793255091 794317782 795111716 795569837 795770943 795841098 795855105 795875490 795871913 795738220
1276.8 795738220 795474231 795117974 794639528 793920219 792989671 792011201 790948808 789752901 788733065
1295.2 788733065 788140297 787586629 786502540 785305917 785321057 786659062 787894845 788176239 787916660
1313.5 787916660 787467182 786814749 786310971 785913646 785076976 783811390 782654941 782093585 782182932
1331.9 782182932 782137275 780952454 778787673 777279139 776906967 776024580 773850381 770742953 766894042
1350.2 766894042 761805058 755022228 747794688 742818058 741411924 742720306 743878245 740326107
1366.6 740326107 727703691 702114403 662313640 625261307 623787582 658786714 702114940
1380.8 702114940 733194113 749638200 757080019 760841906 762022793 760271132 757480800 755925238
1397.1 755925238 755568266 755507171 754202008 752080560 750548422 748836339 746565640 744072020 740567446
1415.5 740567446 735881567 732970238 732557297 731650829 729737878 726281583 720227301 712384164 704000831
1433.9 704000831 697566271 696514845 696328640 691360772 680664718 665119827 647890031 634562612
1450.2 634562612 625605404 617707789 606247485 584964156 560295939 552493513 578831613 619929016
1466.5 619929016 640841782 638852894 636983871 671019673 718816698 746911943 757580042 761857748
1482.8 761857748 762808263 760500133 757177234 756951630 759306788 761542618 764658332 769521654 773333788
1501.2 773333788 773046553 767461300 763685346 769181550 774814844 776542187 775106013 773260355
1517.5 773260355 771976352 771448672 773602605 776411057 779018998 780706763 779748321 778589725 778634906
1535.8 778634906 775167406 768691897 769211650 774908006 779879332 782052159 782041192 781329274 779269874
1554.2 779269874 774393499 768633485 772853673 780132532 782876730 782661974 781180084 781308711 782446563
1572.6 782446563 780987144 779702008 782085896 784235358 784761667 784882486 784996808 784831762 784361899
1590.9 784361899 783674896 782985330 782403171 781616390 780835032 780908525 781684160 782262802 782775342 783378780
1611.3 783378780 782638729 779964447 779039204 780695736 780621648 779548705 779975712 780974567 782069206
1629.7 782069206 781860173 778216720 774443805 776840389 780718207 781818032 779459536 774933279
1646 774933279 773872375 774611890 771487772 771731853 778279960 781955481 781666160 780213594 780473173
1664.3 780473173 780131280 777187943 775498748 776400208 776936948 777836382 778469026 776351631 771497548
1682.7 771497548 769857287 774014533 777243912 778515995 777603447 773543298 769219637 767377257
1699 767377257 768653095 771086931 771976054 773049355 774404526 773798227 770584702 765721321 763346672
1717.4 763346672 766570151 770219386 771658719 771993339 771254301 769109905 766057968 764104962 766374409
1735.7 766374409 768943369 769815028 770921528 772208333 772500038 771871388 772424877 775596619 778431952
1754.1 778431952 779161453 779172480 778990984 779197812 780290067 780178964 778198242 775552034 774649560
1772.4 774649560 777038336 779555619 780143976 779958069 780276239 780785024 781023085 779937148 777217925
1790.8 777217925 775924027 777342618 778375089 778038383 778065503 779480517 780869424 781043231 780381024
1809.2 780381024 780210316 781023443 781662643 781671643 781568170 781089842 779833972 778707981 777974188 777590156
1829.6 777590156 778929770 780677259 781112492 781054974 780818522 779347658 777399182 777609050 779230237
1847.9 779230237 780386031 780882657 780960321 780796945 780479193 780190408 779896498 779025435 777067840
1866.3 777067840 775393009 776248038 778238833 779160798 779179096 779025078 778837383 778556287 778178096
1884.6 778178096 777425289 776337624 776003599 776292980 776351750 776579857 777031839 777250707 777208805 776984215
1905 776984215 776543558 776198447 776385009 776654124 776154041 775197864 774914205 775030136 775231540 775877833
1925.4 775877833 776364505 776341915 776143968 775948346 775772452 775505841 774792433 773794115 773608983 774249494
1945.8 774249494 774785519 774984539 774937391 774782002 774673581 774610937 774546742 774469018 774171531 773710668
1966.2 773710668 773727059 774180532 774393678 774342179 774295747 774239600 774112046 773977041 773831666 773552775
1986.6 773552775 773094237 772550702 772416890 772834718 773143947 773123562 773021877 772853315 772580922 772308767
2007 772308767 772072554 771791518 771370590 770783544 770368814 770440519 770690262 770838976 770926356 770952344
2027.4 770952344 770947456 770962119 770981669 770971179 770900607 770754933 770642400 770671666 770723343 770695686 770643592
2049.8 770643592 770612001 770554304 770445645 770328999 770217717 770065844 769867122 769777536 769822657 769826233 769751608
2072.3 769751608 769666076 769602239 769533813 769416571 769275069 769140840 769001603 768869162 768799365 768759191
2092.7 768759191 768672585 768575370 768512011 768478274 768445015 768363237 768225610 768077016 767956138 767831087 767697632
2115.1 767697632 767609179 767542362 767412841 767194927 766950965 766742349 766582668 766466320 766357183 766244650
2135.5 766244650 766178310 766131401 766027391 765895307 765784621 765652359 765493810 765388072 765340626 765295446
2155.9 765295446 765228570 765119255 764974833 764846146 764770269 764736474 764686644 764598131 764518678 764459908 764382899
2178.3 764382899 764275849 764153719 764033318 763932407 763850451 763791025 763760686 763714433 763641417 763586760 763520777
2200.8 763520777 763419986 763356864 763350070 763311982 763212144 763108075 763009548 762902260 762789130 762671709 762565255
2223.2 762565255 762457490 762333751 762156487 761876702 761578560 761379004 761265337 761184812 761140704 761154413
2243.6 761154413 761167288 761094809 760980487 760889888 760800362 760717511 760667503 760616541 760537267 760437787 760304987
2266 760304987 760131478 759955645 759833574 759803057 759846926 759876013 759827614 759733617 759640038 759557843 759451091
2288.5 759451091 759264112 759038627 758856833 758690000 758495986 758317828 758158624 757935524 757619500 757245123
2308.9 757245123 756860912 756526530 756227970 755904496 755489230 754964352 754428685 753975868 753628194 753310919
2329.3 753310919 752994061 752777457 752620995 752380133 752092481 751926124 751910150 752156556 752717376 753116906
2349.7 753116906 752929747 752271950 751607120 751187503 750989079 750897050 750898182 751122952 751618981 752199471
2370.1 752199471 752759874 753306687 753840208 754371583 754830360 755163610 755380154 755470097 755455554 755398333
2390.4 755398333 755328417 755218506 755079150 754967749 754860759 754719496 754583955 754508913 754459500 754344046
2410.8 754344046 754202843 754140079 754109800 754022181 753898442 753822029 753828406 753839910 753792703 753745735 753762186
2433.3 753762186 753811240 753841460 753852367 753840029 753773689 753690839 753651619 753619432 753554523 753486872 753440440
2455.7 753440440 753403604 753358603 753287435 753173530 753015280 752785563 752504051 752276301 752155423 752096772
2476.1 752096772 752017796 751893342 751760840 751610160 751438141 751308620 751213908 751083076 750916183 750742674
2496.5 750742674 750567853 750405014 750271201 750144720 749964774 749731481 749540925 749408484 749227822 748990595
2516.9 748990595 748776376 748585582 748401165 748261929 748203456 748203337 748216093 748234332 748224497 748156965 748037159
2539.3 748037159 747822225 747540832 747288227 747071505 746881187 746739626 746627450 746469617 746272266 746115208
2559.7 746115208 745993912 745835185 745599031 745280266 744862020 744355977 743822932 743303776 742804587 742407203
2580.1 742407203 742264926 742395759 742632270 742775500 742781699 742754519 742733538 742674530 742537796 742296040
2600.5 742296040 741969526 741584837 741175652 740782022 740366220 739939749 739583015 739273369 738968313 738695145
2620.9 738695145 738472283 738269448 738055766 737830639 737597644 737420022 737367690 737383544 737365186 737260401
2641.3 737260401 737122357 737038791 736957610 736780822 736506760 736167073 735813141 735524356 735330820 735214829
2661.7 735214829 735199690 735307276 735464454 735599458 735714018 735832870 735963345 736059844 736083031 736067235
2682.1 736067235 736037016 735962689 735874891 735827148 735779107 735709012 735606730 735366642 734932542 734375417 733793557
2704.5 733793557 733203948 732546091 731782854 730902970 729896903 728747368 727580488 726753175 726544619
2722.9 726544619 726888418 727448344 727935076 728299022 728603601 728873968 729120076 729346573 729553342 729753792
2743.3 729753792 729925811 730042458 730068922 729930758 729626298 729213953 728710413 728116214 727450967 726771414
2763.7 726771414 726114988 725481510 724827826 724086761 723239064 722201407 720905483 719458520 717961371
2782 717961371 716350555 714521706 712467790 710271239 708111405 706132829 704285741 702376723 700132668
2800.4 700132668 697399437 694345593 691251636 688218296 685146034 681881726 678269029 674097300
2816.7 674097300 669139206 663178504 655874908 646600664 634350002 617569625 594453692 564256191
2833 564256191 529223800 494482994 462960929 429162621 379796237 307590604 233198285 200604588
2849.3 200604588 231845155 303273499 377928138 436164707 472791731 488793194 491112947
2863.6 491112947 490617096 494292378 500986278 505562425 504255354 496963352 487040073 477881819
2879.9 477881819 469973207 462123394 453658223 444503129 434392601 422757387 409113348 393320709
2896.3 393320709 375589907 356257737 335332036 312378198 286444873 255522251 217205793
2910.5 217205793 172285736 128576100 98190688 88324666 97051010 118577167 148780137 186202407
2926.8 186202407 230336845 279325843 329272270 375346243 412997335 438177317 447350830
2941.1 447350830 438691020 414734006 385153115 365724295 368637562 390533477 414845049 428674191
2957.4 428674191 434657872 445697367 470065653 504973471 543819666 582200229 617129982
2971.7 617129982 646534920 669773757 687436879 700702965 710668087 718145311 723844111 728311658
2988 728311658 731824279 734502137 736557484 738252282 739603043 740617573 741494179 742362559 743175328
3006.4 743175328 743882954 744456530 744776905 744723022 744243681 743270695 741848707 740469337 739763021
3024.7 739763021 739992142 741044879 742576122 744223356 745675564 746753752 747531354 748106122 748461902
3043.1 748461902 748588383 748544276 748443902 748272359 747874975 747278273 746749282 746539414 746687055 747064829
3063.5 747064829 747615814 748260140 748714268 748867810 748860061 748699665 748353958 747945726 747758448 747956932
3083.9 747956932 748381734 748916090 749452889 749740183 749818027 750005364 750289500 750409782 750448644 750647247
3104.3 750647247 750967383 751202703 751286983 751296043 751244187 751199424 751211524 751119852 750892222 750705242 750617325
3126.7 750617325 750569463 750480711 750336170 750246108 750270486 750284910 750141323 749956131 749902785 749935687 749993622
3149.2 749993622 750080049 750119567 750050187 749949276 749881744 749854147 749831796 749767065 749727249 749787331 749834836
3171.6 749834836 749748826 749557197 749343216 749202192 749114156 749027371 748970032 748927832 748903930 748920500 748903871
3194 748903871 748788178 748695612 748761475 748901427 748992085 749046326 749116182 749168932 749144435 749138296 749270022
3216.5 749270022 749462247 749645293 749826014 749962151 750037611 750115097 750284553 750494719 750549376 750427663
3236.9 750427663 750341237 750355005 750377238 750454545 750550926 750508368 750377774 750306547 750304341 750251353 750149786
3259.3 750149786 750124097 750118613 750045657 749999285 750008702 749913514 749719560 749580920 749512732 749503911 749540210 749550581
3283.8 749550581 749464691 749342978 749338388 749442220 749508440 749431252 749286711 749230683 749287486 749399364 749431014
3306.2 749431014 749298751 749088943 748904169 748832405 748896718 748998702 749050617 749049067 748985350 748865128 748779476
3328.6 748779476 748743653 748664021 748523176 748465180 748570323 748644769 748570144 748486519 748555720 748741329 748763800
3351.1 748763800 748554945 748393774 748390436 748411059 748378277 748340607 748416960 748630941 748822153 748853624 748793423
3373.5 748793423 748760283 748766065 748821795 748863161 748814344 748812735 748950064 749085307 749067426 748950303 748925269
3395.9 748925269 749125242 749400079 749441564 749295354 749282300 749478519 749687910 749791682 749761522 749589622
3416.3 749589622 749355197 749195516 749289274 749596179 749876440 750055432 750188529 750372231 750574231 750602424
3436.7 750602424 750440836 750240386 750108361 749971151 749909222 750245929 750761628 751000881 750998318 750990450
3457.1 750990450 750982225 750878930 750886679 751182914 751589179 751813233 751734257 751577318 751578808 751662195 751559198
3479.6 751559198 751360297 751442015 751639009 751671910 751749992 751931906 751965046 751909435 751868367 751558244 751062751
3502 751062751 751019537 751337886 751419544 751548827 752078235 752510726 752517760 752315342 751967967 751407385 750884295
3524.4 750884295 750657856 750895917 751615584 752251863 752425134 752493322 752644598 752416790 751537859 750545621
3544.8 750545621 750366449 750896752 751165807 751365721 752006233 752433836 752230823 751564980 750077367
3563.2 750077367 747640729 746659636 748941302 751567721 752460182 752367556 752305806 752404273 752303839 751302004
3583.6 751302004 749080002 747628450 748793006 749999881 749507010 748734653 748597026 748611391 748854220
3601.9 748854220 748941004 747791409 746118605 745489955 745384872 745288908 744932413 744178295 745143712 747775733
3622.3 747775733 748943388 747036815 744012892 744837105 747927547 749881804 750812948 751125574 750916600
3640.7 750916600 750144482 747812808 743193030 739539921 741854072 746348321 748436034 749403596 751210392
3659 751210392 752640426 752973258 752220273 749649227 745978296 744333148 743528306 742266417 744427681
3677.4 744427681 748507142 751173973 751982450 750694454 747359097 744940698 746540070 749583662
3693.7 749583662 751416385 751722276 750840425 750146806 750922561 751379788 749645352 746729970 746279418
3712.1 746279418 749130905 751560628 751806736 750610888 749340951 748944044 749577761 750337601 749281883
3730.4 749281883 745686769 742469847 743326545 746450186 747814238 745881140 743064404 742831945 742514849
3748.8 742514849 741797984 744238079 747496903 748638213 748835027 750056505 751127243 750821233 750133693
3767.1 750133693 749996126 751175106 753040075 753668129 752674341 751652062 751938820 752450883 752719760
3785.5 752719760 753362298 753955901 753935575 752843201 750786841 748878181 746933877 745753706 747014165
3803.9 747014165 748419583 749692857 751609266 752138495 750106037 747209430 745601833 744515777
3820.2 744515777 745338798 748085439 749738514 750189185 749837220 748688817 747141659 745073199 743755877
3838.5 743755877 744983971 747580886 750017405 751425087 750727355 747125983 742440879 743038058 747337639
3856.9 747337639 749872267 749660075 748002708 747268140 747235537 746331394 746139944 747623801 749529064
3875.2 749529064 750441074 749297976 748204887 748452961 748771787 749560118 749913216 749563932 750343144
3893.6 750343144 751085520 749742925 747174025 745598793 746131480 748682678 751546979 753107011 753330588
3912 753330588 752646744 751422107 750689149 750961483 751277328 751251400 751543105 751732171 751206815 751081347
3932.3 751081347 752147734 753333449 753653228 753087282 752387941 752345622 752439260 752277076 752513945 753105044
3952.7 753105044 753500819 753661156 753683031 753555298 753522694 753698528 753756702 753590882 753374219 753225029
3973.1 753225029 753254116 753418326 753520787 753564835 753604054 753585935 753461957 753282070 753225207 753312767 753433824
3995.6 753433824 753542900
3997.6 753542900
##END=$$ End of the data block
