##TITLE=Poli Rio Liso $$ Begin of the data block
##JCAMP-DX=5.00 $$ ACD/SpecManager v 10.08
##SPECTROMETER/DATA SYSTEM=Alpha
##DATE=14 Apr 2015 15:46:52
##DATA TYPE=INFRARED SPECTRUM
##DATA CLASS=XYDATA
##ORIGIN=
##OWNER=
##NPOINTS=1765
##FIRSTX=399.76428223
##LASTX=3997.64306641
##MAXX=3997.64306641
##MINX=399.76428223
##MAXY=0.81217492
##MINY=0.06388238
##XFACTOR=1.0000000000
##YFACTOR=1.000000000000000e-9
##FIRSTY=0.80825442
##DELTAX=2.03961372
##XUNITS=1/CM
##YUNITS=ARBITRARY UNITS
##XYDATA=(X++(Y..Y))
$$ plain form
399.8 808254421 809547663 810372293 810430527 810389876 810426652 810600281 810575604 808907628 805848122 805448711
420.2 805448711 807304859 808615208 809425712 809682012 809749305 809958994 810205340 810979486 811998188
438.5 811998188 812174916 811647177 811281443 811042368 810442209 809418261 808407187 807349026 806075215
456.9 806075215 805929124 807041287 807823002 807725072 807156801 806463778 805862784 806073427 806988955 807456076
477.3 807456076 807356954 807165682 806823790 806730151 807232141 807574213 807600260 807840884 808220744 808392525
497.7 808392525 808127940 807516515 807004452 806751549 806731641 806852043 806714952 806096733 805276036 804635763
518.1 804635763 804186821 803789377 803138971 802234888 801640391 801167786 800419688 799645245 798924983 798257411
538.5 798257411 797742188 797214508 796780348 796570718 796338081 795791984 794853151 793932855 793374836 793293417
$$ packed form
399.8H08254421J293242Q24630N8234m0651L6776J73629k4677j667976l059506l99411
420.2H05448711J856148J310349Q10504K56300O7293K09689K46346P74146J018702
438.5H11998188J76728n27739l65734k39075o00159j023948j011074j058161j273811
456.9H06075215j46091J112163P81715r7930n68271o93023o00994K10643R15528M67121
477.3H07456076r9122j91272l41892r3639N01990L42072K6047K40624L79860J71781
497.7H08392525k64585o11425n12063k52903j9908J20402j37091o18219q20697o40273
518.1H04635763m48942l97444o50406r04083n94497m72605p48098p74443p20262o67572
538.5G98257411n15223n27680m34160k09630k32637n46097r38833r20296n58019q1419
$$ plain form
558.9 793293417 793722034 794362485 794817209 794860303 794673204 794741809 795071900 795276642 795215547 794921696
579.3 794921696 794662952 794678330 794710457 794559002 794388831 794187963 793944716 793879867 793929875 793853164 793679893
601.7 793679893 793497860 793289781 793177426 793139040 792982459 792710423 792458951 792244911 791927338 791480064
622.1 791480064 791007757 790673256 790566146 790487468 790161133 789707899 789671779 790283799 791022301 791388273
642.5 791388273 791455626 791449726 791348457 791049480 790759861 790616512 790360689 789884627 789470971 789307237
662.9 789307237 789140880 788315117 787213385 787079871 787077904 786777854 786355793 785852373 785259902 784725785
683.3 784725785 784298837 783820868 783238709 782441914 781138420 779218733 777110636 775209367 773271680
701.6 773271680 770604253 766687274 760907412 752182066 738888621 715454102 669441402 612827837
$$ packed form
558.9G93293417M28617O40451M54724M3094j87099O8605L30091K04742o1095k93851
579.3G94921696k58744J5378L2127j51455j70171k00868k43247o4849N0008p6711j73271
601.7G93679893j82033k08079j12355l8386j56581k72036k51472k14040l17573m47274
622.1G91480064m72307l34501j07110p8678l26335m53234l6120O12020P38502L65972
642.5G91388273O7353n900j01269k98977k89619j43349k55823m76062m13656j63734
662.9G89307237j66357q25763j101732j33514j967l00050m22061n03420n92471n34117
683.3G84725785m26948m77969n82159p96795j303494j919687k108097j901269j937687
701.6G73271680k667427l916979n779862q725346j3293445k3434519m6012700n6613565
$$ plain form
717.9 612827837 600897908 647428811 692063272 693619311 659813166 638241410 672008216 731617391
734.3 731617391 768689215 782104552 787088156 789470017 790776134 791560709 792073429 792384744 792613029
752.6 792613029 792883456 793233097 793590963 793868303 794036031 794190764 794377863 794534504 794601560 794511795
773 794511795 794320703 794164121 794105887 794050157 793823361 793405771 792927325 792417765 791827679 791226685
793.4 791226685 790679991 790157497 789585352 788767517 787502289 785965502 784955502 785291374 786706984
811.8 786706984 788217127 789245605 789784253 790010571 790063083 789961517 789608240 789023042 788320065 787432373
832.2 787432373 785985827 782962978 777793467 773820281 775195301 779623032 782595575 783759892
848.5 783759892 784177899 784102917 783858478 783764362 783779025 783718467 783432245 782723427 781193078 778389215
$$ packed form
717.9F12827837j1929929M6530903M4634461J556039l3806145k1571756L3766806N9609175
734.3G31617391L7071824J3415337M983604K381861J306117P84575N12720L11315K28285
752.6G92613029K70427L49641L57866K77340J67728J54733J87099J56641O7056q9765
773G94511795j91092j56582n8234n5730k26796m17590m78446n09560n90086o00994
793.4G91226685n46694n22494n72145q17835j265228j536787j010000L35872J415610
811.8G86706984J510143J028478N38648K26318N2512j01566l53277n85198p02977q87692
832.2G87432373j446546l022849n169511l973186J375020M427731K972543J164317
848.5G83759892M18007p4982k44439r4116J4663o0558k86222p08818j530349k803863
$$ plain form
868.9 778389215 774490714 770765007 768660545 768747091 770580292 773035049 775464475 777949870 780174792
887.2 780174792 781482399 781740069 781092763 779588223 777847946 777053833 777575552 778368294 778355896
905.6 778355896 777947187 778311551 779585123 780911982 781771243 782253563 782564640 782789767 782866955 782746375
926 782746375 782520235 782303154 782029808 781519234 780755460 779973090 779499650 779441535 779528618 779408097
946.4 779408097 779036105 778546035 777972400 777307153 776564717 775705040 774617910 773213029 771166027
964.7 771166027 767692745 762177348 756294847 754071534 757062018 762387455 766805649 769343615
981.1 769343615 770329297 770201087 769273996 767654419 764993608 760713756 755634010 753028333 755174339
999.4 755174339 759891987 763654172 765509248 766207576 766376972 766320288 766196907 766070127 765991330 766016603
$$ packed form
868.9G78389215l898501l725707k104462Q6546J833201K454757K429426K485395K224922
887.2G80174792J307607K57670o47306j504540j740277p94113N21719P92742j2398
905.6G78355896m08709L64364J273572J326859Q59261M82320L11077K25127P7188j20580
926G82746375k26140k17081k73346n10574p63774p82370m73440n8115Q7083j20521
946.4G79408097l71992m90070n73635o65247p42436q59677j087130j404881k047002
964.7G71166027l473282n515397n882501k223313K990484N325437M418194K537966
981.1G69343615R85682j28210r27091j619577k660811m279852n079746k605677K146006
999.4G55174339M717648L762185J855076O98328J69396n6684j23381j26780p8797K5273
$$ plain form
1019.8 766016603 766098738 766090512 765915275 765619874 765300691 765021503 764844418 764830947 764883101 764810085 764606595
1042.2 764606595 764505446 764591813 764635444 764637172 764857829 765124321 765074193 764807284 764576733 764431536
1062.6 764431536 764366329 764327824 764201999 763966382 763636291 763192892 762707233 762351871 762214780 762236536
1083 762236536 762291670 762228429 762027264 761833668 761672437 761399090 760876656 760105014 759423256 759268284
1103.4 759268284 759597719 760002792 760195673 760074854 759695292 759297669 759149969 759381056 759941101 760600865
1123.8 760600865 761104167 761345625 761369646 761282444 761135936 760872304 760368407 759564936 758531749 757353604
1144.2 757353604 756006956 754460216 752945721 751795292 750965595 750088811 748811841 746869326 744137168
1162.6 744137168 741072059 739312708 740784883 745199084 749924242 753090620 754977703 756276965
$$ packed form
1019.8G66016603Q2135q226j75237k95401l19183k79188j77085j3471N2154p3016k03490
1042.2G64606595j01149Q6367M3631J728K20657K66492n0128k66909k30551j45197
1062.6G64431536o5207l8505j25825k35617l30091m43399m85659l55362j37091K1756
1083G62236536N5134o3241k01165j93596j61231k73347n22434p71642o81758j54972
1103.4G59268284L29435M05073J92881j20819l79562l97623j47700K31087N60045O59764
1123.8G60600865N03302K41458K4021q7202j46508k63632n03897q03471j033187j178145
1144.2G57353604j346648j546740j514495j150429q29697q76784j276970j942515k732158
1162.6G44137168l065109j759351J472175M414201M725158L166378J887083J299262
$$ plain form
1178.9 756276965 757066190 757409155 757512271 757481217 757361829 757209063 757103443 757037044 756888390 756634593
1199.3 756634593 756368101 756106913 755792201 755387425 754923880 754425287 753851473 753242552 752720237 752384543
1219.7 752384543 752207935 752048492 751826584 751513839 751086414 750573516 750010073 749432027 748940349 748572230
1240.1 748572230 748271406 747979879 747649431 747188449 746387422 745130122 743957877 743746817 744412959
1258.4 744412959 745120585 745515347 745704174 745739937 745661795 745511115 745313287 745072365 744769812 744407713
1278.8 744407713 743923426 743303120 742551506 741656661 740637958 739454448 738112628 736838400 735835314
1297.2 735835314 734923601 733763039 732704699 732786775 734048843 735350847 736016035 736272871 736377060
1315.6 736377060 736326694 736243308 736070573 735523045 734636307 733791232 733312011 733235896 733018339 731985807
$$ packed form
1178.9G56276965P89225L42965J03116l1054j19388j52766j05620o6399j48654k53797
1199.3G56634593k66492k61188l14712m04776m63545m98593n73814o08921n22315l35694
1219.7G52384543j76608j59443k21908l12745m27425n12898n63443n78046m91678l68119
1240.1G48572230l00824k91527l30448m60982q01027j257300j172245k11060O66142
1258.4G44412959P07626L94762J88827L5763p8142j50680j97828k40922l02553l62099
1278.8G44407713m84287o20306p51614q94845j018703j183510j341820j274228j003086
1297.2G35835314r11713j160562j058340Q2076J262068J302004O65188K56836J04189
1315.6G36377060n0366q3386j72735n47528q86738q45075m79221p6115k17557j032532
$$ plain form
1336 731985807 730130970 728325367 727112830 725665271 723338246 720280111 716770768 712712348 707754433
1354.3 707754433 702558458 698943734 697458684 696888506 695797503 692333639 683883786 667575419
1370.6 667575419 640982747 613524556 609620869 633499265 665765882 690276802 704148293
1384.9 704148293 710650086 713522732 714596987 713849008 711968780 710411012 709336340 708522797 707208037
1403.3 707208037 705098450 703096926 701097429 698675692 696173549 693458140 689829588 686129332
1419.6 686129332 683953822 681795895 678670347 674380362 667821825 659916103 652496338 645968735
1435.9 645968735 641950905 639554501 634975731 626954794 615651011 602218330 590137601 579770625
1452.2 579770625 568192840 545710206 496356070 440276831 415998012 446502984 498004377
$$ packed form
1336G31985807j854837j805603j212537j447559k327025l058135l509343m058420m957915
1354.3G07754433n195975l614724j485050n70178j091003l463864q449853j6308367
1370.6F67575419k6592672k7458191l903687K3878396L2266617K4510920J3871491
1384.9G04148293O501793K872646J074255p47979j880228j557768j074672q13543j314760
1403.3G07208037k109587k001524j999497k421737k502143k715409l628552l700256
1419.6F86129332k175510k157927l125548m289985o558537p905722p419765o527603
1435.9F45968735m017830k396404m578770q020937j1303783j3432681j2080729j0366976
1452.2E79770625j1577785k2482634m9354136n6079239k4278819L0504972N1501393
$$ plain form
1466.5 498004377 518786013 505076945 489902467 538015068 619314015 671252847 692468941
1480.8 692468941 701780856 706692755 709043145 710468650 713056743 716237366 718120217 719237387
1497.1 719237387 721443653 724230111 725713313 724487364 722864568 725725412 729324400 731175303
1513.4 731175303 731435239 731382608 731477022 731498241 732718647 734414399 735962391 737353742 737603009
1531.8 737603009 737363279 737979889 737370968 734567046 734371245 737059116 739689767 741143882 741541624
1550.1 741541624 741627634 741272271 739761591 736937463 737812877 741390288 743297756 743651688 743130624
1568.5 743130624 743088424 743971348 743655324 742583871 743344724 744505286 744810164 744754255 744709969 744663835
1588.9 744663835 744598746 744444489 744259298 744215310 744187832 743968904 743816733 743895352 743924677 743984520 744327366
$$ packed form
1466.5D98004377K0781636j3709068j5174478M8112601Q1298947N1938832K1216094
1480.8F92468941R311915M911899K350390J425505K588093L180623J882851J117170
1497.1G19237387K206266K786458J483202j225949j622796K860844L598988J850903
1513.4G31175303K59936n2631R4414K1219J220406J695752J547992J391351K49267
1531.8G37603009k39730O16610o08921k803922j95801K687871K630651J454115L97742
1550.1G41541624Q6010l55363j510680k824128Q75414L577411J907468L53932n21064
1568.5G43130624m2200Q82924l16024j071453P60853J160562L04878n5909m4286m6134
1588.9G44663835o5089j54257j85191m3988k7478k18928j52171P8619K9325N9843L42846
$$ plain form
1611.3 744327366 744365036 743275046 742430270 743168592 743382096 742753386 742763698 743143439 743646979 743936539
1631.7 743936539 742642999 740367830 740759134 742671192 743849099 743641973 742022812 741788626 742995620
1650.1 742995620 741927505 741060376 743964791 746176362 746333003 745482445 745417416 745568097 744350612
1668.4 744350612 743269444 743628800 743669808 743583858 743811965 743149579 740875602 739175797 740692377
1686.8 740692377 742517889 743544221 743737459 742276549 740433037 739567399 739739060 740952849 741629422
1705.1 741629422 742095828 742853224 742923856 741820335 739654839 737927020 738877237 740655124 741388023
1723.5 741388023 741433740 741038442 740057409 738619804 737023711 737339199 738577545 739010036 739618003
1741.9 739618003 740850151 741909027 742460191 743191838 744979560 746804595 747549891 747771561 747895718
$$ packed form
1611.3G44327366L7670j089990q44776P38322K13504o28710J0312L79741N03540K89560
1631.7G43936539j293540k275169L91304J912058J177907k07126j619161k34186J206994
1650.1G42995620j068115q67129K904415K211571J56641q50558o5029J50681j217485
1668.4G44350612j081168L59356M1008q5950K28107o62386k273977j699805J516580
1686.8G40692377J825512J026332J93238j460910j843512q65638J71661J213789O76573
1705.1G41629422M66406P57396P0632j103521k165496j727819R50217J777887P32899
1723.5G41388023M5717l95298r81033j437605j596093L15488J238346M32491O07967
1741.9G39618003J232148J058876N51164P31647J787722J825035P45296K21670J24157
$$ plain form
1760.2 747895718 748117805 748959839 749475598 749048412 748133540 747732699 748891115 750377715 750913024
1778.6 750913024 750887811 751051247 751296282 751469791 751172900 749897897 748900652 749392331 750040233 750029445
1799 750029445 750053465 750778735 751650512 751984239 751809061 751730323 752106905 752419293 752424419 752479494 752546787
1821.4 752546787 752304137 752073526 752031684 751968026 752570629 753536999 753940284 754048228 754144430 753685474
1841.8 753685474 752714038 752671182 753543854 754224658 754525185 754621565 754626989 754558384 754496932 754471958 754228055
1864.2 754228055 753427982 752547801 752768815 753665745 754140139 754171610 754078448 753941655 753748834 753427744
1884.6 753427744 752787292 751792133 751106381 750925183 750764728 750787258 751119196 751502514 751815021 752019703
1905 752019703 752058983 752066672 752310514 752668738 752694666 752341330 752214491 752369642 752553225 752913892 753203928
$$ packed form
1760.2G47895718K22087Q42034N15759m27186r14872m00841J158416J486600N35309
1778.6G50913024k5213J63436K45035J73509k96891j275003r97245M91679O47902j0788
1799G50029445K4020P25270Q71777L33727j75178p8738L76582L12388N126N5075O7293
1821.4G52546787k42650k30611m1842o3658O02603R66370M03285J07944R6202m58956
1841.8G53685474r71436m2856Q72672O80804L00527R6380N424o8605o1452k4974k43903
1864.2G54228055q00073q80181K21014Q96930M74394L1471r3162j36793j92821l21090
1884.6G53427744o40452r95159o85752j81198j60455K2530L31938L83318L12507K04682
1905G52019703L9280P689K43842L58224K5928l53336j26839J55151J83583L60667K90036
$$ plain form
1927.5 753203928 753259599 753264427 753280282 753303647 753267705 752996504 752543449 752455115 752798498 753104627 753270268
1949.9 753270268 753319979 753250957 753163934 753126800 753116190 753090560 752954483 752740741 752758026 753026307 753221095
1972.3 753221095 753250420 753211677 753197253 753218412 753204584 753132105 753008962 752834380 752587318 752465248 752598464
1994.8 752598464 752668738 752567649 752439976 752246499 751944304 751581013 751126647 750496507 749696910 748879671
2015.2 748879671 748350978 748302817 748556733 748907626 749309123 749701440 750039935 750301957 750478685 750614941
2035.6 750614941 750741124 750847757 750971317 751157880 751336634 751445770 751523197 751605690 751682401 751728714
2056 751728714 751739323 751751304 751760602 751721501 751717091 751803160 751877308 751882613 751866400 751870811 751902103 751955092 751984000
2082.5 751984000 751937151 751846194 751789272 751776338 751771867 751778781 751805961 751808763 751772642 751759171 751776516 751756251
$$ packed form
1927.5G53203928N5671M828J5855K3365l5942k71201m53055q8334L43383L06129J65641
1949.9G53270268M9711o9022q7023l7134j0610k5630j36077k13742J7285K68281J94788
1972.3G53221095K9325l8743j4424K1159j3828p2479j23143j74582k47062j22070J33216
1994.8G52598464P0274j01089j27673j93477l02195l63291m54366o30140p99597q17239
2015.2G48879671n28693m8161K53916L50893M01497L92317L38495K62022J76728J36256
2035.6G50614941J26183J06633J23560J86563J78754J09136P7427Q2493P6711M6313
2056G51728714J0609J1981R298l9101m410Q6069P4148N305j6213M411L1292N2989K8908
2082.5G51984000m6849r0957n6922j2934m471O914K7180K802l6121j3471J7345k0265
$$ plain form
2106.9 751756251 751692951 751657486 751631796 751570821 751522720 751481473 751382828 751239300 751100659 750974298 750837505
2129.4 750837505 750696361 750553668 750393093 750260115 750175118 750088513 749996781 749930799 749877691 749813676 749774575
2151.8 749774575 749779761 749791801 749804318 749828219 749869108 749921441 749945223 749942839 749957740 749946117 749879956 749847889
2176.3 749847889 749852538 749802291 749717236 749653339 749595225 749548435 749527574 749510884 749481797 749451280 749444366 749454260
2200.8 749454260 749469101 749482393 749458015 749406457 749375463 749339163 749264896 749184370 749128103 749080181 749028802
2223.2 749028802 748996675 748974741 748948097 748905778 748779535 748517036 748169184 747847259 747643888 747602522
2243.6 747602522 747691095 747788131 747789681 747731864 747712851 747723222 747676373 747578859 747498810 747418225 747269392
2266 747269392 747055709 746807754 746522725 746310174 746292949 746360421 746392787 746377647 746280193 746141672 746037602
$$ packed form
2106.9G51756251o3300l5465k5690o0975m8101m1247r8645j43528j38641j26361j36793
2129.4G50837505j41144j42693j60575j32978q4997q6605r1732o5982n3108o4015l9101
2151.8G49774575N186J2040J2517K3901M0889N2333K3782k384J4901j1623o6161l2067
2176.3G49847889M649n0247q5055o3897n8114m6790k0861j6690k9087l0517o914R894
2200.8G49454260J4841J3292k4378n1558l0994l6300p4267q0526n6267m7922n1379
2223.2G49028802l2127k1934k6644m2319j26243k62499l47852l21925k03371m1366
2243.6G47602522Q8573R7036J550n7817j9013J0371m6849r7514q0049q0585j48833
2266G47269392k13683k47955k85029k12551j7225O7472L2366j5140r7454j38521j04070
$$ plain form
2288.5 746037602 745932937 745783448 745598435 745399058 745222986 745048463 744818985 744539678 744225681 743893266
2308.9 743893266 743571341 743248522 742851436 742350042 741794169 741170943 740537167 740113795 739880204 739615977
2329.3 739615977 739376128 739291787 739183366 738922775 738642395 738422334 738223612 738343060 739151120 740167677
2349.7 740167677 740739763 740844905 740895987 741002858 741051614 741113544 741308868 741614759 741937697 742247045
2370.1 742247045 742620707 743048310 743481636 743931234 744338691 744648278 744899452 745092869 745186746 745187879
2390.4 745187879 745120466 745018601 744919300 744844913 744795799 744741321 744650126 744516253 744342506 744136989 743919253
2412.9 743919253 743732274 743634224 743659973 743800104 743975222 744118750 744280457 744473100 744604468 744680583
2433.3 744680583 744758725 744834661 744889021 744903862 744891226 744875789 744886041 744896770 744861245 744797826 744741499
$$ packed form
2288.5G46037602j04665j49489j85013j99377j76072j74523k29478k79307l13997l32415
2308.9G43893266l21925l22819l97086n01394n55873o23226o33776m23372k33591k64227
2329.3G39615977k39849q4341j08421k60591k80380k20061j98722J19448Q08060J016557
2349.7G40167677N72086J05142N1082J06871M8756O1930J95324L05891L22938L09348
2370.1G42247045L73662M27603M33326M49598M07457L09587K51174J93417R3877J133
2390.4G45187879o7413j01865r9301p4387m9114n4478r1195j33873j73747k05517k17736
2412.9G43919253j86979r8050K5749J40131J75118J43528J61707J92643J31368P6115
2433.3G44680583P8142P5936N4360J4841j2636j5437J0252J0729l5525o3419n6327
$$ plain form
2455.7 744741499 744711816 744682193 744606972 744482756 744285703 743941128 743494809 743154764 743045747 743057013
2476.1 743057013 743013322 742906392 742830396 742780387 742668033 742494047 742334127 742221057 742129862 742017925
2496.5 742017925 741864800 741677284 741456866 741217196 740996420 740778863 740527272 740241647 739941955 739628077
2516.9 739628077 739256322 738841653 738451421 738143563 738025606 738144040 738362849 738541424 738648176 738671422
2537.3 738671422 738574505 738294661 737811625 737230122 736750305 736498356 736429036 736401677 736275971 736053526
2557.7 736053526 735856175 735675573 735431194 735128701 734789610 734389722 733878076 733284175 732683778 732111931
2578.1 732111931 731627047 731277883 731030345 730811477 730622828 730441451 730161667 729781210 729390740 729037941
2598.5 729037941 728677511 728241026 727703214 727066219 726367474 725626349 724876344 724167168 723431826 722636104
$$ packed form
2455.7G44741499k9683k9623p5221j24216j97053l44575m46319l40045j09017J1266
2476.1G43057013m3691j06930p5996n0009j12354j73986j59920j13070r1195j11937
2496.5G42017925j53125j87516k20418k39670k20776k17557k51591k85625k99692l13878
2516.9G39628077l71755m14669l90232l07858j17957J18434K18809J78575J06752K3246
2537.3G38671422r6917k79844m83036n81503m79817k51949o9320k7359j25706k22445
2557.7G36053526j97351j80602k44379l02493l39091l99888n11646n93901o00397n71847
2578.1G32111931m84884l49164k47538k18868j88649j81377k79784l80457l90470l52799
2598.5G29037941l60430m36485n37812o36995o98745p41125p50005p09176p35342p95722
$$ plain form
2618.9 722636104 721857369 721088290 720267534 719370782 718479633 717770219 717322707 717144608 717229903 717487693
2639.3 717487693 717810869 718115628 718270242 718191803 717962503 717653036 717232764 716729641 716263294 715980470
2659.7 715980470 716001928 716316462 716784060 717300773 717846155 718378067 718843639 719249368 719601393 719881296
2680.1 719881296 720095038 720251977 720368266 720484078 720592439 720616221 720521748 720309973 719915390 719334662
2700.5 719334662 718654513 717944324 717280924 716651022 715948045 715104222 714103520 713027358 711972713
2718.8 711972713 711038888 710420489 710206747 710250795 710327446 710300207 710145056 709964454 709908783 709985077
2739.2 709985077 710138738 710314810 710407317 710396528 710322797 710094094 709618151 708958864 708187699 707329750
2759.6 707329750 706391752 705380976 704353988 703322232 702203870 700929821 699478745 697831810
$$ packed form
2618.9G22636104p78735p69079q20756q96752q91149p09414m47512j78099Q5295K57790
2639.3G17487693L23176L04759J54614p8439k29300l09467m20272n03123m66347k82824
2659.7G15980470K1458L14534M67598N16713N45382N31912M65572M05729L52025K79903
2680.1G19881296K13742J56939J16289J15812J08361K3782r4473k11775l94583n80728
2700.5G19334662o80149p10189o63400o29902p02977q43823j000702j076162j054645
2718.8G11972713r33825o18399k13742M4048P6651k7239j55151j80602n5671P6294
2739.2G09985077J53661J76072R2507j0789p3731k28703m75943o59287p71165q57949
2759.6G07329750r37998j010776j026988j031756j118362j274049j451076j646935
$$ plain form
2775.9 697831810 695958257 693820775 691395879 688679874 685660660 682369530 678932607 675494194
2792.2 675494194 672174215 669035614 665922225 662536085 658780277 654745698 650481164 646011829
2808.6 646011829 641361594 636406064 630910754 624687493 617589295 609382272 599651754 587857902
2824.9 587857902 573306024 554992497 531585991 502103865 467000306 427669913 383424222
2839.1 383424222 329607397 262134165 187255412 125435337 98521546 112133153 155365691
2853.4 155365691 213252589 273905605 328272671 370114297 398237854 416433692 429069072
2867.7 429069072 437372863 440098763 435894608 425045460 409842193 392874181 375507802 358206719
2884 358206719 341235787 324797750 308905989 293457568 278396994 263727427 249433175 235292524
$$ packed form
2775.9F97831810j873553k137482k424896k716005l019214l291130l436923l438413
2792.2F75494194l319979l138601l113389l386140l755808m034579m264534m469335
2808.6F46011829m650235m955530n495310o223261p098198q207023r730518j1793852
2824.9E87857902j4551878j8313527k3406506k9482126l5103559l9330393m4245691
2839.1C83424222n3816825o7473232p4878753o1820075k6913791J3611607M3232538
2853.4A55365691N7886898O0653016N4367066M1841626K8123557J8195838J2635380
2867.7D29069072Q303791K725900m204155j0849148j5203267j6968012j7366379j7301083
2884C58206719j6970932j6438037j5891761j5448421j5060574j4669567j4294252j4140651
$$ plain form
2900.3 235292524 220588341 204166815 184845328 161750838 135061696 107287958 83430097
2914.6 83430097 68437457 63882381 67911178 78265019 93990080 115076527 141977146 174900591
2930.9 174900591 212989569 254176289 295547694 333577693 364278376 384023070 391525745
2945.2 391525745 390539318 390064061 398329258 414916217 431625992 442142487 448723704 459223330
2961.5 459223330 478831232 506268680 537369251 568592191 597282767 621799111 641778946
2975.8 641778946 657701552 670335531 680387139 688365221 694665790 699748576 704012990 707591057
2992.1 707591057 710519433 712922454 714957058 716688275 718163490 719498277 720749259 721873760
3008.4 721873760 722838759 723652601 724329233 724882364 725374818 725827932 726124823 726328313 726687193 727229357
$$ packed form
2900.3B35292524j4704183j6421526j9321487k3094490k6689142k7773738k3857861
2914.6H3430097j4992640m555076M028797J0353841J5725061K1086447K6900619L2923445
2930.9A74900591L8088978M1186720M1371405L8029999L0700683J9744694P502675
2945.2C91525745r86427m75257Q265197J6586959J6709775J0516495O581217J0499626
2961.5D59223330J9607902K7437448L1100571L1222940K8690576K4516344J9979835
2975.8F41778946J5922606J2633979J0051608P978082O300569N082786M264414L578067
2992.1G07591057K928376K403021K034604J731217J475215J334787J250982J124501
3008.4G21873760R64999Q13842O76632N53131M92454M53114K96891K03490L58880N42164
$$ plain form
3028.8 727229357 727820039 728482842 729310513 730203331 731083810 731924653 732648134 733317971 733974159 734604537
3049.2 734604537 735224962 735729694 736106396 736530244 736951411 737138331 737189591 737365961 737660587 737913609
3069.6 737913609 738016367 738038659 738111794 738219500 738316953 738444567 738661230 738971412 739357948 739859939
3090 739859939 740523934 741291463 742099583 742915571 743645370 744271636 744796693 745171905 745442212 745691955
3110.4 745691955 745918572 746065021 746148825 746206522 746245861 746348500 746491969 746519387 746460438 746393204 746300101
3132.8 746300101 746240199 746232390 746253252 746293664 746309578 746303022 746298671 746292472 746278048 746333480 746495724 746622503
3157.3 746622503 746667266 746713340 746729434 746681631 746636212 746619582 746610045 746593475 746543467 746465683 746444404 746510029
3181.8 746510029 746567130 746545434 746475518 746431530 746428728 746402025 746348083 746356785 746469617 746629894 746775329
$$ packed form
3028.8G27229357N90682O62803Q27671Q92818Q80479Q40843P23481O69837O56188O30378
3049.2G34604537O20425N04732L76702M23848M21167J86920N1260J76370K94626K53022
3069.6G37913609J02758K2292P3135J07706R7453J27614K16663L10182L86536N01991
3090G39859939O63995P67529Q08120Q15988P29799O26266N25057L75212K70307K49743
3110.4G45691955K26617J46449Q3804N7697L9339J02639J43469K7418n8949o7234r3103
3132.8G46300101n9902p809K0862M0412J5914o556m351o199j4424N5432J62244J26779
3157.3G46622503M4763M6074J6094m7803m5419j6630r537j6570n0008p7784k1279O5625
3181.8G46510029N7101k1696o9916m3988k802k6703n3942Q702J12832J60277J45435
$$ plain form
3204.2 746775329 746894240 746995270 747072101 747126698 747244000 747417510 747515559 747611284 747800767 747978628
3224.6 747978628 748073876 748120725 748207510 748371780 748526692 748609185 748649716 748669744 748664021 748659730 748671532
3247.1 748671532 748650849 748549402 748436034 748418987 748432338 748347223 748195827 748080254 748008847 747919977 747807384
3269.5 747807384 747675240 747501314 747363031 747322917 747317553 747284353 747185051 747003436 746817470 746724665 746694386
3291.9 746694386 746641815 746529698 746390462 746301353 746298075 746322513 746238232 746042132 745886207 745838284 745873988
3314.4 745873988 745926559 745949805 745956540 745894730 745717049 745543242 745501101 745515347 745488763 745453715 745465338
3336.8 745465338 745539188 745622754 745702982 745814741 745961607 746111631 746209681 746264338 746267378 746219099 746207476
3359.2 746207476 746241212 746261001 746269882 746345580 746471226 746532381 746522903 746555209 746684015 746817350 746873975
$$ packed form
3204.2G46775329J18911J01030P6831N4597J17302J73510R8049R5725J89483J77861
3224.6G47978628R5248M6849Q6785J64270J54912Q2493M0531K0028n723m291J1802
3247.1G48671532k0683j01447j13368j7047J3351q5115j51396j15573p1407q8870j12593
3269.5G47807384j32144j73926j38283m0114n364l3200r9302j81615j85966r2805l0279
3291.9G46694386n2571j12117j39236q9109l278K4438q4281j96100j55925m7923L5704
3314.4G45873988N2571K3246O735o1810j77681j73807m2141J4246k6584l5048J1623
3336.8G45465338P3850Q3566Q0228J11759J46866J50024R8050N4657L040m8279j1623
3359.2G46207476L3736J9789Q881P5698J25646O1155r478L2306J28806J33335N6625
$$ plain form
3381.7 746873975 746892452 746917725 746938467 746970356 747034252 747113585 747242749 747460544 747668386 747772992 747846723
3404.1 747846723 747991800 748197317 748353541 748439431 748549819 748689234 748764157 748790920 748905122 749063909
3424.5 749063909 749130964 749146163 749222159 749368489 749490142 749598444 749744236 749798834 749729991 749648809 749653161
3446.9 749653161 749851227 750093758 750226378 750327229 750380516 750373006 750393569 750522912 750693738 750786483
3467.3 750786483 750863135 750933886 750920832 750938058 751060843 751063466 750965476 751030266 751144171 751205266 751383424
3489.8 751383424 751597166 751572549 751393795 751329660 751281321 751092076 751042545 751208663 751244724 751248658 751457989
3512.2 751457989 751668274 751741171 751739323 751564980 751198053 750961900 750940561 750964046 751173019 751531184
3532.6 751531184 751658857 751615107 751713991 751722336 751314700 750726521 750549078 750872374 751103342 751166463
$$ packed form
3381.7G46873975J8477K5273K0742L1889O3896P9333J29164K17795K07842J04606P3731
3404.1G47846723J45077K05517J56224Q5890J10388J39415P4923K6763J14202J58787
3424.5G49063909O7055J5199P5996J46330J21653J08302J45792N4598o8843q1182M352
3446.9G49653161J98066K42531J32620J00851N3287p510K0563J29343J70826R2745
3467.3G50786483P6652P0751j3054J7226J22785K623r7990O4790J13905O1095J78158
3489.8G51383424K13742k4617j78754o4135m8339j89245m9531J66118L6061L934K09331
3512.2G51457989K10285P2897j848j74343l66927k36153k1339K3485K08973L58165
3532.6G51531184J27673m3750R8884Q345m07636n88179j77443L23296K30968O3121
$$ plain form
3553 751166463 751355946 751429319 751215875 750834167 750177383 749097705 748471022 749263704 750373065 750760972
3573.4 750760972 750653028 750516415 750452459 750314772 749796987 748610556 747550428 747740507 748014510
3591.7 748014510 747296333 746219516 745255470 744235039 743596017 743512094 743297040 742950380 743101060
3610.1 743101060 743525207 744012117 744443178 744471371 745023608 746430039 747268915 746581793 744891703
3628.5 744891703 744737267 745977163 746810257 747069180 746992052 746713936 746296704 745352924 743379891
3646.8 743379891 741563201 742503166 744866669 746135771 746632755 747530043 748255789 748401940 748216033
3665.2 748216033 747308731 745585561 744703054 744411290 743662655 744458973 746382594 747695863 748260260
3683.5 748260260 747967362 746538877 745161116 745670795 747101128 748009205 748153746 747719705 747316122
$$ packed form
3553G51166463J89483P3373k13444l81708o56784j079678o26683P92682J109361L87907
3573.4G50760972j07944j36613o3956j37687n17785j186431j060128J90079K74003
3591.7G48014510p18177j076817r64046j020431o39022q3923k15054l46660J50680
3610.1G43101060M24147M86910M31061K8193N52237J406431Q38876o87122j690090
3628.5G44891703j54436J239896Q33094K58923p7128k78116m17232r43780j973033
3646.8G43379891j816690R39965K363503J269102M96984Q97288P25746J46151j85907
3665.2G48216033r07302j723170q82507k91764p48635P96318J923621J313269N64397
3683.5G48260260k92898j428485j377761N09679J430333R08077J44541m34041m03583
$$ plain form
3701.9 747316122 747697294 748053432 747343004 745952368 745557308 746853828 748178601 748511910 748093247
3720.2 748093247 747557998 747402728 747725487 748173237 747793972 746124029 744449675 744567275 745950878
3738.6 745950878 746793866 745995820 744419456 744192421 744004786 743213415 743951976 745508909 746164382
3756.9 746164382 746187329 746679366 747245967 747060299 746556282 746284783 746706545 747639835 748042941 747529805
3777.3 747529805 746823430 746841192 747077167 747126460 747371495 747652948 747760713 747399390 746390343 745495260
3797.7 745495260 744597077 743670464 743958235 744386911 744606853 745427549 745889306 745073915 743661344
3816.1 743661344 742968142 742408156 742489398 743696570 744543791 744891942 744791985 744168580 743528306 742716670
3836.5 742716670 742061615 742600024 743736386 744740307 745481372 745499372 744105816 741538465 741104186
$$ packed form
3701.9G47316122L81172L56138p10428j390636l95060J296520J324773L33309m18663
3720.2G48093247n35249j55270L22759M47750l79265j669943j674354J17600J383603
3738.6G45950878Q42988p98046j576364k27035j87635p91371P38561J556933O55473
3756.9G46164382K2947M92037N66601j85668n04017k71499M21762R33290M03106n13136
3777.3G47529805p06375J7762K35975M9293K45035K81453J07765l61323j009047q95083
3797.7G45495260q98183r26613K87771M28676K19942Q20696M61757q15391j412571
3816.1G43661344o93202n59986Q1242J207172Q47221L48151r9957o23405o40274q11636
3836.5G42716670o55055N38409J136362J003921P41065J8000j393556k567351m34279
$$ plain form
3854.8 741104186 742992401 744305491 744294345 743422806 742895305 742861390 742199540 741662860 742216825 743190765
3875.2 743190765 743813694 743283749 742549777 742561877 742631257 743092239 743407071 743023813 743223608 743827939
3895.6 743827939 743452251 742230117 741294980 741237283 742252052 743673384 744471908 744551778 744285822
3914 744285822 743798554 743467629 743584514 743708193 743643343 743789911 743956864 743696213 743569314 744179726
3934.4 744179726 744934142 745196760 745030522 744786620 744789720 744803369 744622052 744681716 745050967 745299637
3954.8 745299637 745336235 745302677 745236337 745305240 745454311 745361626 745079339 744851351 744665265 744490266
3975.2 744490266 744482577 744565129 744577646 744644105 744813561 744910061 744902849 744917572 744943678 744978130 745020747
3997.6 745020747
$$ packed form
3854.8G41104186J888215J313090j1146q71539n27501l3915o61850n36680N53965R73940
3875.2G43190765O22929n29945p33972J2100O9380M60982L14832l83258J99795O04331
3895.6G43827939l75688j222134r35137n7697J014769J421332P98524P9870k65956
3914G44285822m87268l30925J16885J23679o4850J46568J66953k60651j26899O10412
3934.4G44179726P54416K62618j66238k43902L100J3649j81317N9664L69251K48670
3954.8G45299637L6598l3558o6340O8903J49071r2685k82287k27988j86086j74999
3975.2G44490266p689Q2552J2517O6459J69456R6500p212J4723K6106L4452M2617
3997.6G45020747
##END=$$ End of the data block
