##TITLE=PoliRio Aspero $$ Begin of the data block
##JCAMP-DX=5.00 $$ ACD/SpecManager v 10.08
##SPECTROMETER/DATA SYSTEM=Alpha
##DATE=14 Apr 2015 15:41:22
##DATA TYPE=INFRARED SPECTRUM
##DATA CLASS=XYDATA
##ORIGIN=
##OWNER=
##NPOINTS=1765
##FIRSTX=399.76428223
##LASTX=3997.64306641
##MAXX=3997.64306641
##MINX=399.76428223
##MAXY=0.87345052
##MINY=0.07302056
##XFACTOR=1.0000000000
##YFACTOR=1.000000000000000e-9
##FIRSTY=0.86645359
##DELTAX=2.03961372
##XUNITS=1/CM
##YUNITS=ARBITRARY UNITS
##XYDATA=(X++(Y..Y))
$$ plain form
399.8 866453588 866514504 866532326 866988420 867495000 867605448 867803097 868371725 868501306 867887020 868057191
420.2 868057191 869474590 871010065 871809840 871483266 870902658 871124744 871877193 872826517 873450518
438.5 873450518 872920036 871978164 871633291 871660113 871610701 871128082 870399535 869527578 868350506 867814004
458.9 867814004 867866397 867498696 866900027 866205692 865431607 864877462 864605665 864554584 864559770 864468098 864294589
481.3 864294589 864191890 864117086 864003658 863984942 863953412 863968670 864117086 864052296 863615096 863101184 862829387
503.8 862829387 862585604 862304091 862239957 862177908 861703992 860820889 859956682 859375775 858862579 858014882
524.2 858014882 856935024 856213510 855757654 855064809 854138851 853115380 852010071 851076007 850485444
542.5 850485444 850108683 849684119 849093199 848479211 847891629 847223878 846443892 845885932 845845819 845940769
$$ packed form
399.8H66453588O0916J7822M56094N06580J10448J97649N68628J29581o14286J70171
420.2H68057191J417399J535475P99775l26574n80608K22086P52449R49324O24001
438.5H73450518n30482r41872l44873K6822m9412m82619p28547q71957j177072n36502
458.9H67814004N2393l67701n98669o94335p74085n54145k71797n1081N186r1672j73509
481.3H64294589j02699p4804j13428j8716l1530J5258J48416o4790m37200n13912k71797
503.8H62829387k43783k81513o4134o2049m73916q83103q64207n80907n13196q47697
524.2H58014882j079858p21514m55856o92845r25958j023471j105309r34064n90563
542.5H50485444l76761m24564n90920o13988n87582o67751p79986n57960m0113R4950
$$ plain form
562.9 845940769 845780432 845648706 845865667 846080184 845782638 845232248 844974637 844884992 844695091 844494760
583.3 844494760 844317913 844079256 843735158 843376577 843170524 843071163 842944801 842718303 842446566 842240930
603.7 842240930 842093945 842019022 841948092 841702402 841344714 841085672 840927780 840855300 840874910 840794861 840492129
626.2 840492129 840173781 839961410 839669824 839303195 839133501 839325070 839726567 840018570 839983284 839742243
646.6 839742243 839501202 839159727 838680089 838253260 837881923 837340891 836698115 836283207 836149931 835708678
667 835708678 834676743 834081650 833797276 833454132 833123624 832781136 832258403 831626356 831042290 830475032
687.3 830475032 829813778 828968763 827958286 826743007 825260758 823565185 821601331 818937123 815134108
705.7 815134108 809846997 802582324 792280853 774750948 740721583 699751079 693439186 729717851
$$ packed form
562.9H45940769j60337j31726K16961K14517k97546n50390k57611q9645j89901k00331
583.3H44494760j76847k38657l44098l58581k06053r9361j26362k26498k71737k05636
603.7H42240930j46985p4923p0930k45690l57688k59042j57892p2480J9610q0049l02732
626.2H40492129l18348k12371k91586l66629j69694J91569M01497K92003l5286k41041
646.6H39742243k41041l41475m79638m26829l71337n41032o42776m14908j33276m41253
667H35708678j031935n95093k84374l43144l30508l42488n22733o32047n84066n67258
687.3H30475032o61254q45015j010477j215279j482249j695573j963854k664208l803015
705.7H15134108n287111p264673j0301471j7529905l4029365m0970504o311893L6278665
$$ plain form
722 729717851 761491358 758906722 729788959 713978708 745149970 795081079 823731720 832541943
738.3 832541943 834916651 835679054 835897267 835832834 835753322 835700691 835578084 835419118 835234404 834871829
758.7 834871829 834411383 834046841 833831787 833697140 833504975 833208084 832915366 832619727 832201540 831805289
779.1 831805289 831505775 831053019 830436409 829909384 829444051 828889549 828311861 827885568 827728629 827793956
799.5 827793956 827896357 828016043 828277528 828516006 828621864 828807592 828996122 828999043 828968883 828991354
819.9 828991354 828948736 828761756 828473449 828177333 827878714 827599704 827377737 827047467 826473773 825849950
840.3 825849950 825424910 825172246 824887514 824557006 824295878 824093163 823819697 823371410 822906077 822528303
860.7 822528303 822061241 821317852 820081174 818003058 815021753 811959088 810042679 809948385 811401188
$$ packed form
722G29717851L1773507k584636k9117763j5810251L1171262M9931109K8650641Q810223
738.3H32541943K374708P62403K18213o4433p9512n2631j22607j58966j84714l62575
758.7H34871829m60446l64542k15054j34647j92165k96891k92718k95639m18187l96251
779.1H31805289k99514m52756o16610n27025m65333n54502n77688m26293j56939O5327
799.5H27793956J02401J19686K61485K38478J05858J85728J88530K921l0160K2471
819.9H28991354m2618j86980k88307k96116k98619k79010k21967l30270n73694o23823
840.3H25849950m25040k52664k84732l30508k61128k02715k73466m48287m65333l77774
860.7H22528303m67062p43389j236678k078116k981305l062665j916409r4294J452803
$$ plain form
879.1 811401188 813383818 815380096 817562342 819525123 820625663 820937812 820865512 820576251 820146441
897.4 820146441 819690764 819138646 818322778 817335010 816724420 817010820 817968786 818935990 819556355 819881499
917.8 819881499 820070207 820160031 820157886 820134819 820077181 819980204 819859624 819657087 819396853 819178462 819037020
940.3 819037020 818886101 818611979 818260849 817970097 817750156 817515016 817198277 816813648 816430032 816056848
960.7 816056848 815664947 815307498 815018356 814678490 814293861 814078212 814106405 814214528 814259768 814223111
981.1 814223111 814049184 813671887 813147724 812616706 812190950 811883688 811630547 811411798 811291754 811285257
1001.4 811285257 811268926 811122417 810866296 810571969 810258925 809925199 809601486 809321940 809125781 809011400
1021.8 809011400 808919311 808799028 808630347 808434963 808255374 808108628 807932079 807723820 807518244 807273448
$$ packed form
879.1H11401188J982630J996278K182246J962781J100540L12149p2300k89261m29810
897.4H20146441m55677n52118q15868r87768o10590K86400R57966R67204O20365L25144
917.8H19881499J88708Q9824k145k3067n7638r6977j20580k02537k60234k18391j41442
940.3H19037020j50919k74122l51130k90752k19941k35140l16739l84629l83616l73184
960.7H16056848l91901l57449k89142l39866l84629k15649K8193J08123M5240l6657
981.1H14223111j73927l77297n24163n31018m25756l07262k53141k18749j20044o497
1001.4H11285257j6331j46509k56121k94327l13044l33726l23713k79546j96159j14381
1021.8H09011400r2089j20283j68681j95384j79589j46746j76549k08259k05576k44796
$$ plain form
1042.2 807273448 807019532 806725562 806279540 805908978 805877328 805921793 805787921 805568039 805313826 805025756
1062.6 805025756 804774821 804553211 804279506 803955436 803573787 803104818 802636862 802310348 802167833 802168429
1083 802168429 802188873 802119017 802016795 801982582 801984251 801890492 801695585 801507890 801345110 801185966 801039696
1105.5 801039696 800839067 800528944 800148129 799708664 799277186 799032331 799063981 799235761 799378812 799448013
1125.9 799448013 799430251 799357533 799310565 799245298 799062133 798815310 798571706 798324764 798079729 797817528
1146.3 797817528 797526956 797238111 796944499 796646714 796401799 796194255 795974433 795737267 795490444 795287907
1166.7 795287907 795198798 795192838 795027614 794622242 794365466 794447005 794568658 794523716 794361413 794181347
1187.1 794181347 794017196 793865025 793770671 793686271 793496490 793231785 792968631 792695582 792405188 792148769
$$ packed form
1042.2H07273448k53916k93970m46022l70562l1650M4465j33872k19882k54213k88070
1062.6H05025756k50935k21610k73705l24070l81649m68969m67956l26514j42515N96
1083H02168429K0444o9856j02222l4213J669r3759j94907j87695j62780j59144j46270
1105.5H01039696k00629l10123l80815m39465m31478k44855L1650J71780J43051O9201
1125.9G99448013j7762p2718m6968o5267j83165k46823k43604k46942k45035k62201
1146.3G97817528k90572k88845k93612k97785k44915k07544k19822k37166k46823k02537
1166.7G95287907q9109n960j65224m05372k56776Q1539J21653m4942j62303j80066
1187.1G94181347j64151j52171r4354q4400j89781k64705k63154k73049k90394k56419
$$ plain form
1207.5 792148769 791943431 791776001 791605532 791373134 791105211 790830851 790543139 790259302 789978802 789709508
1227.9 789709508 789447427 789136291 788785219 788469732 788211703 787970364 787708342 787402630 787056148 786698282
1248.2 786698282 786355078 786064446 785813570 785553277 785268962 784971476 784676015 784373641 784062028 783744216
1268.6 783744216 783401370 783062756 782745540 782396495 782008469 781599224 781178296 780730069 780187666 779559076
1289 779559076 778914154 778214455 777468264 776804149 776257694 775810003 775462329 775217116 775072336 775021970
1309.4 775021970 775017202 775059640 775130153 775119245 775105119 775128305 775014102 774712384 774315298 773897707 773473561
1331.9 773473561 772890329 771915317 770503044 769165456 768361330 767592490 766427577 765061557 763849974
1350.2 763849974 762954891 762272179 761619627 760733902 759210229 757134497 755448461 754340112 753629625
$$ packed form
1207.5G92148769k05338j67430j70469k32398k67923k74360k87712k83837k80500k69294
1227.9G89709508k62081l11136l51072l15487k58029k41339k62022l05712l46482l57866
1248.2G86698282l43204k90632k50876k60293k84315k97486k95461l02374l11613l17812
1268.6G83744216l42846l38614l17216l49045l88026m09245m20928m48227n42403o28590
1289G79559076o44922o99699p46191o64115n46455m47691l47674k45213j44780n0366
1309.4G75021970m768M2438P0513j0908j4126K3186j14203l01718l97086m17591m24146
1331.9G73473561n83232r75012j412273j337588q04126p68840j164913j366020j211583
1350.2G63849974q95083o82712o52552q85725j523673k075732j686036j108349p10487
$$ plain form
1368.6 753629625 753427505 752889097 751788855 751834273 753645480 756014287 757629991 757895231 757021368
1386.9 757021368 756013751 755223632 753712296 751508236 749689698 748359263 747331977 746005177
1403.3 746005177 744058669 742248833 740546167 738596678 736683846 734713972 732046664 729273975
1419.6 729273975 727821469 726582766 724850655 722648919 719690919 716948807 714681268 711879671
1435.9 711879671 709692895 709073305 708350003 706964135 704783022 701491475 697199345 691312373 682496727
1454.3 682496727 663323641 619853377 569911838 547789216 571139157 608267248 616977096
1468.5 616977096 595907569 577659905 621094644 692217588 734065950 748677373 753916860
1482.8 753916860 756307662 757062256 757176518 758357227 760328829 761296868 761384368 762379289 764215529
$$ packed form
1368.6G53629625k02120n38408j100242M5418J811207K368807J615704K65240q73863
1386.9G57021368j007617p90119j511336k204060j818538j330435j027286j326800
1403.3G46005177j946508j809836j702666j949489j912832j969874k667308k772689
1419.6G29273975j452506j238703j732111k201736k958000k742112k267539k801597
1435.9G11879671k186776o19590p23302j385868k181113l291547m292130n886972q815646
1454.3F82496727j9173086m3470264m9941539k2122622K3349941L7128091Q709848
1468.5F16977096k1069527j8247664M3434739P1122944M1848362J4611423N239487
1482.8G53916860K390802P54594J14262J180709J971602R68039Q7500R94921J836240
$$ plain form
1501.2 764215529 765304208 764225423 762486577 764183223 766654134 767935157 767990649 767666638 767389297
1519.5 767389297 766985953 767718494 769011140 770098984 771096230 771150708 770718575 771238387 770872235
1537.9 770872235 768312395 767703772 769704163 771793067 773026407 773370445 773405910 773184478 772078335
1556.2 772078335 769337296 769283772 772098303 773639023 773843646 773229837 772887349 773529291 773225546
1574.6 773225546 772097409 772656620 773719370 773995221 773874164 773744643 773637533 773511708 773307025
1593 773307025 773082435 772936761 772757649 772459984 772279322 772339463 772436500 772575140 772965729 773167610
1613.4 773167610 772234976 771230996 771831453 772176325 771643877 771595120 771867752 772253811 772660196 771729946
1633.7 771729946 769605756 769723654 771322191 772329509 772209346 770696342 770175993 771139264 769853830
$$ packed form
1501.2G64215529J088679j078785j738846J696646K470911J281023N5492l24011k77341
1519.5G67389297m03344P32541J292646J087844R97246N4478m32133N19812l66152
1537.9G70872235k559840o08623K000391K088904J233340L44038L5465k21432j106143
1556.2G72078335k741039n3524K814531J540720K04623o13809l42488O41942l03745
1574.6G73225546j128137N59211J062750K75851j21057j29521j07110j25825k04683
1593G73307025k24590j45674j79112k97665j80662O0141R7037J38640L90589K01881
1613.4G73167610r32634j003980O00457L44872n32448m8757K72632L86059M06385r30250
1633.7G71729946k124190J17898J598537J007318j20163j513004n20349R63271j285434
$$ plain form
1652.1 769853830 768066823 770129979 771982372 772021353 771121502 771029055 771402597 770529091 769457281
1670.5 769457281 769606411 769409895 768979907 769009769 768417180 766120791 763652682 764344752 765849888
1688.8 765849888 766861379 767444789 766746819 765732467 765358150 765644312 766969025 767804503 768312395
1707.2 768312395 769142807 769529521 769029379 767512023 765880346 766375840 767885089 768637478 768865585
1725.5 768865585 768846214 768451869 767564535 766019940 765981972 767078042 767355680 767449915 767887592 768144310
1745.9 768144310 767982543 767775357 768440366 769519508 769885898 769867778 769795179 769690335 770180821 770526886
1766.3 770526886 770100713 769154072 768304348 768799663 769900739 770285845 770122111 770062387 770011008 769936621
1786.7 769936621 769656539 768484235 767275095 767474174 768039286 767998695 767848849 768225431 768784463
$$ packed form
1652.1G69853830j787007K063156J852393L8981q99851r2447L73542q73506j071810
1670.5G69457281J49130j96516m29988K9862n92589k296389k468109O92070J505136
1688.8G65849888J011491N83410o97970j014352l74317K86162J324713Q35478N07892
1707.2G68312395Q30412L86714n00142j517356j631677M95494J509249P52389K28107
1725.5G68865585j9371l94345q87334j544595l7968J096070K77638R4235M37677K56718
1745.9G68144310j61767k07186O65009J079142L66390j8120p2599j04844M90486L46065
1766.3G70526886m26173r46641q49724M95315J101076L85106j63734n9724n1379p4387
1786.7G69936621k80082j172304j209140J99079N65112m0591j49846L76582N59032
$$ plain form
1805.1 768784463 768998086 768791318 768546939 768660247 768802822 768696189 768617392 768615246 768343806 767997205
1825.5 767997205 767808795 767525673 767810643 768524170 768699884 768571436 768609941 768301129 767312646 766909659
1845.9 766909659 767399549 767810047 767939329 767913699 767780602 767557144 767346561 767207325 767018497 766426682
1866.3 766426682 765486777 765285373 765882075 766232073 766161084 765990674 765761673 765455663 765146196 764738321
1886.7 764738321 764001787 763353407 763108909 762919247 762857497 763018489 763158143 763199508 763217628 763166547
1907.1 763166547 763030171 763015151 763162494 763120353 762713313 762464046 762484133 762456656 762563765 762705386
1927.5 762705386 762665093 762552202 762454629 762379110 762291789 762048066 761546016 761226475 761326671 761460364
1947.9 761460364 761466265 761386693 761254966 761113703 760958672 760779202 760641515 760502398 760248542 760092378
$$ packed form
1805.1G68784463K13623k06768k44379J13308J42575j06633p8797k146k71440l46601
1825.5G67997205j88410k83122K84970P13527J75714j28448L8505l08812r88483m02987
1845.9G66909659M89890M10498J29282k5630j33097k23458k10583j39236j88828n91815
1866.3G66426682r39905k01404N96702L49998p0989j70410k29001l06010l09467m07875
1886.7G64738321p36534o48380k44498j89662o1750J60992J39654M1365J8120n1081
1907.1G63166547j36376j5020J47343m2141m07040k49267K0087k7477J07109J41621
1927.5G62705386m0293j12891r7573p5519q7321k43723n02050l19541J00196J33693
1947.9G61460364N901p9572j31727j41263j55031j79470j37687j39117k53856j56164
$$ plain form
1968.3 760092378 760186613 760278106 760215104 760068536 759905517 759768069 759669960 759557903 759377956 759143829
1988.7 759143829 758824289 758561194 758545458 758545339 758392453 758193433 757946908 757607400 757225573 756806970
2009 756806970 756306410 755704522 755016804 754470110 754335523 754488885 754706323 754938364 755122602 755223155
2029.4 755223155 755277991 755314112 755318344 755302370 755299270 755293846 755262554 755195022 755116463 755062521 755022943 754964888
2053.9 754964888 754890680 754808843 754729688 754674315 754588902 754474640 754401147 754332304 754227281 754121363 754035175
2076.4 754035175 753934860 753809571 753702343 753615677 753525317 753409863 753268659 753139198 753021777 752910614
2096.8 752910614 752819657 752754271 752693951 752572954 752389312 752231240 752120137 752015889 751910448 751805246
2117.1 751805246 751689255 751530230 751330853 751136243 750945449 750749052 750571787 750417411 750256360 750084519
$$ packed form
1968.3G60092378R4235R1493o3002j46568j63019j37448r8109j12057j79947k34127
1988.7G59143829l19540k63095j5736j19j52886j99020k46525l39508l81827m18603
2009G56806970n00560o01888o87718n46694j34587J53362K17438K32041J84238J00553
2029.4G55223155N4836L6121M232j5974l100n424l1292o7532p8559n3942l9578n8055
2053.9G54964888p4208q1837p9155n5373q5413j14262p3493o8843j05023j05918q6188
2076.4G54035175j00315j25289j07228q6666r0360j15454j41204j29461j17421j11163
2096.8G52910614r0957o5386o0320j20997j83642j58072j11103j04248j05441j05202
2117.1G51805246j15991j59025j99377j94610j90794j96397j77265j54376j61051j71841
$$ plain form
2137.5 750084519 749896109 749672294 749436855 749248147 749106228 748960495 748855054 748813868 748759985 748688161
2157.9 748688161 748618901 748538792 748459578 748397887 748332083 748232603 748122036 748009384 747877061 747743487 747607231
2180.4 747607231 747450531 747293293 747156799 747038424 746927381 746820211 746732354 746659577 746557176 746398807
2200.8 746398807 746221185 746086061 745995879 745885313 745732665 745589793 745473623 745342851 745178401 745016456
2221.2 745016456 744891882 744810879 744763136 744683266 744497478 744230807 743967891 743712068 743417919 743158281
2241.6 743158281 743038893 743020892 742988288 742892027 742792904 742720544 742628455 742525578 742412329 742260456 742071629
2264 742071629 741834342 741552532 741270721 741011083 740784943 740653992 740599155 740509033 740358412 740201473
2284.4 740201473 740087330 740015566 739929020 739778578 739601135 739454031 739330530 739204407 739037514 738848150
$$ packed form
2137.5G50084519j88410k23815k35439j88708j41919j45733j05441m1186n3883p1824
2157.9G48688161o9260q0109p9214o1691o5804r9480j10567j12652j32323j33574j36256
2180.4G47607231j56700j57238j36494j18375j11043j07170q7857p2777j02401j58369
2200.8G46398807j77622j35124r0182j10566j52648j42872j16170j30772j64450j61945
2221.2G45016456j24574q1003m7743p9870j85788k66671k62916k55823k94149k59638
2241.6G43158281j19388j8001l2604r6261r9123p2360r2089j02877j13249j51873j88827
2264G42071629k37287k81810k81811k59638k26140j30951n4837r0122j50621j56939
2284.4G40201473j14143p1764q6546j50442j77443j47104j23501j26123j66893j89364
$$ plain form
2304.8 738848150 738705218 738539577 738276064 738000154 737755239 737499475 737210035 736871541 736494660 736151814
2325.2 736151814 735873044 735599279 735357046 735220790 735128045 734982848 734759092 734474123 734031796 733732164
2345.6 733732164 734334528 735498905 736307681 736540496 736506045 736336470 736124814 735826671 735488653 735300720
2366 735300720 735222578 735130548 734999180 734887064 734889567 735004842 735126257 735189617 735169649 735071123 734937906
2388.4 734937906 734807253 734717190 734631598 734490156 734324217 734156430 733980179 733801246 733621418 733417690
2408.8 733417690 733178556 732951701 732792616 732690275 732601523 732539117 732531488 732568085 732598126 732560754 732456386
2431.2 732456386 732351899 732299149 732238829 732110262 731998384 731923521 731803477 731669068 731535733 731363952
2451.6 731363952 731176496 730986655 730808854 730655015 730484784 730278373 730046570 729744077 729365051 729064822
$$ packed form
2304.8G38848150j42932j65641k63513k75910k44915k55764k89440l38494l76881l42846
2325.2G36151814k78770k73765k42233j36256r2745j45197k23756k84969m42327k99632
2345.6G33732164O02364J164377Q08776K32815l4451j69575k11656k98143l38018j87933
2366G35300720p8142r2030j31368j12116K503J15275J21415O3360j9968r8526j33217
2388.4G34937906j30653r0063q5592j41442j65939j67787j76251j78933j79828k03728
2408.8G33417690k39134k26855j59085j02341q8752o2406p629L6597L0041l7372j04368
2431.2G32456386j04487n2750o0320j28567j11878p4863j20044j34409j33335j71781
2451.6G31363952j87456j89841j77801j53839j70231k06411k31803l02493l79026l00229
$$ plain form
2472 729064822 728952348 728921771 728813171 728626251 728452981 728268504 728032887 727804899 727606118 727374732
2492.4 727374732 727108955 726888359 726692736 726469040 726249337 726045191 725832939 725584745 725303352 725035489
2512.8 725035489 724796414 724506021 724130332 723799944 723587871 723454356 723372042 723324418 723319411 723361909
2533.2 723361909 723410189 723409712 723276973 722952187 722536743 722164512 721884727 721693933 721547008 721433580
2553.6 721433580 721317708 721155941 720977306 720766902 720497429 720214307 719908059 719570100 719296277 719056308
2574 719056308 718743205 718366265 717976749 717614412 717277229 716937542 716587722 716199219 715768278 715354383
2594.4 715354383 714968622 714594960 714255214 713921547 713520348 713065624 712621510 712170839 711665392 711100459
2614.8 711100459 710484743 709841907 709220469 708619237 708000898 707359433 706710160 706077933 705551028 705280602
$$ packed form
2472G29064822j12474l0577j08600j86920j73270j84477k35617k27988j98781k31386
2492.4G27374732k65777k20596j95623k23696k19703k04146k12252k48194k81393k67863
2512.8G25035489k39075k90393l75689l30388k12073j33515q2314m7624n007M2498
2533.2G23361909M8280m77j32739l24786m15444l72231k79785j90794j46925j13428
2553.6G21433580j15872j61767j78635k10404k69473k83122l06248l37959k73823k39969
2574G19056308l13103l76940l89516l62337l37183l39687l49820l88503m30941m13895
2594.4G15354383l85761l73662l39746l33667m01199m54724m44114m50671n05447n64933
2614.8G11100459o15716o42836o21438o01232o18339o41465o49273o32227n26905k70426
$$ plain form
2635.2 705280602 705283940 705388665 705446959 705443203 705404520 705333948 705181479 704918385 704612553 704315841 704037964
2657.6 704037964 703818202 703697741 703700662 703812778 703984559 704192519 704406083 704607487 704794407 704895020
2678 704895020 704861939 704767346 704688787 704606295 704509497 704384565 704180002 703924775 703632355 703262985 702803493
2700.5 702803493 702278316 701802611 701419711 701016426 700565934 700127363 699686050 699225068 698763549 698275805
2720.9 698275805 697726130 697136641 696555436 696004450 695472956 694955647 694446027 693948150 693505645 693149447
2741.2 693149447 692860484 692601264 692318916 691943824 691453218 690854847 690146327 689368725 688569844 687740445
2761.6 687740445 686894596 686044455 685116768 684077382 682964504 681790113 680520952 679077327 677453756
2780 677453756 675745189 673921347 671888769 669674397 667336404 664952517 662621498 660326719 657978714
$$ packed form
2635.2G05280602L338J04725N8294l756l8683p0572j52469k63094l05832k96712k77877
2657.6G04037964k19762j20461K921J12116J71781K07960K13564K01404J86920J00613
2678G04895020l3081r4593p8559q2492r6798j24932k04563k55227k92420l69370m59492
2700.5G02803493n25177m75705l82900m03285m50492m38571m41313m60982m61519m87744
2720.9F98275805n49675n89489n81205n50986n31494n17309n09620m97877m42505l56198
2741.2F93149447k88963k59220k82348l75092m90606n98371p08520p77602p98881q29399
2761.6F87740445q45849q50141r27687j039386j112878j174391j269161j443625j623571
2780F77453756j708567j823842k032578k214372k337993k383887k331019k294779k348005
$$ plain form
2798.4 657978714 655540645 652975976 650246739 647358537 644266486 640898645 637232840 633211732
2814.7 633211732 628713727 623627782 617875636 611300886 603617609 594493568 583488703 569961846
2831 569961846 552934289 530720592 500704050 458948940 400274664 321811169 231682166 156209067
2847.3 156209067 127739623 156184763 222090885 299457967 372669756 434652299 482300729
2861.6 482300729 515486538 536226153 547209740 550725222 548313022 540820479 528796196 513041973
2877.9 513041973 494794577 475458562 456080884 437206864 419094294 401809007 385361195
2892.2 385361195 369814366 355172098 341160625 327053219 311539859 292685419 268167168
2906.5 268167168 235957697 195454642 149752274 107705534 80379620 73020555 83149612
$$ packed form
2798.4F57978714k438069k564669k729237k888202l092051l367841l665805m021108
2814.7F33211732m498005n085945n752146o574750p683277r124041j1004865j3526857
2831E69961846j7027557k2213697l0016542m1755110n8674276p8463495r0129003p5473099
2847.3A56209067k8469444K8445140O5906122P7367082P3211789O1982543M7648430
2861.6D82300729L3185809K0739615J0983587L515482k412200p492543j2024283j5754223
2877.9E13041973j8247396j9336015j9377678j8874020j8112570j7285287j6447812
2892.2C85361195j5546829j4642268j4011473j4107406j5513360j8854440k4518251
2906.5B68167168l2209471m0503055m5702368m2046740k7325914p359065J0129057
$$ plain form
2920.7 83149612 106172994 138926551 179301262 225705311 276737005 330608964 384892046
2935 384892046 437079906 485155761 527539670 562998474 590854108 611364901 626008689 636966884
2951.3 636966884 645997405 653857946 660828829 667371750 673990309 680897534 687878191 694436073
2967.6 694436073 700208485 705090642 709094882 712289453 714794636 716768205 718340993 719564497
2984 719564497 720511436 721238017 721712351 721969366 722112298 722207785 722267151 722260475 722185910 722113550 722066939
3006.4 722066939 721972287 721797466 721574247 721348166 721107304 720802128 720502675 720282495 720102251 719938934
3026.8 719938934 719775915 719601750 719528794 719646692 719850183 720044136 720228493 720397770 720546842 720646441
3047.2 720646441 720717371 720789313 720791161 720726013 720684290 720648408 720544040 720385134 720224559 720090985 719936073
$$ packed form
2920.7H3149612K3023382L2753557M0374711M6404049N1031694N3871959N4283082
2935C84892046N2187860M8075855M2383909L5458804K7855634K0510793J4643788J0958195
2951.3F36966884R030521P860541O970883O542921O618559O907225O980657O557882
2967.6F94436073N772412M882157M004240L194571K505183J973569J572788J223504
2984G19564497R46939P26581M74334K57015J42932R5487N9366o676p4565p2360m6611
3006.4G22066939r4652j74821k23219k26081k40862l05176k99453k20180j80244j63317
3026.8G19938934j63019j74165p2956J17898K03491J93953J84357J69277J49072R9599
3047.2G20646441P0930P1942J848o5148m1723l5882j04368j58906j60575j33574j54912
$$ plain form
3069.6 719936073 719722807 719563901 719516158 719453037 719272852 719084918 719017506 719012797 719036162 719143987 719361365
3092.1 719361365 719662786 720013082 720394492 720716238 720889151 720950365 720981061 721039474 721041918 720875382
3112.4 720875382 720687091 720659256 720698476 720634222 720472574 720313370 720184326 720046997 719878554 719713151
3132.8 719713151 719597280 719565868 719573677 719474792 719252825 719027400 718872011 718783498 718692780 718544483 718354166
3155.3 718354166 718180060 718069255 717983365 717838287 717640579 717479944 717419922 717377961 717228353 717017174
3175.7 717017174 716849804 716750622 716638625 716438591 716237366 716090798 715936065 715792537 715704620 715581715
3196.1 715581715 715374529 715176105 715053678 714972973 714883149 714807630 714750648 714649498 714553416 714524209 714473486
3218.5 714473486 714407265 714394629 714388967 714398623 714462817 714531720 714542031 714484751 714400351 714325249 714273989 714239240
$$ packed form
3069.6G19936073k13266j58906m7743o3121j80185j87934o7412m709K3365J07825K17378
3092.1G19361365L01421L50296L81410L21746J72913O1214L0696N8413K444j66536
3112.4G20875382j88291k7835L9220o4254j61648j59204j29044j37329j68443j65403
3132.8G19713151j15871l1412P809r8885k21967k25425j55389q8513r0718j48297j90317
3155.3G18354166j74106j10805q5890j45078j97708j60635o0022m1961j49608k11179
3175.7G17017174j67370r9182j11997k00034k01225j46568j54733j43528q7917j22905
3196.1G15581715k07186j98424j22427q0705q9824p5519n6982j01150r6082k9207n0723
3218.5G14473486o6221j2636n662R656O4194O8903J0311n7280q4400p5102n1260l4749
$$ plain form
3243 714239240 714203537 714165688 714100301 713975787 713834047 713754058 713684022 713549495 713421047 713290870 713124275
3265.4 713124275 713002384 712897539 712689698 712436259 712287903 712211013 712110639 711973727 711814344 711643279
3285.8 711643279 711470544 711335301 711258709 711180091 711009860 710774779 710568130 710436463 710414469 710430801
3306.2 710430801 710335076 710145533 709977508 709873676 709850550 709852993 709786594 709679544 709578276 709445298
3326.6 709445298 709333956 709317446 709323764 709263146 709157050 709115207 709136665 709104776 709017694 708979785 708964944
3349 708964944 708884895 708786249 708693147 708592474 708499551 708389997 708222508 708006442 707828641 707718313 707602084
3371.5 707602084 707444429 707273304 707125485 707001567 706845462 706658900 706548393 706493497 706339538 706149817
3391.9 706149817 706080675 706092417 706194103 706383824 706511140 706558466 706680954 706943870 707242787 707493961
$$ packed form
3243G14239240l5703l7849o5387j24514j41740p9989p0036j34527j28448j30177j66595
3265.4G13124275j21891j04845k07841k53439j48356p6890j00374j36912j59383j71065
3285.8G11643279j72735j35243p6592p8618j70231k35081k06649j31667k1994J6332
3306.2G10430801r5725j89543j68025j03832k3126K443o6399j07050j01268j32978
3326.6G09445298j11342j6510O318o0618j06096m1843K1458l1889q7082l7909j4841
3349G08964944q0049r8646r3102j00673r2923j09554j67489k16066j77801j10328j16229
3371.5G07602084j57655j71125j47819j23918j56105j86562j10507n4896j53959j89721
3391.9G06149817o9142J1742J01686J89721J27316M7326J22488K62916K98917K51174
$$ plain form
3412.3 707493961 707635522 707645178 707602382 707534075 707471073 707490325 707569063 707626879 707642615 707671165 707714856
3434.7 707714856 707718313 707679689 707625508 707589686 707533419 707446635 707476854 707622826 707697511 707631946 707501352
3457.1 707501352 707388937 707322061 707310736 707347274 707388163 707363307 707275152 707222641 707247853 707346082 707387209
3479.6 707387209 707265377 707139313 707036555 706864119 706786394 706905544 706966817 706863046 706809163 706754565
3500 706754565 706513286 706359982 706474602 706487238 706339300 706339657 706459582 706519365 706530035 706453621 706172585
3522.4 706172585 705851972 705631912 705521703 705684900 705942452 705953479 705850065 705915630 706016004 705807924
3542.8 705807924 705280900 704963446 705121279 705166161 704979420 705015659 705139160 705089867 704990566 704733312
3563.2 704733312 703727603 702550590 702797055 703762829 704153657 704117179 704091966 704056621 704067409 703972697
$$ packed form
3412.3G07493961J41561R656m2796o8307o3002J9252P8738N7816J5736K8550M3691
3434.7G07714856L457l8624n4181l5822n6267q6784L0219J45972P4685o5565j30594
3457.1G07501352j12415o6876j1325L6538M0889k4856q8155n2511K5212R8229M1127
3479.6G07387209j21832j26064j02758j72436p7725J19150O1273j03771n3883n4598
3500G06754565k41279j53304J14620J2636j47938L57J19925N9783J0670p6414k81036
3522.4G06172585l20613k20060j10209J63197K57552J1027j03414O5565J00374k08080
3542.8G05807924n27024l17454J57833M4882j86741L6239J23501m9293r9301k57254
3563.2G04733312j005709j177013K46465R65774L90828l6478k5213l5345J0788r4712
$$ plain form
3583.6 703972697 703023374 701623082 701534569 702028096 701583862 700687170 700039506 699377358 699050248 699371576
3604 699371576 699404895 698817790 698568761 698721468 699090898 699510753 699207902 699162543 700427353 701776564
3624.4 701776564 701473951 699158669 698315918 699477077 700197875 700405419 700421572 700307488 700396895 700304449
3644.8 700304449 698844194 696341932 696237028 698359132 699337244 699169815 699742854 700551152 701006174
3663.1 701006174 701371789 700911164 699095130 698251545 698218584 696822047 696750760 698473871 699864268
3681.5 699864268 700792789 701017857 699573815 697434366 697364867 698656499 699647486 700082481 699733078
3699.8 699733078 698939502 699139535 699920356 699750185 698173881 696819603 697643936 699121892 699658692
3718.2 699658692 699320138 698740959 698348820 698416591 699072957 699285805 698041916 696059525 695323467
$$ packed form
3583.6G03972697r49323j400292q8513M93527m44234q96692o47664o62148l27110L21328
3604F99371576L3319n87105k49029J52707L69430M19855l02851m5359J264810J349211
3624.4G01776564l02613k315282q42751J161159P20798K07544J6153j14084Q9407r2446
3644.8G00304449j460255k502262j04904K122104R78112j67429N73039Q08298M55022
3663.1G01006174L65615m60625j816034q43585l2961j396537p1287J723111J390397
3681.5F99864268R28521K25068j444042k139449o9499J291632R90987M34995l49403
3699.8F99733078p93576K00033P80821j70171j576304j354278Q24333J477956N36800
3718.2F99658692l38554n79179l92139O7771O56366K12848j243889j982391p36058
$$ plain form
3736.5 695323467 696631253 698305070 697810411 695617199 695515394 695684195 694226742 694376409 696222246
3754.9 696222246 697146356 696897566 697160840 697856724 697884738 697482347 696860492 696710348 697459280 698091447
3775.3 698091447 697858572 697127938 696999073 697190821 697172344 697325170 697570324 697751045 697569668 696793437
3795.7 696793437 696203589 695305526 694036067 694296122 694542408 694321215 695332885 696515024 696115792
3814.1 696115792 694673359 694059074 693120420 692495525 693583369 694448054 694770098 694827914 694606245
3832.4 694606245 694329739 693339467 692084551 692080736 692814171 693728030 694937468 695954561 695325255
3850.8 695325255 691799939 689829826 691818237 693805397 694246471 693443120 692885756 692973316 692252457
3869.1 692252457 691477954 691781700 692659199 693426609 693000019 692501366 692661762 692311823 692481816 692784965
$$ packed form
3736.5F95323467J307786J673817m94659k193212j01805J68801j457453J49667J845837
3754.9F96222246R24110k48790K63274O95884K8014m02391o21855j50144P48932O32167
3775.3F98091447k32875p30634j28865J91748j8477J52826K45154J80721j81377p76231
3795.7F96793437n89848q98063j269459K60055K46286k21193J011670J182139l99232
3814.1F96115792j442433o14285r38654o24895J087844Q64685L22044N7816k21669
3832.4F94606245k76506r90272j254916l815P33435R13859J209438J017093o29306
3850.8F95325255l525316j970113J988411J987160M41074q03351n57364Q7560p20859
3869.1F92252457p74503L03746Q77499P67410m26590m98653J60396l49939J69993L03149
$$ plain form
3889.5 692784965 692188561 692336917 693297744 693303645 692188323 691050947 690471947 690917552 692111671
3907.9 692111671 692993164 693338275 693306625 692714214 692065120 692098498 692330480 692238510 692312777 692551970
3928.3 692551970 692306101 691935122 692258656 692992866 693373859 693148196 692750454 692739725 692751169 692415655
3948.7 692415655 692249715 692470670 692691505 692721367 692678928 692577183 692432821 692359030 692301273 692186892
3969.1 692186892 692045808 691881657 691766024 691780508 691801310 691796422 691825688 691850603 691843688 691785395 691689789
3991.5 691689789 691616714 691608727 691572726
3997.6 691572726
$$ packed form
3889.5F92784965n96404J48356R60827N901j115322j137376n79000M45605J194119
3907.9F92111671Q81493L45111l1650n92411o49094L3378K31982r1970P4267K39193
3928.3F92551970k45869l70979L23534P34210L80993k25663l97742j0729J1444l35514
3948.7F92415655j65940K20955K20835K9862m2439j01745j44362p3791n7757j14381
3969.1F92186892j41084j64151j15633J4484K0802m888K9266K4915o915n8293r5606
3991.5F91689789p3075p987l6001
3997.6F91572726
##END=$$ End of the data block
