##TITLE=Pirilio-metoxi $$ Begin of the data block
##JCAMP-DX=5.00 $$ ACD/SpecManager v 10.08
##SPECTROMETER/DATA SYSTEM=Alpha
##DATE=30 May 2014 08:24:52
##DATA TYPE=INFRARED SPECTRUM
##DATA CLASS=XYDATA
##ORIGIN=
##OWNER=
##NPOINTS=1765
##FIRSTX=399.75695801
##LASTX=3997.56933594
##MAXX=3997.56933594
##MINX=399.75695801
##MAXY=0.84553456
##MINY=0.14546593
##XFACTOR=1.0000000000
##YFACTOR=1.000000000000000e-9
##FIRSTY=0.77284914
##DELTAX=2.03957629
##XUNITS=1/CM
##YUNITS=ARBITRARY UNITS
##XYDATA=(X++(Y..Y))
399.8G72849143R18328J990915j554072l109455J66118J436531j673102l398716j517594
$$ 772849143 773767471 775758386 774204314 771094859 771260977 772697508 771024406 767625690 766108096
418.1G66108096k59996j796126n87940L331899L267288l88443p71523J485765M55916
$$ 766108096 765848100 764051974 763464034 766795933 770063221 769674778 768903255 770389020 770844936
436.5G70844936k544403k063036O65605Q6725k555668j496434O79791j405776m782081
$$ 770844936 768300533 766237497 766903102 766989827 764434159 762937725 763617516 762211740 757429659
454.8G57429659l890514J86503J387000M03881J634538K964139N05805k335787o37710
$$ 757429659 753539145 753725648 755112648 755516529 757151067 760115206 760621011 758285224 757647514
473.2G57647514J722455l70442k739251r87172Q93593r89855k511501k38001J452267
$$ 757647514 759369969 758999527 756260276 755273104 756166697 755176842 752665341 752427340 753879607
491.5G53879607j028836l289759j718223p69794l839076o583571p192850j1299670
$$ 753879607 752850771 749561012 747842789 747072995 743233919 736650348 729457498 718157828
507.9G18157828j8436194j6037821L23414J4083982J3448954P637143N732894M302740
$$ 718157828 699721634 683683813 684007227 698091209 711540163 719177306 724910200 729212940
524.2G29212940L33667k056361p03156r7692k262711l172517r31561J22368k057969
$$ 729212940 729546607 727490246 726787090 726689398 724426687 721254170 720322609 720444977 718387008
542.5G18387008l245890j316488o39260l604412o338894p869125j4649331l0974329
$$ 718387008 715141118 713824630 713185370 709580958 703242064 695372939 680723608 649749279
558.8F49749279m7758162m3708503j0193110K1266043K4172426K5400340L8803101
$$ 649749279 601991117 558282614 548089504 569355547 593527973 618928313 657731414
573.1F57731414L7753165K1073401R565651N297720J441837p53939R62793K164424
$$ 657731414 695484579 716557980 726123631 731421351 732863188 732109249 733072042 735236466
589.4G35236466k18511k180516p04766K81632j955688l428340j397431n01990m442751
$$ 735236466 735017955 732837439 732132673 732414305 730458617 727030277 725632846 725130856 720688105
607.8G20688105j0328234j5879154k0650625k8387904m3995619n3054690l1162739
$$ 720688105 710359871 694480717 673830092 645442188 601446569 548391879 517229140
622.1E17229140J7558217N9446573O7685902M4560015J5152932l671766j0565877L98219
$$ 517229140 534787357 594233930 661919832 706479847 721632779 717961013 707395136 707793355
638.4G07793355J7739236J7606795P648945M441679L679513R84312o46830l309906
$$ 707793355 725532591 743139386 750788331 755230010 758909523 759893835 759247005 755937099
654.7G55937099q402645n427718O532490J0155320K775729n496025r170056p408917
$$ 755937099 747534454 742106736 748639226 758794546 761570275 756074250 746904194 739495277
671G39495277j1610031k0490706k8174162l6158740m5786440m7532321k6712834J2607455
$$ 739495277 727885246 707394540 679220378 643061638 597275198 549742877 523030043 535637498
687.3E35637498M2380094M6735228L9228677L1364024K2311211J3071417P529319M696011
$$ 535637498 578017592 624752820 663981497 695345521 717656732 730728149 738257468 742953479
703.7G42953479k68101q862615j8814087k4491608j5907943O442725K5593698L0283809
$$ 742953479 742685378 733822763 715008676 690517068 674609125 681051850 706645548 736929357
720G36929357K2474051J0993719M205346K008676m3034j936436j437902o67870l028691
$$ 736929357 759403408 770397127 774602473 776611149 776568115 774631679 773193777 772525907 769497216
738.3G69497216p243097q827627o984412n023480l721952p59602K723277K567649j022578
$$ 769497216 762254119 753426492 746442080 741418600 737696648 736937046 739660323 742227972 741205394
756.7G41205394l794849m709482p545709j3901651j9491911j9013882j5780747j8501401
$$ 741205394 737410545 732701063 725155354 711253703 691761792 672747910 656967163 638465762
773F38465762k5510251k8513253k2064328P005214N5591405P8253448N5434644K3140907
$$ 638465762 612955511 584442258 562377930 569383144 624974549 703227997 758662641 781803548
789.3G81803548O206811R57787j022935l991485o109476n506873m833162o462455q033335
$$ 781803548 788010359 788968146 787945211 783953726 777844250 772337377 767504215 761041760 753008425
807.7G53008425p176757n523085m775644l539085j226366j92284j874983m414022o370008
$$ 753008425 745831668 740308583 735532939 731993854 730767488 730575204 728700221 724286199 717916191
826G17916191r827316j6126514k1970987k4040163k4556458k6176393k3030757l984094
$$ 717916191 708088875 691962361 669991374 645951211 621394753 595218360 572187603 568203509
842.3E68203509L0099213N7359517N8372378M0876806K2973776J0542214K666652q86739
$$ 568203509 598302722 655662239 714034617 754911423 777885199 788427413 791094065 790207326
858.7G90207326k069473m106164o866455p901549p661522q929193j1737823j2721598
$$ 790207326 788137853 784031689 777165234 769263685 761602163 752672970 740935147 728213549
875G28213549r127021j238167P639348J3265729J3569057R594738M681468K298534
$$ 728213549 719086528 717848361 725487709 738753438 752322495 761917233 766598701 768897235
891.3G68897235K475381K203882M88639m80354P0453M232j452387k158403j202941
$$ 768897235 771372616 773576498 774065137 773584783 773655236 773659468 772207081 770048678 768845737
909.6G68845737p03216j894891k922416k594828k728999m467070o367981p959009r792029
$$ 768845737 768142521 766247630 763325214 760730386 758001387 753534317 747166336 739207327 729415298
928G29415298q225561j827001K319276J487911p71225m392385r900093j6850472k5753617
$$ 729415298 721189737 719362736 721682012 723169923 722398698 718006313 708106220 691255748 665502131
946.4F65502131l3692598l1107605j0780990J7839432L6339104L9008677L1507850
$$ 665502131 631809533 600701928 589920938 607760370 644099474 683108151 714616001
960.6G14616001J8821597O194114j777768n406677p348836q603692p478714l085077
$$ 714616001 733437598 739631712 737853944 732447267 725098431 716494739 709016025 705930948
977G05930948O18637k3723k536773l773571m162728n502701r820521j9504905k7562499
$$ 705930948 706549585 706525862 703989089 700215518 696052790 690550089 680729568 661224663 633662164
995.3F33662164j8280625L189325J6024769J4967858N299807o064832j2656272j4440477
$$ 633662164 615381539 618570864 634595633 649563491 654863298 648798466 636142194 621701717
1011.6F21701717j4156758j5315116k1685123k9083729k6269317r513736J0773123
$$ 621701717 607544959 592229843 570544720 541460991 515191674 505677938 516451061
1025.9E16451061K1683872K1774292J7714381J3646304R652198M596829j861036o705641
$$ 516451061 538134933 559909225 577623606 591269910 600922108 605518937 603657901 596952260
1042.2E96952260n369187j692772l847122j0120749j5795172k0944833k5137723k6942909
$$ 596952260 591583073 589890301 586043179 575922430 560127258 539182425 514044702 487101793
1058.5D87101793k6299655k4174243k1942437k1152616k1906226k2015095j9039303
$$ 487101793 460802138 436627895 414685458 393532842 371626616 349611521 330572218
1072.8C30572218j3085395o450087j415998J129627J473964L51518j598716m358023
$$ 330572218 317486823 311036736 309620738 310750365 312224329 312575847 310977131 306619108
1089.1C06619108p121474p846922m723131J291841P146984J0964036J2941152J3024181
$$ 306619108 299497634 291650712 286927581 288219422 295366406 306330442 319271594 332295775
1105.4C32295775J2374133J4018208J5023917J3239354J4727771J8457413J9820750
$$ 332295775 344669908 358688116 373712033 386951387 401679158 420136571 439957321
1119.7D39957321L2727599N7025909O0565472M0818691K4098277J6863525J3363004
$$ 439957321 472684920 529710829 590276301 631094992 655193269 672056794 685419798
1134F85419798J0274112O329537K263724j54912l60727j15455j045346k779662m858554
$$ 685419798 695693910 702023447 704287171 704132259 703771532 703656077 702610731 699831069 694972515
1152.4F94972515p803142j1185110j4024972j5731395j6392588j7065585j8308103
$$ 694972515 687169373 675984263 661959291 646227896 629835308 612769723 594461620
1166.6E94461620k1025300k7879536l8798809n0404549n8846027n6690126l8818539
$$ 594461620 573436320 545556784 506757975 456353426 397507399 340817273 301998734
1180.9C01998734j9432336j9048839k7670980j4617771K7047485P3212475R8280072
$$ 301998734 282566398 263517559 235846579 221228808 248276293 321488768 419768840
1195.2D19768840R6445710P6860308N0529361K6232898R151101n28395n221844q074104
$$ 419768840 516214550 593074858 643604219 669837117 678988218 678459823 673237979 665163875
1211.5F65163875j1146188j3961554j5254974j5569210j7244041k1923125k8888523
$$ 665163875 654017687 640056133 624801159 609231949 591987908 570064783 541176260
1225.8E41176260l5704434m0638447m3847859m6319276m7808081m6603173m1025221
$$ 541176260 505471826 464833379 420985520 374666244 326858163 280254990 239229769
1240.1B39229769k9575110j0788426J3494030L6373615N1946640N9248060N8759332
$$ 239229769 209654659 198866233 212360263 248733878 300680518 359928578 418687910
1254.3D18687910N1046222L8971067K6321888J5098214N806208k028347q835852j1994064
$$ 418687910 469734132 508705199 535027087 550125301 555931509 553903162 545067310 533073246
1270.6E33073246n923330Q656919K0612299K1912933J6681730J2898028J3496757J5301764
$$ 533073246 527149916 535806835 556419134 578332067 595013797 607911825 621408582 636710346
1287F36710346J3860702R244919M438639P13587k743721o683171r678841q307278k204478
$$ 636710346 650571048 659815967 664254606 664968193 662224472 655541301 645862460 637555182 635350704
1305.3F35350704L204465M412472O514013J3607323J8548668J4880419P069647J423716
$$ 635350704 638555169 642967641 649481654 663088977 681637645 696518064 703587711 705011427
1321.6G05011427j324713k924383l207027K4795O640673J1361360J0066152M700601
$$ 705011427 703686714 700762331 697555304 697580099 704220772 715582132 725648284 730348885
1338G30348885k32935j625836M06325L178537L976703K291143m71712l249406o136537
$$ 730348885 730115950 728490114 728896439 732074976 736051679 738342822 737871110 734621704 728485167
1356.3G28485167q243799o524265J130879R186625J0715604Q368314N548894K979875
$$ 728485167 720241368 713717103 714847982 724034607 734750211 743118525 748667419 751647294
1372.6G51647294Q91685p45237k544463m787385p093430r056270j1436641j3637125
$$ 751647294 752538979 751793742 749249279 744461894 737368464 728312194 716875553 703238428
1388.9G03238428j4554382j5726447j6186178j5207827j8473684k7077258l4681022
$$ 703238428 688684046 672957599 656771421 641563594 623089910 596012652 561331630
1403.2E61331630k8551281k341628J7695368J8811225J7944336K2397757K6255727
$$ 561331630 532780349 530438721 548134089 566945314 584889650 607287407 633543134
1417.5F33543134K6153922J8504858J0192394M355848j532734p530748j2805045j8447757
$$ 633543134 659697056 678201914 688394308 692750156 691217422 683686674 670881629 652433872
1433.8F52433872l1450689m5793950m2321980k4812520K141118K3259223K7276635
$$ 652433872 620983183 575189233 532867253 508054733 510195851 533455074 560731709
1448.1E60731709J8030763L931105j0115206k6695610k9523313m189014J4114559J5648961
$$ 560731709 578762472 582693577 572578371 545882761 516359448 512170434 526284993 541933954
1464.4E41933954N085647l115952k336383R49740n952954k2657752l7627697m9853772
$$ 541933954 547019601 543903649 541567266 542517006 536564052 513906300 476278603 426424831
1480.7D26424831n8115125n8287531n2939444l8726569j3793379P979289K7287319
$$ 426424831 368309706 310022175 257082731 218356162 204562783 212542072 239829391
1495B39829391N7880104P7167421N7351917J9592613j8844783m9672365l3518285k672016
$$ 239829391 297709495 374876916 432228833 451821446 432976663 383304298 349786013 347113997
1511.3C47113997J6630262K7108967K5993526J3393521j001298o085217K179623J7807007
$$ 347113997 363744259 390853226 416846752 430240273 429238975 423153758 425333381 443140388
1527.6D43140388K8060734L2402992L7614048L2625854K3162186K0530104J3444543
$$ 443140388 471201122 503604114 541218162 573844016 597006202 617536306 630980849
1541.9F30980849L086806l192723q699596j4899850k0271122k5004566k9794932m7537356
$$ 630980849 634067655 630874932 622175336 607275486 587004364 561999798 532204866 484667510
1558.2D84667510o4247430m7460854m5056760n0043881m8025578l6845267j7228812
$$ 484667510 420420080 372959226 327902466 277858585 229833007 192987740 175758928
1572.5A75758928p397652K359808K0642653J8260196q711323k9381216k2282570l782899
$$ 175758928 168361276 170721084 191363737 209623933 200912610 171531394 149248824 145465925
1588.8A45465925J1000917K1662354K9865444L7041917M7556654O1288774O7372441
$$ 145465925 156466842 178129196 207994640 245036557 292593211 353881985 421254426
1603.1D21254426N8615506M3362707L0827224K1658361J3133705J840293j5659451
$$ 421254426 479869932 523232639 554059863 575718224 588851929 590692222 575032771
1617.4E75032771l1365276m7552049o8890154o9139719m5657307j1084765K4353802
$$ 575032771 543667495 496115446 427225292 358085573 312428266 301343501 325697303
1631.6C25697303N5326223Q8247180Q2955599N2436113L5943330K5284528J9897104
$$ 325697303 381023526 469270706 552226305 604662418 640605748 665890276 685787380
1645.9F85787380J6845822J0370374O818950P773876O322503L639221J517594r58681
$$ 685787380 702633202 713003576 719822526 727596402 733918905 737558126 739075720 738117039
1662.2G38117039l309846o108761j0773658j4187873j2518406j1867344j0984540o468773
$$ 738117039 734807193 728698432 717924774 703736901 691218495 679351151 668366611 661897838
1678.6F61897838k657652J462698R427667J5475392J8510699K2114516K1499812K1462143
$$ 661897838 659240186 660702884 670130551 685605943 704116642 726231158 747730970 769193113
1694.9G69193113K1136761J6059935J2555956Q100331M789830L891050K369166P96258
$$ 769193113 790329874 806389809 818945765 827046096 831835926 835726976 838096142 838892400
1711.2H38892400M6790m85063o55353M97699J422942J107275N43595J26957L38793
$$ 838892400 838939190 838454127 837798774 838296473 839719415 840826690 841370285 841497242 841836035
1729.5H41836035M55499J74344Q46684J248180Q01802J72019l83794n61774m92752
$$ 841836035 842291534 842465878 843312562 844560742 845362544 845534563 845150769 844588995 844096243
1747.9H44096243p36117o41286k84374l67403q19266j452029j392841n49376q75235
$$ 844096243 843360126 842718840 842434466 842067063 841247797 839795768 838402927 837853551 836978316
1766.3H36978316k044737k233803j235426j0013m8638l92258N8591M67957J92701J66715
$$ 836978316 834933579 832699776 831464350 831454337 831405699 831013441 831072032 831539989 831732690 831899405
1786.7H31899405L43918r3758k38836M31538O68705N4299o71267o53029k52544m47751
$$ 831899405 832243323 832149565 831910729 832342267 833010972 833065271 832394004 831740975 831488431 831040680
1807H31040680j176774j139701K0683P68602N29587L85821O54042O07550J14441l36766
$$ 831040680 829863906 828724205 828744888 829513490 830043077 830428898 831082940 831690490 831804931 831468165
1827.4H31468165k74837K73645R4056n60820k89798K47240k52068q90076j1265R02950
$$ 831468165 831193328 831466973 831561029 831000209 830710411 830957651 830705583 829815507 829804242 830707192
1847.8H30707192M91381j99079k49684p749k79486p49826o94037m57108q93176j378119
$$ 830707192 831198573 830999494 830749810 830742061 830462575 829712749 829018712 828561604 827668428 826290309
1868.2H26290309o17563K97367k1040p80821q57830m44174m66764r43363j074612p77483
$$ 826290309 825672746 825970113 825949073 825168252 824310422 823866248 823399484 822456121 821381509 820604026
1888.6H20604026n54502q65519j196205r39548q63374j329004j438439q94606n61536
$$ 820604026 820049524 819184005 817987800 817048252 816184878 814855874 813417435 812522829 811961293
1907H11961293o51419l99172J78754J47224n15104p27832l62277j24991j53244k09093
$$ 811961293 811309874 810910702 811089456 811236680 810721576 809993744 809631467 809506476 809353232 809144139
1927.4H09144139L5465K39968r7632m27961j25468K43842L6359j68204L8266L9339
$$ 809144139 809179604 809419572 809321940 808893979 808768511 809012353 809048712 808880508 808918774 808958113
1947.8H08958113m65691r66906r24707p00891r26971j303316j160502q83639j169324
$$ 808958113 808492422 807525516 806600809 805899918 804972947 803669631 802509129 801625490 800456166
1966.1H00456166j510977j238108p79569p09117q17537m75288J58251J84119m47393
$$ 800456166 798945189 797707081 796927512 796218395 795400858 794925570 795083821 795267940 794820547
1984.5G94820547q59916q54671j120508j618266j606524j229048j140177j310408j041234
$$ 794820547 793960631 793105960 791985452 790367186 788760662 787531614 786391437 785081029 784039795
2002.8G84039795k00808L06726K4199l56435l49820l91007o58929n93960m7147M32193
$$ 784039795 783838987 784145713 784169912 783813477 783463657 783072650 782413721 781819761 781772614 782204807
2023.2G82204807N10394N44966Q59081J026512O89506L41714M16278M56453P4684k79069
$$ 782204807 782715201 783260167 784119248 785145760 785835266 786176980 786593258 787049711 787124395 786845326
2043.6G86845326j02341L32296M23432K57492M05430P25747O10232K21491J60455L28899
$$ 786845326 786742985 787075281 787498713 787756205 788161635 788887382 789497614 789719105 789879560 790208459
2064G90208459J89185k09570l24666j04487r4533l04461j40309L66032N32627K52128
$$ 790208459 790397644 790188074 789863408 789758921 789664388 789359927 789219618 789585650 790118277 790370405
2084.4G90370405J48952L43382L01242r2745l04699j04725K6405k05040l61443j60694
$$ 790370405 790519357 790862739 791163981 791071236 790766537 790661812 790688217 790483177 790121734 789961040
2104.8G89961040p2479l78013n63741l00228r7513l19720n43713m07338k95222n50390
$$ 789961040 789888561 789510548 788946807 788646579 788549066 788229346 787685633 787278295 786983073 786432683
2125.2G86432683p43329m70340j13190j27434k31743k7239K11775N0604k24113j24812
$$ 786432683 785689354 785219014 785105824 784978390 784746647 784719408 784931183 784981787 784757674 784632862
2145.6G84632862J05142k0802l02553k71738j17540k74181n72026n51224l32713l80576
$$ 784632862 784738004 784717202 784414649 784142911 784025371 783751190 783179164 782627940 782295227 781914651
2166G81914651o11901n49853k52723k32995m52995m12941j35541j15633l40998l42131
$$ 781914651 781302750 780752897 780500174 780267179 779814184 779401243 779265702 779150069 778809071 778466940
2186.4G78466940r2924n4061l25024m49956k23279k6762r7454j11043R2745J59978
$$ 778466940 778374016 778319955 777994931 777544975 777321696 777294934 777197480 777086437 777179182 777339160
2206.8G77339160p3611k21312k9624J41263l4451k45154j49727n8532k90513n44906
$$ 777339160 777265549 777044237 777014613 777155876 777121425 776876271 776726544 776668012 776377499 775832593
2227.2G75832593m94003m07874o24121q45551o50585k94685k06173k16245j8180J75774
$$ 775832593 775338590 774930716 774306595 773461044 772810459 772515774 772309601 772093356 772075176 772250950
2247.6G72250950M5419j87337j57893Q941n6506l13937l52264j92523k54213n13375
$$ 772250950 772296369 772109032 771951139 771960080 771903574 771589637 771237373 771044850 770790637 770277262
2268G70277262n70119m29272m68791o51657o09875m10438m37021p24673q88229p51912
$$ 770277262 769707143 769277871 768809080 768157423 767547548 767137110 766700089 765975416 765087187 764335275
2288.4G64335275o62387p41780n84840j26660J48237J5437j68919j83642k51532m56452
$$ 764335275 763672888 762931108 762346268 762219608 762367845 762383282 762214363 762030721 761779189 761322737
2308.8G61322737n65589m85241n15580q97169j346887j445412j300276j321733j515924
$$ 761322737 760757148 760271907 759756327 758859158 757512271 756066859 754766583 753444850 751928926
2327.1G51928926j527370j259267j059651r73940o20067j04010J49309M22955J270294
$$ 751928926 750401556 749142289 748082638 747108698 746488631 746384621 746533930 746956885 748227179
2345.5G48227179J779318J016855k30551q76784p37607n48602m45902j45614K66731
$$ 748227179 750006497 751023352 750792801 749916017 749178410 748629808 748183906 748038292 748305023
2363.8G48305023M41849M53174O80745R55403R24944P53284P56502Q60512P32303L80576
$$ 748305023 748746872 749200046 749880791 750836194 751761138 752514422 753270924 754131436 754863739 755244315
2384.2G55244315J49786J28150N9605j46747k80678k49148k88009m90427n71549m33803
$$ 755244315 755394101 755522251 755581856 755435109 755154431 754905283 754617274 754126847 753555298 753121495
2404.6G53121495l52263m91739o17980n31257m72426o56903p91013o43134m86434m98891
$$ 753121495 752769232 752277493 751659513 751128256 750655830 749998927 749207914 748564780 748078346 747579455
2425G47579455m67956k50160n7638p9751j47760o5625L6061n1975j99914j92702j79887
$$ 747579455 747111499 746861339 746803701 746723950 746576190 746510565 746546626 746494651 746294737 746102035 745922148
2447.5G45922148m00662p08163q22425q13722r14753j044333r37223o43433m40180
$$ 745922148 745521486 744813323 743990898 743177176 742262423 741218090 740280867 739637434 739197254
2465.8G39197254l39269j46628Q2970R2387q6904j40786j192P7844L2961R4295L01540
$$ 739197254 738857985 738711357 738794327 738886714 738799810 738659024 738657832 738735676 738768637 738862932 739164472
2488.3G39164472L80039K26557J02103J18553M8101j85251l40640l10183l16381m61758
$$ 739164472 739544511 739771068 739873171 739991724 740039825 739854574 739513934 739203751 738887370 738425612
2508.7G38425612n57184n27799n39899o90341p92503o93381n72145n58197m90725l10302
$$ 738425612 737868428 737340629 736800730 736110389 735317886 734624505 734052360 733494163 733003438 732693136
2529G32693136k61009m97341p88570r02176r27507j015127j088739r62734o64830m38750
$$ 732693136 732432127 731934786 731146216 730244040 729316533 728301406 727212667 726249933 725585103 725146353
2549.4G25146353l15785p5758K05696K46167P1049j10328k81215n53131q84354j112700
$$ 725146353 724830568 724754810 724960506 725206673 725277722 725167394 724886179 724333048 723448694 722335994
2569.8G22335994j212835j285493j339853j291573j159132j089036j091183r89794
$$ 722335994 721123159 719837666 718497813 717206240 716047108 714958072 713866889 712877095
2586.2G12877095p25866m56929k87950j36673L0875P3910m7624r2805Q6486L27230
$$ 712877095 712151229 711694300 711406350 711269677 711300552 711374462 711326838 711234033 711320519 711647749
2606.6G11647749N08785O85871Q88765J023650R94086Q67725P53641N99086L29077
$$ 711647749 712156534 712842405 713731170 714754820 715748906 716616631 717370272 717969358 718298435
2624.9G18298435L9041j53661k58684l10898k70783q7917J45375L00408M20987N64635
$$ 718298435 718337476 718183815 717925131 717614233 717343450 717255533 717400908 717701316 718122303 718686938
2645.3G18686938O44625N87105M77314M27246M29988M08173L40223K68698J69694N901
$$ 718686938 719331563 719918668 720395982 720823228 721253216 721661389 722001612 722270310 722440004 722445905
2665.7G22445905j55985k61486l35872m11510m37677l97206l83615m12881m10617l52442
$$ 722445905 722289920 722028434 721692562 721281052 720843375 720446169 720062554 719649673 719239056 718886614
2686.1G18886614l09885l13759k96413k48969k33352k88844l76225m04119l86000m11689
$$ 718886614 718576729 718262970 717966557 717717588 717484236 717195392 716819167 716415048 716029048 715617359
2706.5G15617359m63724m69208m69864n24878n59271m95255m49657n43415o49989o64175
$$ 715617359 715153635 714684427 714214563 713689685 713130414 712635159 712185502 711642087 710992098 710327923
2726.9G10327923o38067o10888o00636n34177m27902m16160m26232l05355j35303j72674
$$ 710327923 709689856 709078968 708478332 707944155 707516253 707100093 706673861 706368506 706233203 706060529
2747.3G06060529m53890o81221o69360o23822o85931o56426m78327l70860l64602k73645
$$ 706060529 705606639 704925418 704256058 703632236 702946305 702289879 701811552 701440692 701076090 700802445
2767.7G00802445o3359J02400J13488M8339M9055J07050Q3029J3828O5744J25110p5459
$$ 700802445 700739086 700841486 700954974 701003313 701052368 701159418 701242447 701256275 701322019 701447129 701371670
2790.1G01371670m00365n38170n90801p98941j030028j013398q47816q09908q96633
$$ 701371670 700971305 700433135 699842334 699043393 698013365 696999967 696152151 695342243 694445610
2808.5F94445610r25720r44376j146495j430750j612067j886070k577662l663302m779160
$$ 694445610 693519890 692575514 691429019 689998269 688386202 686500132 683922470 680259168 675480008
2826.8F75480008n485773n415678m392803k653718p79390Q92043K542496M132807M917443
$$ 675480008 669994235 664578557 660185754 657532036 656752646 657644689 660187185 664319992 669237435
2845.2F69237435M412711L169655K138257J658857J383722J022458O11305K18153j97947
$$ 669237435 673650146 676819801 678958058 680616915 682000637 683023095 683634400 683852553 683654606
2863.5F83654606o35922r07003q75831p42376q00133j006126j152277j309574j650870
$$ 683654606 683018684 682111681 681235850 680493474 679693341 678687215 677534938 676225364 674574494
2881.9F74574494k065539k352059k576649k838075k953410k723456k294421j835465
$$ 674574494 672508955 670156896 667580247 664742172 661788762 659065306 656770885 654935420
2898.2F54935420j247228n29170J14739N74351R15944J157463J111209N97656k20597
$$ 654935420 653688192 653159022 653273761 653848112 654764056 655921519 657032728 657630384 657409787
2916.6F57409787j022637j816451k791465l793299m346847m217208l470003k037168
$$ 657409787 656387150 654570699 651779234 647985935 643639088 639421880 635951877 633914709
2932.9F33914709N1439K125204L296673L401518K914846K205312J428425P52807L56972
$$ 633914709 633966148 636091352 639388025 642789543 645704389 647909701 649338126 650090933 650447905
2951.2F50447905K35677J25825j27256m23431o97970r40025r92477n98312K16365J083255
$$ 650447905 650683582 650809407 650682151 650258720 649560750 648620725 647628248 647029936 647246301 648329556
2971.6F48329556J765370K254248K454162K251446J671076Q90851J69515m04298q72135
$$ 648329556 650094926 652349174 654803336 657054782 658725858 659616709 659786224 659381926 658509791
2990F58509791j104176r82702p71403p32482p44402o05226l74257k44916j52826P4029
$$ 658509791 657405615 656422913 655651510 654919028 654174626 653569400 653195143 652950227 652797401 652871430
3010.4F52871430L72469N74887N86927M05848R2208k80201n34594m99487k78771j20640
$$ 652871430 653243899 653818786 654405713 654811561 654903769 654623568 654088974 653589487 653310716 653190076
3030.8F53190076r9063j10983j64152l68952p14779j115740j567065k211750l030777
$$ 653190076 653091013 652980030 652815878 652446926 651732147 650616407 649049342 646837592 643806815
3049.1F43806815l706992m113614m320622m155755l365159k015292n00560Q28683J799703
$$ 643806815 640099823 635986209 631665587 627509832 624144673 622129381 621628821 622457504 624257207
3067.5F24257207K224803K006054J360833P41184M61996N86331J112640J853823K445579
$$ 624257207 626482010 628488064 629848897 630590081 631052077 631638408 632751048 634604871 637050450
3085.8F37050450K689779K538979K026438J420260Q83222K61783m52697r84073j228452
$$ 637050450 639740229 642279208 644305646 645725906 646609128 646870911 646418214 645434141 644205689
3104.2F44205689j431047j640022j489103o49452P28130K001703K575874K407909J948058
$$ 644205689 642774642 641134620 639645517 638996065 639724195 641725898 644301772 646709681 648657739
3122.6F48657739J707733J857459K080441J895666J219869M16040j84178n06580o10829
$$ 648657739 650365472 652222931 654303372 656199038 657418907 657834947 657650769 657144189 656533360
3140.9F56533360o25669n96762n62310o56486p58707o33061m65572m51446l82006j64926
$$ 656533360 655907691 655310929 654748619 654092133 653333426 652700365 652234793 651783347 651401341 651236415
3161.3F51236415j0491l6060j50085k85566m36544n48482n39422l43144j01030q7142
$$ 651236415 651225924 651189864 651039779 650754213 650317669 649769187 649229765 648886621 648785591 648698449
3181.7F48698449k62320m22895n97179q12113r02414p81715o11365o05464p24316q11815
$$ 648698449 648436129 648013234 647416055 646603942 645701528 644919813 644308448 643702984 642978668 642166853
3202.1F42166853q74817r82225j094342j107931j083791j138508j235485j270950j210690
$$ 642166853 641292036 640309811 639215469 638107538 637023747 635885239 634649754 633378804 632168114
3220.5F32168114j191556j256347j250625j177728j157045j200080j270354j304150
$$ 632168114 630976558 629720211 628469586 627291858 626134813 624934733 623664379 622360229
3236.8F22360229j301229j316607j305580j241982j203060j224279j204789j106858
$$ 622360229 621059000 619742393 618436813 617194831 615991771 614767492 613562703 612455845
3253.1F12455845j007795r01282p72298o87122p16329q34822r34422r45568r71675
$$ 612455845 611448050 610546768 609774470 609087348 608371019 607536197 606601775 605656207 604684532
3271.4F04684532j107753j191735j140237j136362j245618j320839j310468j276851
$$ 604684532 603576779 602385044 601244807 600108445 598862827 597541988 596231520 594954669
3287.8E94954669j257419j316428j456857j602829j766085j846969j673818j462579
$$ 594954669 593697250 592380822 590923965 589321136 587555051 585708082 584034264 582571685
3304.1E82571685j627087k091706k363503k367914k367794k383530k351702k351761
$$ 582571685 580944598 578852892 576489389 574121475 571753681 569370151 567018449 564666688
3320.4E64666688k420902k491772k630413k818524k894640k909303k855122k714575
$$ 564666688 562245786 559754014 557123601 554305077 551410437 548501134 545646012 542931437
3336.7E42931437k798020l098965l222108l202319l186703l112197l170967l402412
$$ 542931437 540133417 537034452 533812344 530610025 527423322 524311125 521140158 517737746
3353E17737746l491282l419876l371418l387570l413201l343671l245920l316820l511727
$$ 517737746 514246464 510826588 507455170 504067600 500654399 497310728 494064808 490747988 487236261
3371.4D87236261l553718l362298l132403k998859k988159k942950k701670k345621
$$ 487236261 483682543 480320245 477187842 474188983 471200824 468257874 465556204 463210583
3387.7D63210583k047330k107174k444058k448440j977622j684338k051890k443850
$$ 463210583 461163253 459056079 456612021 454163581 452185959 450501621 448449731 446005881
3404D46005881k187789j740813j572132j567572j660496j708657j501292j247615j125633
$$ 446005881 443818092 442077279 440505147 438937575 437277079 435568422 434067130 432819515 431693882
3422.4D31693882r63092o48767l45915l54201l93033j70291j89244n09173n17279j49369
$$ 431693882 430730790 430082023 429736108 429381907 428988874 428818583 428629339 428120166 427602887 427453518
3442.8D27453518K24948M13120M72307N71936O65814P11322Q34584R82672R74744J031220
$$ 427453518 427678466 428091586 428563893 429135829 429801643 430512965 431347549 432330221 433304965 434336185
3463.2D34336185J355768J519948J182020P43806P53194J092225J455814J493216J126021
$$ 434336185 435691953 437211901 438393921 439137727 439890921 440983146 442438960 443932176 445058197
3481.5D45058197J033157J311093J370818J258820J298905J440852J540006J451045
$$ 445058197 446091354 447402447 448773265 450032085 451330990 452771842 454311848 455762893
3497.8D55762893J301110J311332J294821J183868J226663J507223J814544J722008
$$ 455762893 457064003 458375335 459670156 460854024 462080687 463587910 465402454 467124462
3514.2D67124462J368046J332968J592845J786083J651704J404524J528502J835614
$$ 467124462 468492508 469825476 471418321 473204404 474856108 476260632 477789134 479624748
3530.5D79624748J948089K035707K083540J943677J953751K102256K061278J906514
$$ 479624748 481572837 483608544 485692084 487635761 489589512 491691768 493753046 495659560
3546.8D95659560J901090K011955K163380K294719K305449K321779K330363K062380
$$ 495659560 497560650 499572605 501735985 504030704 506336153 508657932 510988295 513050675
3563.1E13050675J728833K187908L122806L175736K673864K468586K624989K867639
$$ 513050675 514779508 516967416 520090222 523265958 525939822 528408408 531033397 533901036
3579.4E33901036K925992K671480K277195K341450K970576L033876K688766K784848
$$ 533901036 536827028 539498508 541775703 544117153 547087729 550121605 552810371 555595219
3595.7E55595219L041327K988219K930701K804101K299905K078354K478301K776385
$$ 555595219 558636546 561624765 564555466 567359567 569659472 571737826 574216127 576992512
3612.1E76992512K738178K391576K178967K755285L049731K331734J310765J134992
$$ 576992512 579730690 582122266 584301233 587056518 590106249 592437983 593748748 594883740
3628.4E94883740K410829K857506K320469K032220J871765J601159J341164R43542
$$ 594883740 597294569 600152075 602472544 604504764 606376529 607977688 609318852 610262394
3644.7F10262394L05951M00722J772225K330958J743675J563012J826287J539945J048505
$$ 610262394 610568345 610969067 612741292 615072250 616815925 618378937 620205224 621745169 622793674
3663F22793674P28369J44720l43978K91884M76181j56998P08103J607716J275361P56323
$$ 622793674 623522043 623666763 623322785 623614669 624090850 623933852 624641955 626249671 627525032 628281355
3683.4F28281355K99752k61486n14448K44379R62854Q25882K72035l13222m30465J62423
$$ 628281355 628581107 628319621 627805173 628049552 629012406 629838288 630110323 629797101 629366636 629529059
3703.8F29529059L30269l67641r96411m83513O78122P61926Q3030l69609m10199k72870
$$ 629529059 629859328 629491687 628495276 628011763 628689885 629451811 629534841 629165232 628755033 628482163
3724.2F28482163K503K89679j06871j022518j094103J86086J136899N71430q78215
$$ 628482163 628484666 628774345 628667474 627644956 626550853 626736939 627873838 628445268 627567053
3742.6F27567053j374841j60396j73390o84798N31376J222253M76121j22070J60158
$$ 627567053 626192212 626031816 625858426 625173628 625705004 626927257 627403378 627281308 627441466
3760.9F27441466K81811j62542l69013k76744L4988K98142O3122k92242l45349j81198
$$ 627441466 627723277 627560735 627191722 626914978 626949966 627248108 627311230 627018988 626673639 626492441
3781.3F26492441k02120j72257J10030J10209j65045m52519o67691o34849q63671q35300
$$ 626492441 626290321 626118064 626228094 626338303 626173258 625720739 625053048 624418199 623554528 622719228
3801.7F22719228J96338L11255j9550L48270K64287n44965j072347o85513n69106k42948
$$ 622719228 622915566 623226821 623207271 623555541 623819828 623274863 622202516 621517003 620947897 620704949
3822.1F20704949M84764L29972L5345j69873m44829n06938p76350q93474j89006L59237
$$ 620704949 621189713 621519685 621555030 621385157 620940328 620433390 619657040 618763566 618574560 618933797
3842.5F18933797N12659M55141j48057j325012k274632o40273J335025R47713o9916
$$ 618933797 619446456 619901597 619753540 618428528 616153896 615513623 616848648 617796361 617726445
3860.9F17726445o29186m27068j89066m85837k69473K80977L55482J93953l29494m46499
$$ 617726445 617097259 616670191 616481125 615995288 615725815 616006792 616362274 616556227 616226733 615780234
3881.3F15780234j58667k42591J1623k682m49658j05321J83284m69863j071871r03249
$$ 615780234 615621567 615378976 615390599 615387917 614938259 614832938 615016222 614546359 613474488 612571239
3901.7F12571239k92062M39644O97791L68595L2008k53975n73159m91082m7982P7009
$$ 612571239 612279177 612718821 613416612 613785207 613817215 613563240 612990081 612498999 612451017 612528026
3922.1F12528026j31428j10209j0610k12311k96891j0610J47760n5313l98457n08010
$$ 612528026 612396598 612286389 612275779 612063468 611766577 611755967 611903727 611848414 611449957 610941947
3942.5F10941947j83821q524j89483j71244J8299J8417j24335k09391j95444j25587
$$ 610941947 610758126 610749602 610560119 610388875 610407174 610425591 610301256 610091865 609896421 609770834
3962.9F09770834j13785j94371j93893j34588j82569k35677j50620o8725r5546j38640
$$ 609770834 609657049 609462678 609268785 609134197 608951628 608715951 608565331 608496606 608401060 608262420
3983.2F08262420j73211k17021k43068k51650k33889j89543k00510
$$ 608262420 608089209 607872188 607629120 607377470 607143581 606954038 606753528
3997.5F06753528
$$ 606753528
##END=$$ End of the data block
