##TITLE=Pirilio $$ Begin of the data block
##JCAMP-DX=5.00 $$ ACD/SpecManager v 10.08
##SPECTROMETER/DATA SYSTEM=Alpha
##DATE=30 May 2014 07:52:30
##DATA TYPE=INFRARED SPECTRUM
##DATA CLASS=XYDATA
##ORIGIN=
##OWNER=
##NPOINTS=1765
##FIRSTX=399.75695801
##LASTX=3997.56933594
##MAXX=3997.56933594
##MINX=399.75695801
##MAXY=0.85419476
##MINY=0.14823203
##XFACTOR=1.0000000000
##YFACTOR=1.000000000000000e-9
##FIRSTY=0.81841165
##DELTAX=2.03957629
##XUNITS=1/CM
##YUNITS=ARBITRARY UNITS
##XYDATA=(X++(Y..Y))
399.8H18411648K731443O33836r77576o25253O16312Q56459M13120j71006j067281
$$ 818411648 821143091 821776927 820799351 820174098 820790410 821646869 822059989 821888983 820821702
418.1H20821702j058876l03447q05974j370907p92325m8220L41714L88681N4598o89566
$$ 820821702 819762826 819459379 818653405 817282498 816490173 816441953 816783667 817172348 817226946 816537380
438.5H16537380j526356k083778j995385p66813O69300M02570j210809k155959j485706
$$ 816537380 815011024 812927246 810931861 810165048 810834348 811236918 810026109 807870150 806384444
456.9H06384444L70622J307011J027584M46021k23934o97494j125395j576782k019882
$$ 806384444 806755066 808062077 809089661 809535682 809311748 808614254 807488859 805912077 803892195
475.2H03892195k918482m601776p573366j3877571k4959803l5670638l0589997j808763
$$ 803892195 800973713 796371937 788798571 774921000 749961197 714290559 683700562 681891799
491.5F81891799K8803468L6065280K6320994J5733481R324193N798876L529668K018571
$$ 681891799 710695267 746760547 773081541 788815022 798139215 803938091 807467759 809486330
507.9H09486330J210689Q29697L50356j09136k00570k91109l23296k82585l09646l67582
$$ 809486330 810697019 811526716 811877072 811767936 811567366 811276257 810952961 810670376 810360730 809993148
528.3H09993148k16961k39730o09696o95169o47425j046718j683652k534926n445659
$$ 809993148 809776187 809536457 808926761 808231592 807584167 806537449 804853797 802318871 796873212
546.6G96873212j4359176l0616284k8809488R593189L8516700K6719749P345498L04878
$$ 796873212 782514036 751897752 723088264 732681453 771198153 797917902 805263400 805568278
562.9H05568278j254499j489341o06656R49800J200497M02391j19090j73688n48661
$$ 805568278 804313779 802824438 802217782 803167582 804368079 804770470 804651380 804477692 803929031
581.3H03929031n89430m16816p69913j150548j099229j058698j417577j531899k097905
$$ 803929031 803339601 802922785 802152872 801002324 799903095 798844397 797426820 795894921 793797016
599.6G93797016l016174l841161n185664q560240j6386509l2595337m2543769l2248437
$$ 793797016 790780842 786939681 781754017 773193777 756807268 724211931 681668162 649419725
616F49419725l4285367n9862613n2640260J4742494P9637706Q6456120O0317040L2702207
$$ 649419725 615134358 555271745 502631485 517373979 597011685 683467805 743784845 776487052
632.3G76487052J2637616L207862m183054j1857331m776180J1991263J5137195P717431
$$ 776487052 789124668 792332530 788149476 776292145 771515965 783507228 798644423 806361854
648.6H06361854j70350j3160586l2857240k7881801J5298426L9909721K2926926L546536
$$ 806361854 806191504 793030918 760173678 732291877 747590303 787500024 810426950 813973486
664.9H13973486m482150p947206p924080j2682319k3455739l9339483n6173265n0305962
$$ 813973486 809491336 801544130 793620050 780937731 757481992 718142509 661969244 611663282
681.2F11663282o903410L2656372K6321470l160417r849071J9296288M9961567M8548579
$$ 611663282 604759872 637416244 663737714 660577297 650728226 670024514 719986081 768534660
697.5G68534660K7228237J0504961J688003n271196j5605808l4224510m9488961k3815036
$$ 768534660 795762897 806267858 807955861 802684665 787078857 752854347 703365386 679550350
713.8F79550350L3648848N5662751L5028875J4889419P127405M446208L331006K191007
$$ 679550350 713199198 768861949 803890824 818780243 825907648 830353856 833684862 835875869
730.2H35875869P16150j31429n34296q53419r51111j021087j542569k069950k279579
$$ 835875869 836592019 836460590 835926294 835072875 834121764 833100677 831558108 829488158 827208579
748.5H27208579k908528l885448m769802n760610p825435j1712432j9061207l0120075
$$ 827208579 824300051 820414603 815644801 809884191 802058756 790346324 771285117 741165042
764.8G41165042l8564622l0494690j2029648j9198478n5446267p0959985m7470570
$$ 741165042 702600420 672105730 660076082 640877604 585431337 514471352 467000782
779.1D67000782k517491O8036824J21078074J01310194M9874067J9049108P593274
$$ 467000782 464483291 532520115 653598189 754908383 804782450 823831558 831424832
793.4H31424832L481329J475751R4831o80327j338661k466261m012227o335914j0014058
$$ 831424832 834906161 836381912 836476743 835796416 834457755 831991494 827979267 821643353 811629295
811.7H11629295j5821039k6365817m9158692p9905451o8732082J4795601Q8348031
$$ 811629295 795808256 769442439 720283747 640378296 571646214 586441815 674789846
826F74789846P9601467L6809206J4387428O060183j240134j652241N517245R150922
$$ 674789846 754391313 791200519 805587947 811648130 810407996 808755755 814273000 823423922
842.3H23423922O805778L754794J812101N34355k72751q39531j236439j733303k540469
$$ 823423922 830229700 833984494 835796595 836330950 836058199 835218668 833982229 832248926 829708457
860.7H29708457l773093n641580q764326j4809609k4907946l1582296j9441188R092272
$$ 829708457 825935364 820293784 811529458 796719849 771811903 740229607 720788419 729880691
877G29880691K8189063K5146246J2474656K660751j159012R19759N454361P182360
$$ 729880691 758069754 783216000 795690656 798351407 797192395 798112154 803566515 810748875
893.3H10748875N316258K794683J256942L54410l60489q57175j123965j052856p59542
$$ 810748875 816065133 818859816 820116758 820471168 820110679 819253504 818129539 817076683 816317141
911.7H16317141p72774j248777j755655k250790l146351n072355r279072j4012516
$$ 816317141 815544367 814295590 812539935 810289145 807142794 802070439 792791367 778778851
928G78778851j1401713j583576M688442M716515K987623K198935J386702j545906n691350
$$ 778778851 767377138 765793562 770482004 775198519 778186142 780385077 781771779 780225873 774534523
946.4G74534523r810686j5665769k6299894l7444770k6248932J7403006N0978244M1778683
$$ 774534523 764723837 749058068 722758174 685313404 659064472 676467478 727445722 769224405
962.7G69224405J6329348J171172o424189j3109088j5516936q387387K806544R831488
$$ 769224405 785553753 786724925 780300736 767191648 751674712 743287325 746093869 755925357
979G55925357R424925K521217m279852o295621o121814j0273397k5140942m9509465
$$ 755925357 765350282 767871499 763591647 757296026 751174212 740900815 715759873 666250408
995.3F66250408m6351195J2596309O0400963M2533517P315099q185982j3220072r680033
$$ 666250408 619899213 632495522 692896485 735430002 742745101 734559119 721339047 711659014
1011.6G11659014l046036q312404j5064001l905773Q904576L003240r558678j1887073
$$ 711659014 708612978 700300574 685236573 681330800 690235376 693238616 683679938 671792865
1027.9F71792865l473640M572094K947926l860950r008527j1833548j2469948j1976182
$$ 671792865 668319225 672891319 675839245 671978295 662969768 651136220 638666272 626690090
1044.3F26690090j3551474j8396318k4356902l0205607l6047935m1686148m5164764
$$ 626690090 613138616 594742298 570385396 540179789 504131854 462445706 417280942
1058.5D17280942m3296307l4464747k1483093j1887610j2460441k1024763k7757779
$$ 417280942 373984635 339519888 318036795 306149185 293688744 272663981 244906202
1072.8B44906202k6255757j6489759k737254R730593J8061205K0355195J5749961O548435
$$ 244906202 218650445 202160686 199423432 209154025 227215230 247570425 263320386 269868821
1089.1B69868821k907336q000403n462111L443569J3901174K0435006K0480990J5763849
$$ 269868821 266961485 258961082 253498971 256942540 270843714 291278720 311759710 327523559
1105.4C27523559J0110945P994801J2107670K1884680L3478707M0697843M2079568
$$ 327523559 337634504 345629305 357736975 379621655 413100362 453798205 495877773
1119.7D95877773M7953754N8920205N6536376L9764107K4637878J4519274N282044
$$ 495877773 543831527 602751732 659288108 699052215 723690093 738209367 743491411
1134G43491411l169238n154789N271733J9604921K2339940J4416039O950915L414095
$$ 743491411 740322173 735167384 740439117 760044038 782383978 796800017 803750932 807165027
1150.3H07165027J641392K27750j214266l234744n966187r185850j1285246p348239
$$ 807165027 808806419 809034169 807819903 804585159 798618972 789433122 778147876 770799637
1166.6G70799637K819359Q956790N444825j100183n822897j0034740j4672458j8776059
$$ 770799637 773618996 782575786 788020611 786920428 781097531 771062791 756390333 737614274
1182.9G37614274k3555577l4213900n1855207o3611984n4790080k7562827J6650171
$$ 737614274 714058697 679844797 627989590 564377606 509587526 482024699 498674870
1197.2D98674870O9427132R2874110P3287666M0483117J6458094K862811m500449j0906696
$$ 498674870 568102002 660976112 734263778 774746895 791204989 794067800 789567351 778660655
1213.5G78660655j9977391l1670868l8798213k8692842n981385P572591Q721173Q517861
$$ 778660655 758683264 727012396 688214183 659521341 653539956 661112547 669833720 678351581
1229.9F78351581P329345K887964j083016j622439k83777j332045p961333k0280361
$$ 678351581 685680926 688568890 687485874 685863435 685579658 684247613 676286280 656005919
1246.2F56005919l8233519o0282409p3004007n0405502J3218849P3776514Q4106147
$$ 656005919 617772400 557489991 484485984 434080482 447299331 521075845 605181992
1260.4F05181992N4383636K1235227l778815k3468077l4075558k7331412l022492K4542212
$$ 605181992 659565628 680800855 677022040 653553963 619478405 592146993 589124501 613666713
1276.8F13666713L9354742L7515461K6419938J5962303J0215044P029831M981220O147444
$$ 613666713 653021455 690536916 716956854 732919157 743134201 750164032 755145252 761292696
1293.1G61292696J0655105J3269782J0473550N026340P38025n41866J654327N082726
$$ 761292696 771947801 785217583 795691133 800717473 801455498 800913632 802567959 807650685
1309.4H07650685N824983L189385m27007l325045n496026p687270j0504544j2565613
$$ 807650685 813475668 816665053 816238046 812913001 807416975 799729705 789225161 776659548
1325.7G76659548j0790944m189849L593445P125259N250811O89328m339993r431780
$$ 776659548 765868604 761678755 765272200 772397459 777648270 778337598 773997605 764565825
1342G64565825j3049125p973492P905602J9352317J6026020P196009J366496j428663
$$ 764565825 751516700 743543208 751448810 770801127 786827147 794023156 795389652 793960989
1358.3G93960989k551795k362549j185536k42472l20911j334668k884686m691660n818427
$$ 793960989 791409194 789046645 787861109 787618637 787297726 785963058 783078372 778386712 772568285
1376.7G72568285n169987k607644p12693j041412k403676m418672p230281j1294902
$$ 772568285 767398298 764790654 764077961 763036549 760632873 756214201 748983920 737689018
1393G37689018j5619576j7327964j7417848j5866578r333551M991889K0723462K3908973
$$ 737689018 722069442 704741478 687323630 671457052 662123501 667115390 687838852 711747825
1409.3G11747825J4879227L643870l389299p787466j1743128j3104618j5044152j8885374
$$ 711747825 726627052 730270922 726881623 719094157 707351029 694246411 679202259 660316885
1425.7F60316885k3067058k8050840k8049409j9500673m782974J4239728K5389671
$$ 660316885 637249827 609198987 581149578 561648905 556865931 571105659 596495330
1439.9E96495330K7622640K3594320J5295029Q009315J656055m041135q853257j6057849
$$ 596495330 624117970 647712290 663007319 671016634 672672689 668631554 659778297 643720448
1456.2F43720448k1994770j7592370j5762746k2251189k4757862j2869537K611875
$$ 643720448 621725678 604133308 588370562 566119373 541361511 528491974 531103849
1470.5E31103849J0768116J040399j8957376l6077917n0358713n9714526o2067568
$$ 531103849 541871965 542912364 523954988 487877071 437518358 377803832 315736264
1484.8C15736264o3574553n8558940l2465831L921658L5554558O5776542P7252775
$$ 315736264 252161711 193602771 161136940 165058598 200613156 266389698 343642473
1499.1C43642473N9266627K7748436m039437k2451013o225109J3870895K1323859J8440307
$$ 343642473 402909100 430657536 426618099 404167086 397941977 411812872 433136731 451577038
1515.4D51577038Q861988k783447j3063133j5852392j0627925O29276J4475018K7383417
$$ 451577038 460439026 457655579 444592446 428740054 418112129 418741405 433216423 460599840
1531.7D60599840M0574550M0945828L6817730M4154286M0269852K4272203J5586734
$$ 460599840 501174390 542120218 578937948 623092234 663362086 687634289 703221023
1546G03221023R855151N699098K313197n93901l139197p212580j0637045r608268j2586415
$$ 703221023 713076174 718775272 721088469 720494568 717355371 710142791 699505746 689897478 677311063
1564.3F77311063j8279791k6525080l5386980l6499023m9027205p3976993m4324428
$$ 677311063 659031272 632506192 597119212 560620189 511592984 437615991 393291563
1578.6C93291563K7513295O7290306L8261831k1726012n8160722o7186624o2407464
$$ 393291563 420804858 488095164 526356995 504630983 446470261 379283637 316876173
1592.9C16876173n1388979l9354041k9833898j7501086J1169329O0352817J05543584
$$ 316876173 265487194 226133153 196299255 178798169 189967498 250320315 355863899
1607.2C55863899J05185926N1635593q956134n2569777q3996355q2423151o9247752
$$ 355863899 461049825 512685418 503729284 451159507 367163152 284740001 215492249
1621.4B15492249n3372831j3887390L4730136P3368117Q6780221Q8230729R2801809
$$ 215492249 162119418 148232028 182962164 256330281 343110502 431341231 524143040
1635.7E24143040P2000206M3969690L2539845K5380015K1017194J6638696R141326
$$ 524143040 596143246 640112936 672652781 698032796 719049990 735688686 744830012
1650G44830012N450547O583631P383883Q514822J0883271J2606442J1625827Q170366
$$ 744830012 750280559 756864190 764248073 772762895 783646166 796252608 807878435 816048801
1666.3H16048801O177902N895019M863679L799260L699660L298044K367020J466036
$$ 816048801 822226703 828121722 832985401 836784661 840484321 843782365 846149385 847615421
1682.6H47615421J813948K339244J509309P89404J27434p14600j047909q74817l68536
$$ 847615421 849429369 851768613 853277922 854067326 854194760 853480160 852432251 851557434 851188898
1701H51188898K14040k03788o17981q34763j330018j783311k037883j451910L2783
$$ 851188898 851402938 851199150 850581169 849746406 848416388 846633077 844595194 843143284 843176067
1719.3H43176067M47869p4029j25348K87473N88536L96192J39535O62267O80446L17038
$$ 843176067 843623936 843549907 843424559 843712032 844300568 844696760 844836295 845498562 846179008 846496046
1739.7H46496046K63989O9022m42744r70959j210273q47101n98311q32796q40426p65681
$$ 846496046 846760035 846829057 846386313 845415354 844205081 843357980 842759669 841926873 841086447 840320766
1760.1H40320766q13603p93636j105428j476169j410544p86244K77042N21541J4603
$$ 840320766 839507163 838713527 837608099 836131930 834721386 833935142 834212184 834733725 834748328
1778.5H34748328k02060P0214K42830J26004j49667l72768o6519K82049l4630m95076
$$ 834748328 834546268 834616482 834859312 834985316 834835649 834462881 834396362 834678411 834643781 834148705
1798.9H34148705m21286J16170K46942k72930q96275j010537n88834n6148N22733J030743
$$ 834148705 833727419 833843589 834090531 833817601 832921326 831910789 831321955 831265807 831788540 832819283
1819.3H32819283R83298N07057J54912j88649n10811l29197k03609m17710k76327J9372
$$ 832819283 833802581 834309638 834464550 834275901 833765090 833435893 833232284 832814574 832538247 832557619
1839.7H32557619k05636n28396k91943k16067n23388o63102o54936n32150j88828J59443
$$ 832557619 832351983 831823587 831531644 831315577 830792189 830129087 829474151 828942001 828753173 828912616
1860.1H28912616K38240J97708Q1182J0371K56717L39449o5387m99010n59032m38630
$$ 828912616 829150856 829348564 829429746 829440117 829696834 830036283 829970896 829471886 828912854 828474224
1880.5H28474224m61996n34534n80132p26641o52194m59194o32942r34660j123488
$$ 828474224 828012228 827477694 826897562 826170921 825518727 825059533 824426591 823491931 822368443
1898.8H22368443j441240j987517k347410k264261j729131o41107N93245J116693Q59856
$$ 822368443 820927203 818939686 816592276 814328015 812598884 811957777 812551022 813667715 814527571
1917.2H14527571L32475m80116j460671j961708j669407o58512N66542J133204Q54790
$$ 814527571 814860046 814379930 812919259 810957551 809288144 808629632 809196174 810329378 811184168
1935.5H11184168L41713J04666J18732K78652M71115M70937J92701q1837n7161j7583
$$ 811184168 811525881 811630547 811749279 812027931 812499046 812969983 813162684 813080847 813023686 813006103
1955.9H13006103k10285l98517n56648q85367j162529j175761j246333j446128j507223
$$ 813006103 812795818 812397301 811840653 810955286 809792757 808616996 807370663 805924535 804417312
1974.3H04417312j569629j636982j305162p54834m65452l23713j85073l55780p14183
$$ 804417312 802847683 801210701 799905539 799150705 798685253 798361540 798176467 797820687 797106504
1992.6G97106504q78870j099706j455664j479984j148641q78453n62072L1889N01453
$$ 797106504 796227634 795127928 793672264 792192280 791043639 790165186 789603114 789635003 790136456
2011G90136456M95494J80840k27570m96626k73764M35948J075864J297891J347125
$$ 790136456 790631950 790812790 790585220 790088594 789814830 790250778 791326642 792624533 793971658
2029.4G93971658J332342J177013R60827O72400L45051K90931M46677M02868K63989
$$ 793971658 795304000 796481013 797441840 798114240 798459291 798750222 799196899 799599767 799863756
2047.7G99863756K10106K8908k00569k22385k29776l13223k13623j7285R596k0444
$$ 799863756 800073862 800102770 799902201 799679816 799450040 799136817 798923194 798905909 798915505 798895061
2068.1G98895061L159o2585j87993k22504k73466m10199m55678l95000l52204k75910
$$ 798895061 798898220 798835635 798647642 798425138 798151672 797741473 797285795 796890795 796538591 796262681
2088.5G96262681j37388j28627k09153j34945j6451n6147j35779j80126l13222m20213
$$ 796262681 796125293 795996666 795787513 795652568 795636117 795579970 795444191 795264065 794950843 794530630
2108.9G94530630l74734l45409l92795l77595l45469m00483m60863n13793o31511o99043
$$ 794530630 794155896 793810487 793417692 793040097 792694628 792294145 791833282 791319489 790687978 789988935
2129.3G89988935n71966l38972j12891N8711O6101j03772k49683k95699l17276k46167
$$ 789988935 789416969 789077997 788965106 789023817 789089918 788986146 788736463 788440764 788123488 787877321
2149.7G87877321j00195p2181j76609k70486l63529m83691n78583o76512p80940p93100
$$ 787877321 787777126 787704945 787528336 787257850 786894321 786410630 785832047 785155535 784374595 783581495
2170.1G83581495o98268n63383l58045n3108K10643L03924K82585J71662j7405j62482
$$ 783581495 782883227 782319844 781961799 781908691 782119334 782423258 782705843 782877505 782860100 782697618
2190.5G82697618k20299k70247l19422l09288k58863k17438j98245k00510k30074j94549
$$ 782697618 782477319 782207072 781887650 781578362 781319499 781102061 780903816 780703306 780473232 780278683
2210.9G80278683m3333Q0049P5996N841q2135j90437l02493m39227n75304o61969o54757
$$ 780278683 780235350 780315399 780391395 780397236 780315101 780124664 779822171 779382944 778807640 778145671 777490914
2233.3G77490914m60684j10686J91986K88964J72972l9577j97172k75672l16024l47256
$$ 777490914 777030230 776919544 777111530 777400494 777573466 777533889 777336717 777061045 776745021 776397765
2253.7G76397765l95060m44889m76539m88997m95255m91201m47393l53515k75254k52486
$$ 776397765 776002705 775557816 775081277 774592280 774097025 773605824 773158431 772804916 772529662 772277176
2274.1G72277176k37763k43544k72632k67088k76029l84033n36263o07908n54561m37856
$$ 772277176 772039413 771795869 771523237 771256149 770980120 770596087 770059824 769451916 768897355 768459499
2294.5G68459499l52562l62157m53115n34594n73516o12080o33717o51657p30693r06528
$$ 768459499 768106937 767744780 767291665 766757071 766183555 765571475 764937758 764286101 763555408 762648880
2314.9G62648880j213789j569807j734614j615107j515806j743615k035081j902819
$$ 762648880 761435091 759865284 758130670 756515563 754999757 753256142 751221061 749318242
2331.2G49318242j407623q74520k24769N30422J077473J481295K056479J907468M18663
$$ 749318242 747910619 747036099 746811330 747341752 748419225 749900520 751956999 753864467 754283130
2349.6G54283130j343310k234518k118409j593769r03546j54019O35386J301527J680732
$$ 754283130 752939820 750705302 748586893 746993124 746089578 745935559 746570945 747872472 749553204
2367.9G49553204J843452J825273J640380J445412J304686J126886Q48114N10335J78993
$$ 749553204 751396656 753221929 754862309 756307721 757612407 758739293 759587407 760097742 760276735
2386.3G60276735p4685j82569j47521q0109q4639j60634k78890l94404m66824m79281
$$ 760276735 760202050 760019481 759871960 759791851 759707212 759546578 759267688 758873284 758406460 757927179
2406.7G57927179m75108n01156n29647n35846n08249m06265k70665k33709k97785l38137
$$ 757927179 757452071 756950915 756421268 755885422 755377173 754970908 754700243 754466534 754168749 753830612
2427.1G53830612l38018l59476l56912l36707l72291m13179m15862m42505n31852o26445
$$ 753830612 753492594 753133118 752776206 752439499 752067208 751654029 751238167 750795662 750263810 749637365
2447.5G49637365o74367o58035n56588m01259k91228k32220j90138j51456n4538O9201
$$ 749637365 748962998 748304963 747748375 747347116 747055888 746823668 746633530 746482074 746427536 746496737
2467.9G46496737J55210K27035L06725L05295J74046L0756n9128j54972k70903l26336
$$ 746496737 746651947 746878982 747185707 747491002 747665048 747695804 747636676 747481704 747210801 746884465
2488.3G46884465l09348l10779l34620l55721m19855n22554o08861o46532o19053n20111
$$ 746884465 746575117 746264338 745929718 745573997 745154142 744631588 744022727 743376195 742757142 742237031
2508.7G42237031l93271k99931k57790k80261l76761m74691n44906o59167p52986p82013
$$ 742237031 741843760 741543829 741286039 741005778 740629017 740154326 739609420 738950253 738197267 737415254
2529G37415254q13603p86901o81400o25670o54757o66380o37293o22630n80192n08666
$$ 737415254 736601651 735814750 735133350 734507680 733852923 733186543 732549250 731926620 731346428 730837762
2549.4G30837762n19395n28991l91841k22027j15931l1531o2466k55405m41611n87285
$$ 730837762 730318367 729789376 729397535 729175508 729059577 729028046 728965580 728710175 728268564 727681279
2569.8G27681279p71999q99017q66413p65979o17743l54767q7380O1750J08183P6651
$$ 727681279 726909280 726010263 725143850 724377871 723760128 723405361 723317981 723379731 723487914 723564565
2590.2G23564565k0385r1493r0658j07348j24455o7115j00970l75748p10725r27449
$$ 723564565 723544180 723452687 723362029 723254681 723130226 723063111 722962141 722586393 721875668 720948219
2610.6G20948219r66072o39140Q0227P85649J091302J002431O70969K64585R358o9022
$$ 720948219 719982147 719343007 719423234 720208883 721300185 722302616 722973585 723238170 723247528 723178506
2631G23178506r9540k0742J98126L42726L66628M03882L55303J59740L457p5698j53660
$$ 723178506 723078966 723058224 723256350 723599076 723965704 724369586 724724889 724884629 724888086 724812388 724658728
2653.5G24658728j51277k0862J01269J21772N6922p4088j93894k10285j78159k40921
$$ 724658728 724507451 724486589 724587858 724709630 724766552 724692464 724498570 724288285 724110126 723869205
2673.9G23869205l50833l92080m35829n32865n79536n41032n01573m17888k47359j50085
$$ 723869205 723518372 723126292 722690463 722157598 721578062 721037030 720535457 720117569 719870210 719720125
2694.3G19720125k01642k94984m04238n38946n75006n22554n16772n25176n14031n47945
$$ 719720125 719518483 719223499 718819261 718280315 717705309 717182755 716665983 716140807 715626776 715078831
2714.6G15078831n78821n29945m97579n29647n10097n15818o17028o30915n53131n01871
$$ 715078831 714500010 713970065 713472486 712942839 712432742 711916924 711299896 710668981 710115850 709613979
2735G09613979n00739n24580m77910k80559K0146K00927J45912K6763n6505k01822
$$ 709613979 709113240 708588660 708110750 707830191 707850337 708051264 708197176 708223939 708167434 707965612
2755.4G07965612m08172n47171n74708n38826m76181m26054m12464l50893k06232q4162
$$ 707965612 707557440 707010269 706435561 705896735 705420554 704994500 704582036 704231143 704024911 703940749
2775.8G03940749K5451J50860J48475L8087J7464O6758K4378n5909o0797p0870j31667
$$ 703940749 703966200 704117060 704265535 704303622 704321086 704387844 704412222 704356313 704295516 704224646 704092979
2798.3G04092979j62124j39296j49668k38955l69608n44727p40289q63135q86381q25226
$$ 704092979 703930855 703791559 703641891 703402936 703033328 702488601 701748312 700885177 699998796 699173570
2818.7F99173570o84321n43356m93646n40316o68466q50320r71913r66072r88067j236796
$$ 699173570 698489249 697945893 697452247 696911931 696243465 695393145 694421232 693455160 692467093 691230297
2839.1F91230297j602650j819670j845121j738489j454770q88348j29998N43654R79364
$$ 691230297 689627647 687807977 685962856 684224367 682769597 681881249 681751251 682294905 683274269
2857.4F83274269J110315R07898N01633J21474p4923q0704q35M8816K3783o1691j94133
$$ 683274269 684384584 685292482 685794115 685915589 685840666 685759962 685759127 685807943 685831726 685770035 685575902
2879.9F85575902l77833n65291o82890p21038p11619o54877n51164m70281m04894k91765
$$ 685575902 685198069 684632778 683949888 683228850 682517231 681862354 681311190 680840909 680436015 680144250
2900.2F80144250k37941l81708o78480r84669j244306j488269j652717j547754j058877
$$ 680144250 679906309 679524601 678846121 677861452 676617146 675128877 673476160 671928406 670869529
2918.6F70869529k91824M63247Q89123R45329P73847M35353M8220k57254n21540q05736
$$ 670869529 670577705 671040952 671930075 672875404 673649251 674084604 674132824 673875570 673354030 672548294
2939F72548294j089573j372933j625717j789510j867771j841724j617074j148403n45800
$$ 672548294 671458721 670085788 668460071 666670561 664802790 662961066 661343992 660195589 659649789
2957.4F59649789M3631N79536R71198J063824Q74519M89414j8895m42505o28292o44446
$$ 659649789 659693420 660272956 661244154 662307978 663182497 663671911 663653016 663210511 662582219 661937773
2977.8F61937773m50909N3465O36936R97007J069724Q50439M32193J4127l73841p31170
$$ 661937773 661486864 661540329 662177265 663174272 664243996 665094435 665526628 665540755 665166914 664435744
2998.1F64435744j003980j247585j542330j889646k170920k233267k088189j870334
$$ 664435744 663431764 662184179 660641849 658752203 656581283 654348016 652259827 650389493
3014.5F50389493j639665j362800r66788l56793N73993J643240K236605K020061J319826
$$ 650389493 648749828 647387028 646420240 646063447 646637440 648280680 650517285 652537346 653857172
3032.8F53857172N80787j4424m41671p37905r97126j371920j910866k462744k923310
$$ 653857172 654437959 654423535 653981864 653243959 652246833 650874913 648964047 646501303 643577993
3051.2F43577993l372252l968895m789710n600214n692958m367114j887321M00424
$$ 643577993 640205741 636236846 631447136 625846922 620153964 615786850 613899529 614299953
3067.5F14299953J281917P22349m10021j092135o13750J199723L670037N328834N298614
$$ 614299953 615581870 616304219 615894198 614802063 614188313 615388036 619058073 624386907 629685521
3085.8F29685521M243374L123283K104342J103104J71184o54161j331866j781940j978338
$$ 629685521 633928895 637052178 639156520 640259624 640430808 639776647 638444781 636662841 634684503
3104.2F34684503j903057j385689l82483P18951J357079J363695J049816O82473M84229
$$ 634684503 632781446 631395757 631013274 631732225 633089304 634452999 635502815 636185288 636669517
3122.6F36669517P10308J218379J667678J924098K012372K022206K021611J896978
$$ 636669517 637379825 638598204 640265882 642189980 644202352 646224558 648246169 650143147
3138.9F50143147J512587J059115O96003M01378K69770K76506K49624J82510K10523
$$ 650143147 651655734 652714849 653410852 653812230 654082000 654358506 654608130 654790640 655001163
3157.2F55001163L15905K68817n2810n03540q89957j128912j214087j215577j176595
$$ 655001163 655317068 655585885 655533075 655029535 654139578 653010666 651796579 650581002 649404407
3175.6F49404407j030803p86007n94437n74708q14140j243233j533211j468181j088262
$$ 649404407 648373604 647587597 646993160 646418452 645604312 644361079 642827868 641359687 640271425
3193.9F40271425n19097O3897M48167N49674M57227K50518p4684n05567r37819j198590
$$ 640271425 639752328 639816225 640264392 640814066 641271293 641521811 641447127 640941560 640003741 638805151
3214.3F38805151j250744j175463r39965o24419m32550l54469l24965m22537o14941
$$ 638805151 637554407 636378944 635438979 634814560 634382010 634027541 633702576 633280039 632665098
3232.7F32665098p82609r59575j093209j097679j089812j103103r53376o60837n02705
$$ 632665098 631882489 630922914 629829705 628732026 627642214 626539111 625585735 624924898 624422193
3251.1F24422193n50390o36935o51777p02202q44061r09567q91567q71419q47161q94249
$$ 624422193 623871803 623234868 622583091 621880889 621036828 620127261 619235694 618364275 617517114 616622865
3271.4F16622865r77933r93729r64701r42051r67205j003206j023352j006246r06765
$$ 616622865 615644932 614651203 613686502 612744451 611777246 610774040 609750688 608744442 607837677
3289.8F07837677q98361j058281j234531j368523j357794j153886j000523j173318
$$ 607837677 606939316 605881035 604646504 603277981 601920187 600766301 599765778 598592460
3306.1E98592460j562297j838148j885772j801371j769126j819908j827121j738727
$$ 598592460 597030163 595192015 593306243 591504872 589735746 587915838 586088717 584349990
3322.4E84349990j729965j996994k268970k292753k229631k103805j958728k109110
$$ 584349990 582620025 580623031 578354061 576061308 573831677 571727872 569769144 567660034
3338.8E67660034k453029k602220k611578k519488k315283k446592k879202k992809
$$ 567660034 565207005 562604785 559993207 557473719 555158436 552711844 549832642 546839833
3355.1E46839833k784371k676308k786935k800822k512932k359688k710819l181696
$$ 546839833 544055462 541379154 538592219 535791397 533278465 530918777 528207958 525026262
3371.4E25026262l172398k767265k476096k382397k361358k313375k147794j841783
$$ 525026262 521853864 519086599 516610503 514228106 511866748 509553373 507405579 505563796
3387.7E05563796j495660j540363j927852j927585j421660j158058j601637k038002
$$ 505563796 504068136 502527773 500599921 498672336 497250676 496092618 494490981 492452979
3404D92452979j750588j274705j156986j211852j291841j300752j103312q82566p79927
$$ 492452979 490702391 489427686 488270700 487058848 485767007 484466255 483362943 482480377 481700450
3422.4D81700450o35058m05192k64972l14266k68221n2631j23173m02361l48985n454
$$ 481700450 481065392 480660200 480395228 480080962 479812741 479760110 479636937 479234576 478885591 478880137
3442.8D78880137K68221L96013M51535M96328N61834O52462P72267Q77083Q55416R05067
$$ 478880137 479148358 479544371 479995906 480492234 481054068 481706530 482478797 483355880 484211296 485116363
3463.2D85116363J190990J296669R18716N12213N90622R19879J181483J161128Q61496
$$ 485116363 486307353 487604022 488522738 489034951 489625573 490545452 491726935 492888063 493749559
3481.5D93749559Q42601J085252J065701R41425J028151J146733J169891J129567J085997
$$ 493749559 494592160 495677412 496743113 497684538 498712689 499859422 501029313 502158880 503244877
3499.9E03244877J071870R71675Q61645R41217J205623J455426J371563J126527J148045
$$ 503244877 504316747 505288422 506150067 507091284 508296907 509752333 511123896 512250423 513398468
3518.2E13398468J319767J403272J283109J101017J183033J442850J594841J611054
$$ 513398468 514718235 516121507 517404616 518505633 519688666 521131516 522726357 524337411
3534.5E24337411J544893J481056J579642J682043J533211J288652J289487J425803
$$ 524337411 525882304 527363360 528943002 530625045 532158256 533446908 534736395 536162198
3550.9E36162198J520156J608074J660764J700521J620114J299321J105369J577079
$$ 536162198 537682354 539290428 540951192 542651713 544271827 545571148 546676517 548253596
3567.2E48253596K221584K171874J855433J798153J919687K074897K153993J976371
$$ 548253596 550475180 552647054 554502487 556300640 558220327 560295224 562449217 564425588
3583.5E64425588J597762J611233K134501K159119J845241J940131K206743K204299
$$ 564425588 566023350 567634583 569769084 571928203 573773444 575713575 577920318 580124617
3599.8E80124617K109408J949251J607358J535833J824915J946390J877427J600981
$$ 580124617 582234025 584183276 585790634 587326467 589151382 591097772 592975199 594576180
3616.1E94576180J393199J770914J984417J490176P42376O19113J578152J905322J484394
$$ 594576180 595969379 597740293 599724710 601214886 601957262 602576375 604154527 606059849 607544243
3634.5F07544243J173437J010299R12785P54476L51846j53482N3585J075804J220167
$$ 607544243 608717680 609727979 610640764 611395240 611747086 611593604 611647189 612722993 613943160
3652.8F13943160O44147O80029R87530O47664K26379P1764k89500o07252k05815j83344
$$ 613943160 614587307 615267336 616254866 616902530 617128909 617200673 616911173 616303921 616098106 615914762
3673.2F15914762m78506L33250R22143P35283M59671J05619k52843k15232L27587O67036
$$ 615914762 615436256 615769506 616691649 617426932 617886603 617992222 617739379 617524147 617851734 618518770
3693.6F18518770N27858J38045k35498k58148O8426J00971l11733o46770j87456N47290
$$ 618518770 619046628 619184673 618949175 618691027 618759453 618860424 618548691 617901921 617714465 618261755
3714F18261755L89754j85668n10872m83334k93851m1186J14381j66953n89013m58598
$$ 618261755 618651509 618465841 617954969 617471635 617177784 617136598 617250979 617084026 616495013 616036415
3734.4F16036415L47197P89941J37329r44913r66608L6418j24097m18424M10974O99162
$$ 616036415 616383612 617173553 617310882 616365969 615399361 615435779 615311682 614893258 615304232 616003394
3754.8F16003394J24097k12491P272L0816j99259k49087k17140Q94J91569R120k65479
$$ 616003394 616127491 615915000 615922272 615953088 615753829 615504742 615287602 615288496 615480065 615489185 615223706
3777.3F15223706l32058k16722k03192j62125l159j2577j55389l89695o15657o13272
$$ 615223706 614891648 614674926 614471734 614309609 614306450 614293873 614138484 613748789 613133132 612519860
3797.7F12519860o89566m58419J35958J5020r298K70963k6882o17683p99119n32508
$$ 612519860 611830294 611371875 611507833 611522853 611513555 611784518 611757636 611139953 610340834 609808326
3818F09808326n37575k11775K92957J67251m5479k51591m06384m60685p47740o92725
$$ 609808326 609270751 609058976 609351933 609519184 609473705 609222114 608815730 608355045 607607305 606914580
3838.4F06914580K1100L71933L35634J93953k67863j095414j583398k78532Q88586
$$ 606914580 606935680 607307613 607643247 607837200 607569337 606473923 604890525 604611993 605500579
3856.8F05500579M88043k23816n62548k99454j51456m42147k60710J55210K02417o0141
$$ 605500579 605988622 605764806 605202258 604902804 604751348 604309201 604048491 604203701 604406118 604345977
3877.2F04345977n06818m00186q5234j29998n3644k08676m09067q0228j0073m78983
$$ 604345977 603839159 603438973 603353739 603223741 603170097 602961421 602552354 602472126 602462053 601983070
3897.6F01983070p67588o32644k31981L00824M61281J87337r5427k98023m31299l20733
$$ 601983070 601215482 600582838 600350857 600651681 601112962 601300299 601204872 600906849 600475550 600154817
3918F00154817r2029r9481k66432k38836j53899k24233j70291K9922J8358j59085k59637
$$ 600154817 600062788 599963307 599696875 599458039 599304140 599079907 598909616 598939538 598957896 598798811 598539174
3940.4E98539174k45333j78516j92702k08318q3208J7762k5153j27375k28226k68877
$$ 598539174 598293841 598115325 597922623 597714305 597631097 597648859 597623706 597496331 597268105 596999228
3960.8E96999228k03252j47521j73033k16186k31087k21014j78814j34885j60992j72615
$$ 596999228 596795976 596648455 596475422 596259236 596028149 595807135 595628321 595493436 595332444 595159829
3981.2E95159829j20759j54078k43187k44916k03728k03550k44677k87772
$$ 595159829 595039070 594884992 594641805 594396889 594193161 593989611 593744934 593457162
3997.5E93457162
$$ 593457162
##END=$$ End of the data block
