##TITLE=Pirilio-dma2 $$ Begin of the data block
##JCAMP-DX=5.00 $$ ACD/SpecManager v 10.08
##SPECTROMETER/DATA SYSTEM=Alpha
##DATE=23 May 2014 08:10:48
##DATA TYPE=INFRARED SPECTRUM
##DATA CLASS=XYDATA
##ORIGIN=
##OWNER=
##NPOINTS=1765
##FIRSTX=399.75695801
##LASTX=3997.56933594
##MAXX=3997.56933594
##MINX=399.75695801
##MAXY=0.84521508
##MINY=0.14779878
##XFACTOR=1.0000000000
##YFACTOR=1.000000000000000e-9
##FIRSTY=0.78967237
##DELTAX=2.03957629
##XUNITS=1/CM
##YUNITS=ARBITRARY UNITS
##XYDATA=(X++(Y..Y))
399.8G89672375k143026l471374j819313J275540R77814p3791J729369K217770m75407
418.1G87889957j662612q99970k574146l481567m21345J701057k53916k185583k448797
436.5G75663078l450990l656030j11222L661990K889097Q42869J117468J255274k45750
454.8G77965784p41005j49071j859546n396902n655110p42913L580630L460467K336264
473.2G72798598J169503p94530p98762N61476k48790j736224o32584M32849j030684
491.5G69720852j944005p76410q43227k526939k525747j570523k664089m273951l854573
509.9G48741388l593266m990816n276084l507435k931178m573881o493509j0186792
526.2G07188427j7909646k9509365m3952644n1739931l0164957K3204565O5220058
$$ y = [789672375, 787529349, 784057975, 782238662, 783514202, 784492016, 784418225, 786147594, 788365364, 787889957, 786227345, 785327375, 782753229, 779271662, 778850317, 780551374, 780297458, 778111875, 775663078, 772212088, 768556058, 768444836, 772106826, 774995923, 775838792, 776956260, 778211534, 777965784, 777224779, 777075708, 775216162, 769819260, 764164150, 763421237, 767001867, 770462334, 772798598, 773968101, 773173571, 772374809, 772936285, 772687495, 770951271, 770318687, 770751536, 769720852, 767776847, 767000437, 766157210, 763630271, 761104524, 759534001, 756869912, 752595961, 748741388, 745148122, 740157306, 734881222, 731373787, 728442609, 723868728, 717375219, 707188427, 689278781, 659769416, 615816772, 564076841, 533911884, 557116449, 622336507]
540.5F22336507O2801897L5893977J5218020N681693O54519k204359k940774m286468
556.8G33155012p255256r486556j1323214j6885340k9503643m9481631o3922524l9217830
573.1E06079018K9652178Q2149506P4271143L9434611J5464068N543411J402616m16219
589.4G53580332k05696m17530k100408l496170l481806m423320o719351q702218j0998011
607.8G13035822j6195595k6260853m1800738n7165086o8549752o8806380l6443144
622.1C97814274Q687705K6857286K9645115M8958749P6980054O2911213K1124959K1388233
638.4F94367588M3610692L2880842M302562j7995120l5694360l8897217j4805793K4612665
654.7F92381859M5181870L6007703J8832743O225705j123846n024731q064866r311199
$$ y = [622336507, 685138404, 721032381, 736250401, 741932094, 742586613, 740382254, 737441480, 733155012, 725899756, 716413200, 705089986, 688204646, 658701003, 609219372, 545296848, 506079018, 535731196, 617880702, 692151845, 731586456, 747050524, 752593935, 753996551, 753580332, 753374636, 752957106, 750856698, 747360528, 743878722, 739455402, 732736051, 724033833, 713035822, 696840227, 670579374, 628778636, 571613550, 503063798, 434257418, 397814274, 406501979, 433359265, 463004380, 511963129, 588943183, 651854396, 672979355, 694367588, 737978280, 770859122, 775161684, 757166564, 721472204, 682574987, 667769194, 692381859, 737563729, 773571432, 792404175, 798629880, 797506034, 792481303, 784416437, 775105238]
671G75105238j0938942r111882j674473K410293j206756r375572k2169233m2590081
687.3F80448592o8117798p0300162j6688823N4955482P7864647N7259917L4234643
701.6G49656498K1345675J4084220P872761K758145J94430k580046p845581j0632276
717.9G74853826o235540j598001n921185j7385185l3216893n2390755n4224729r672940
734.2E94208598N3878665P3449016M9121618K3820937J0800659L533781K15292k36571
750.6H08791995j371622l262878l322958k598644l700614n432188o318271r068966
766.9G73715854j6561628k9855549n1733017p5638771o6924691m557073O3598871Q1876874
783.2F73920870N9458077L3019185J7222941Q188605K416670o72638l859043q127809
$$ y = [775105238, 764166296, 755054414, 753379941, 755790234, 754583478, 745207906, 723038673, 680448592, 612330794, 542030632, 525341809, 580297291, 658161938, 715421855, 749656498, 771002173, 785086393, 792959154, 795717299, 795911729, 793331683, 785486102, 774853826, 768618286, 767020285, 761099100, 743713915, 710497022, 658106267, 603881538, 594208598, 648087263, 721536279, 770657897, 794478834, 805279493, 808813274, 809028566, 808791995, 807420373, 804157495, 800834537, 798235893, 794535279, 789103091, 782784820, 773715854, 757154226, 727298677, 675565660, 599926889, 533002198, 528445125, 592043996, 673920870, 733378947, 766398132, 783621073, 791809678, 794226348, 793553710, 789694667, 781566858]
799.5G81566858q743584k734721L589750L760218L15905l133357o545245r186983j2725056
817.9G46163785k2717058l0501247j5508473O234467n072891m2169929o4113557m9486816
834.2E22828281K823949O6515505R0576708O5788210L2382905J4201284O985128L022968
850.5H05124938j07169j234233o63102j131415k876103l911972m924655p269621p043838
868.9G75962830o23346M799962K614320j966000l977299n505502q142769j0727763
885.2G52434433j3604522j8648207k6338458l5575510m0283501k3335695K0666778
899.4F15315318N7459951N5180966L0430496J1661291L001392j965761n739808q276641
915.8G57067204j1209310j6612172k3891389k5117397r881616J0494649J2590290L329455
$$ y = [781566858, 772823274, 770088553, 773678303, 777438521, 777754426, 774621069, 768075824, 758888841, 746163785, 723446727, 692945480, 677437007, 683671474, 678598583, 636428654, 572315097, 522828281, 525652230, 592167735, 682744443, 748532653, 780915558, 795116842, 802101970, 805124938, 805017769, 803783536, 803120434, 801989019, 799112916, 795200944, 790276289, 783006668, 775962830, 775339484, 780139446, 782753766, 780787766, 776810467, 771304965, 763162196, 752434433, 738829911, 720181704, 693843246, 658267736, 617984235, 594648540, 615315318, 672775269, 727956235, 758386731, 770048022, 773049414, 771083653, 765343845, 757067204, 745857894, 729245722, 705354333, 680236936, 670355320, 680849969, 693440259, 696769714]
932.1F96769714L908933J0800480J0458410L205478l823697r011388j3916016j6252100
948.4F82139814q368909N327880P556856k158404j1348128j7382205k4921298l7591934
964.7E93253672m7765672l8359761k2626579k6336372j9073904K7058453O4307183
979E30457020N2016556J5827179r694099j5220881l420412J2159466J4350236l52681
995.3E96122384j7810643j4586746M035413N532026j0539293k4024844l3510328m4273585
1011.6D60944384n2119046m2922080o405383M2222142O2189967L6095500o281466l5990387
1027.9D57733631m9720287m8372030l2504052j3655335n122185o720424r868443r000867
1044.3B82770008l543884M829854J2165099J3140440P981033N253911J1585742K2443592
$$ y = [696769714, 700678647, 711479127, 721937537, 725143015, 721319318, 712307930, 698391914, 682139814, 673770905, 679098785, 686655641, 684497237, 673149109, 655766904, 630845606, 593253672, 545488000, 507128239, 484501660, 458165288, 439091384, 466149837, 530457020, 582473576, 598300755, 588606656, 573385775, 569965363, 582124829, 596475065, 596122384, 578311741, 563724995, 567760408, 573292434, 562753141, 538728297, 505217969, 460944384, 408825338, 365903258, 359497875, 401720017, 463909984, 500005484, 493724018, 457733631, 408013344, 359641314, 327137262, 313481927, 308359742, 301639318, 291770875, 282770008, 279226124, 284055978, 296221077, 309361517, 317342550, 322596461, 334182203, 356625795]
1060.6C56625795K8784186K7469039K0962357J2378961L701151l111273o094724o677211
1076.9D34038281r064465j4072717j9130349k2622525k4516106k5353998k4786532
1091.2B94491589k2177607j8367588j4861092j2746036j2377426j2339264j0784582
1105.4A90837994o668359j85996L940925P74905p240519j3593540j2663289k967358
1121.8A52234763O068528L278553n745515p881731j55821J3496950K9085457M2714164
1138.1B33095348N1664740N4905444N1965386M4686854L7073880L2178819L0247927
1152.4E35818398K8808355K5943756K1406770J5206635J0632515J2071788J5972734
1166.6F65860951J5805006J1980474P475793K213776n191505j5501618k7090132k9884994
$$ y = [356625795, 385409981, 412879020, 433841377, 446220338, 449921489, 446810216, 440715492, 434038281, 424973816, 410901099, 391770750, 369148225, 344632119, 319278121, 294491589, 272313982, 253946394, 239085302, 226339266, 213961840, 201622576, 190837994, 184169635, 183983639, 187924564, 188699469, 181458950, 167865410, 155202121, 152234763, 158303291, 161581844, 155836329, 147954598, 147798777, 161295727, 190381184, 233095348, 284760088, 339665532, 391630918, 436317772, 473391652, 505570471, 535818398, 564626753, 590570509, 611977279, 627183914, 637816429, 649888217, 665860951, 681665957, 693646431, 701122224, 703336000, 698144495, 682642877, 655552745, 625667751]
1182.9F25667751j1291027J9760549L7746370L4182906K0317852R834707Q606613R520888
1199.3G54346609N242288j532674p874548j5562832k4138689k8452635k8136492l0505002
1215.6F23386025l4723579k7553618l774047K3693382L9900780M2333305L6784112
1229.9G00046360K9242695K3202300J8358886J2552679O736219M253924M547178M077793
1246.2H03018034K538681J814723J789331J353323Q35717P17461J68324j075089k097011
1264.5H09063494l084123m836440o606817p066787o742179p322848r670198j4082908
1280.8G49651194k0702243k9255212l9252102m1858613j6097010L1951607N7339370
1295.1F91776991M3897152K0296275N714477k872587j0460019j7110467k1748543k5031030
$$ y = [625667751, 614376724, 634137273, 671883643, 706066549, 726384401, 736219108, 744825721, 754346609, 759588897, 758056223, 750181675, 734618843, 710480154, 682027519, 653891027, 623386025, 588662446, 561108828, 557334781, 581028163, 620928943, 663262248, 700046360, 729289055, 752491355, 770850241, 783402920, 790139139, 794393063, 798940241, 803018034, 805556715, 807371438, 809160769, 810514092, 811349809, 812067270, 812235594, 811160505, 809063494, 805979371, 801142931, 794536114, 787469327, 780727148, 773404300, 763734102, 749651194, 728948951, 699693739, 660441637, 618583024, 602486014, 634437621, 691776991, 735674143, 755970418, 761684895, 758812308, 748352289, 731241822, 709493279, 684462249]
1311.4F84462249k4213731q636653J9266545L1422437J2938141j4297723k7962506
1325.7F72978759l0070424l5370887m6709001m7080516j9812853K7327091O1638236
1340E82900405O1158419M3187558K8747499K1791339J8971682J4923572Q790791L992796
1356.3G84464061J978874J497567J726806K131343J520694N1856n70536N3048M51088
1374.7G93304801N3644l13341q28267j893937k773225l518045n059422p078111r072303
1393G62821794r847641p911087n620419m881919q359373j7053961k0404637q438170
1409.3F80304587J3038516K7740359K6884258J9285738J2095213M947007q6844l479481
1425.7G80729353o576299r758413j0684073q961499r686827j3550282j6718626k3272157
$$ y = [684462249, 660248518, 651611865, 670878410, 702300847, 715238988, 700941265, 672978759, 642908335, 607537448, 560828447, 513747931, 493935078, 521262169, 582900405, 644058824, 687246382, 715993881, 737785220, 756756902, 771680474, 780471265, 784464061, 786442935, 787940502, 789667308, 791798651, 793319345, 793371201, 792800665, 792853713, 793304801, 793358445, 793045104, 792216837, 790322900, 787549675, 784031630, 778972208, 771894097, 762821794, 752974153, 745063066, 739442647, 734560728, 726201355, 709147394, 688742757, 680304587, 693343103, 721083462, 747967720, 767253458, 779348671, 784295678, 784208834, 780729353, 774153054, 764394641, 753710568, 744749069, 735062242, 721511960, 704793334, 681521177]
1442F81521177l6254286n7431043o7649245k8669268K3186058L8828075M0228307M0986598
1458.3F34746373K5614977J2213826K344727q957445j6873718k2242248k9028713l0259729
1474.6E67558050k2127330n920410J7792999L8517476M4944763M0039241L0645013
1488.9G11449802K1358550J5904665J2921035P694125q92580p632672j2529374k3943126
1505.2G24330425m7763765n4752409m1457534j0747135L6409021O3014746M7665655
1519.5G16699004K2327304Q237600N726099Q665622R960413R428620Q304238M962266
1535.8G94311166J475990j363218l844679m069030l055930j510382j083672j844108
1552.1G79016137k696276l209054n727887q551002n515933m119515n083382q219600
$$ y = [681521177, 645266891, 587835848, 520186603, 491517335, 514703393, 553531468, 593759775, 634746373, 660361350, 672575176, 674919903, 665962458, 649088740, 626846492, 597817779, 567558050, 545430720, 539510310, 557303309, 595820785, 640765548, 680804789, 711449802, 732808352, 748713017, 761634052, 769328177, 768435597, 760802925, 748273551, 724330425, 676566660, 621814251, 580356717, 569609582, 606018603, 669033349, 716699004, 739026308, 747263908, 752990007, 761655629, 771616042, 781044662, 789348900, 794311166, 795787156, 794423938, 790579259, 786510229, 783454299, 781943917, 780860245, 779016137, 776319861, 773110807, 767382920, 758831918, 753315985, 749196470, 744113088, 735893488]
1568.4G35893488j3053417j6047001k6051462m6500146l2242954J7137051M5993983
1582.7F65129542K8624595n298317k6514649l6185980l4049928j7371297N374968J4103651
1599E93812585M74095k2032797l4831107l4713745l1282991k9436648k3711532j2439847
1615.3D05838013N040139K7446895N0663889O8561435N9549868L7985980K2918046
1629.6F78004265J2735605P092774K904177j714528n000293q041859j1293828j5775979
1645.9F58910334j6792834j3278246k3523450m9564778n0591231m5299411l5500228
1660.2D24360156n818933K4930179L3542693L7250489M8102617N1404774N1470101
1674.5F65242076M5478940K8394222J6131520J0760129R927630R869814R342313Q822143
$$ y = [735893488, 722840071, 706793070, 680741608, 634241462, 601998508, 619135559, 665129542, 693754137, 688455820, 661941171, 625755191, 591705263, 574333966, 579708934, 593812585, 594286680, 572253883, 537422776, 502709031, 471426040, 441989392, 418277860, 405838013, 410878152, 438325047, 488988936, 557550371, 617100239, 655086219, 678004265, 690739870, 697832644, 700736821, 699022293, 694022000, 685980141, 674686313, 658910334, 642117500, 628839254, 605315804, 555751026, 505159795, 459860384, 424360156, 418541223, 443471402, 477014095, 514264584, 562367201, 613771975, 665242076, 710721016, 739115238, 755246758, 766006887, 775934517, 785804331, 795146644, 803968787]
1690.8H03968787O927490N831838N060434L796399K918243J871467J132369J107633
1707.1H32614660R66788N32090J48714R3698L43800P16090J269937J518845J223922
1725.5H39428544O66201O02126O97971M06861J80185N32865P51376N40197M68076N56886
1745.9H44831288L83794k35975m06026p5460r4593k28106P3909K97368L4094k48313
1766.3H44331980l59416n54264j041889q27134k89678n57781j256346j328051r42231
1784.6H37175190q83936q13306p2479J302540J883507J511216J023352L78132l24189
1803H41180027m21465r9778j90377o49810o84261m43519p43568j031875l82602O08623
1823.4H37141395Q66651N84960L66926Q2493k53260k99990l3796K801l61859o63102
$$ y = [803968787, 810896277, 816728115, 821788549, 825584948, 828503191, 830374658, 831507027, 832614660, 833581448, 834113538, 834262252, 834355950, 834699750, 835415840, 836685777, 838204622, 839428544, 840094745, 840696871, 841394842, 841801703, 841981888, 842514753, 843266129, 843806326, 844274402, 844831288, 845215082, 844979107, 844573081, 844497621, 844403028, 844174922, 844248831, 844546199, 844580293, 844331980, 843972564, 843418300, 842376411, 841549277, 841259599, 840701818, 839445472, 838117421, 837175190, 836291254, 835477948, 835405469, 836708009, 838591516, 840102732, 841126084, 841504216, 841180027, 840758562, 840658784, 840468407, 839818597, 839134336, 838690817, 837947249, 836915374, 836532772, 837141395, 838008046, 838593006, 838959932, 839042425, 838789165, 838489175, 838455379, 838458180, 838096321, 837433219]
1843.8H37433219m12345r8228M4286M77254Q52883O52790L35455L49522K07662k33769
1864.2H39608729m17590k70546l02851m64261k90632o675j93060n73575m62056j39653
1884.6H36487830k12610m86493m40479m05490q34167j154184j007796j031875j431644
1902.9H29483092j716137k011180k983928m411936n139410m241824j257956K910614
1919.2H10631335N323887M760921K583921Q78989J91391l07739q33213p60913j08540
1937.6H22360039J84476j98603n43773n96404p91669q65042n14388l35753p00235j051605
1958H16947043j042187j150966j528203j577795j150846j031101j581252j999915j446604
1976.3H04438174J29521J997172L046334K746046J614332N88417K2054m42386q72314
$$ y = [837433219, 837020874, 836922646, 836966932, 837444186, 838297069, 838949859, 839285314, 839634836, 839842498, 839608729, 839191139, 838920593, 838617742, 838153481, 837862849, 837856174, 837663114, 837089539, 836627483, 836487830, 836275220, 835788727, 835348248, 834942758, 834108591, 832954407, 831946611, 830914736, 829483092, 827766955, 825755775, 822771847, 818359911, 813220501, 808978677, 807720721, 810631335, 815955222, 820716143, 823300064, 824179053, 824370444, 824062705, 823229492, 822468579, 822360039, 822544515, 822345912, 821802139, 821205735, 820414066, 819549024, 819034636, 818698883, 817998648, 816947043, 815904856, 814753890, 813225687, 811647892, 810497046, 809465945, 807884693, 805884778, 804438174, 804567695, 806564867, 809611201, 812357247, 813971579, 814559996, 814582050, 814139664, 813267350]
1994.7H13267350p72357j13547L71397K74420R417j81615n56231j045704j236677j183331
2015.1H08833122j216531j274526j211464j199484j319945j243233o92130J03593P50423
2033.4H01529825J175940J337468J058758M88102N5134o6816N364K50638O79195J058518
2053.8H07572126J142741J028061R24706Q57770P90477Q13663R25362Q70467O11305
2072.2H15536678M16875L41296J72913n8174j51634j42277j71780j77801m8578N2512
2092.6H15770030k7716j39594j29998j24872k23756l17335l16679k67208k21014j38640
2113H13863218l1591J0491k8074n8055p1466j26660j93059j95265j78635k39909l00824
2135.4H12450171k83778k51889k48254k39849k04384j85549k42651l04818k66016j87933
$$ y = [813267350, 812494993, 812381446, 812752843, 813027263, 813036680, 812855065, 812298834, 811253130, 810016453, 808833122, 807616591, 806342065, 805130601, 803931117, 802611172, 801367939, 800675809, 800779402, 801529825, 802705765, 804043233, 805101991, 805590093, 805645227, 805578411, 805583775, 805834413, 806513608, 807572126, 808714867, 809742928, 810667634, 811525404, 812315881, 813129544, 814054906, 814925373, 815536678, 815953553, 816294849, 816467762, 816409588, 816257954, 816115677, 815943897, 815766096, 815717518, 815770030, 815742314, 815602720, 815472722, 815347850, 815124094, 814806759, 814490080, 814222872, 814001858, 813863218, 813831627, 813842118, 813814044, 813755989, 813684523, 813557863, 813364804, 813169539, 812990904, 812750995, 812450171, 812166393, 811914504, 811666250, 811426401, 811222017, 811036468, 810793817, 810488999, 810222983, 810035050]
2155.8H10035050j69039j67310j25885j14679j53840j54316q9586p1168j41323j85132
2176.2H08662772j51455j20878j11938m9353K5809M649o7293n9903j9908o1691j22487
2198.6H07928324j23680j50025k59995l36647k92659k12312j83403j68383j59622k28464
2219H05813134l46840m07159m13775m22657l90232k76625j64985j42038j24753k1934
2239.4H03102136L3736o9380j83344j69575j36077j68682j46687k2649M2438m0829
2259.8H02241087j28925j11461q4281p0810K5928J03116m053j83761k63929l22283
2280.2H01200628m40359m95076m50373m32551n21600o45459p30276q35418r20713q33810
2300.6G94894993o14583m60386m05550l86000m32849n46515o05226n98490p14481r56893
$$ y = [810035050, 809866011, 809698701, 809572816, 809458137, 809304297, 809149981, 809060395, 808989227, 808847904, 808662772, 808511317, 808390439, 808278501, 808229148, 808254957, 808259606, 808192313, 808132410, 808112502, 808050811, 807928324, 807804644, 807654619, 807394624, 807057977, 806765318, 806553006, 806369603, 806201220, 806041598, 805813134, 805466294, 805059135, 804645360, 804222703, 803832471, 803555846, 803390861, 803248823, 803124070, 803102136, 803135872, 803066492, 802883148, 802713573, 802577496, 802408814, 802262127, 802239478, 802281916, 802241087, 802112162, 802000701, 801916420, 801845610, 801871538, 801974654, 801970601, 801786840, 801522911, 801200628, 800760269, 800265193, 799814820, 799382269, 798860669, 798215210, 797484934, 796649516, 795728803, 794894993, 794280410, 793820024, 793414474, 793028474, 792595625, 792049110, 791443884, 790845394, 790130913, 789174020]
2321G89174020j052618r38177q74221q00967m43757m3631l4809l76939p11859p58707
2341.4G83138335l67761N73754J289010Q83282j22309q49009r68396q12114n99920
2359.8G82164872l06487O735J46270J09613Q7022J06514O5207K7359Q3029R5964n3346
2382.2G82532752k46346l41952l60251l71098l37243k59459k65897l72529m23014m09365
2402.6G79145598m86075o00934n93186n36144o02245p51615q66294r70840j124978
2421G72613287j284361j387238j475275j567423j565457j453936j358628j357198j430511
2439.3G59733260j511932j552641j463235j112401n99146j37329K96295P95543J226306
2457.7G55674720J452565J569211J652658J600802J360059J035869P44999M59611J10448
$$ y = [789174020, 788121402, 787183225, 786309004, 785508037, 785064280, 785020649, 784985840, 784608901, 783897042, 783138335, 782770574, 783344328, 784633338, 785516620, 785394311, 784545302, 783576906, 782764792, 782164872, 781858385, 781865120, 782011390, 782121003, 782208025, 782314539, 782379746, 782407105, 782490134, 782586098, 782532752, 782286406, 781944454, 781584203, 781213105, 780875862, 780616403, 780350506, 779977977, 779554963, 779145598, 778659523, 778058589, 777465403, 776929259, 776327014, 775575399, 774709105, 773738265, 772613287, 771328926, 769941688, 768466413, 766898990, 765333533, 763879597, 762520969, 761163771, 759733260, 758221328, 756668687, 755205452, 754093051, 753493905, 753356576, 753652871, 754448414, 755674720, 757127285, 758696496, 760349154, 761949956, 763310015, 764345884, 765090883, 765550494, 765660942]
2476G65660942k11776m36306o62923r53614j239062j479327j730562j979470k086699
2494.4G54881203j949787j612902j162171o50823j84775J53661M04001O07967P14779
2512.7G51201153O75380N25653L40701J75356O4791N5432J02580O1333o2168j43587
2533.1G52996624k02716l23355m76897n85973o28233o52492o40392n34118m32491m49300
2553.5G48070657n26368n68748o27816p61926q73983r14037r73284j079023j159430
2571.9G40586042j205980j225472j174569j065552r56238r30726r59396q15630m21644
2590.2G31830835M2320L96311N71489N50986L68535J63674L6955p3492j90497k39491
2610.6G33457625k54572l63945n22972n36263m50253m79102n49019m72247l34561k91169
$$ y = [765660942, 765449166, 765012860, 764349937, 763396323, 762157261, 760677934, 758947372, 756967902, 754881203, 752931416, 751318514, 750156343, 749505520, 749320745, 749474406, 749878407, 750486374, 751201153, 751876533, 752402186, 752742887, 752918243, 752983034, 753038466, 753141046, 753202379, 753140211, 752996624, 752793908, 752470553, 751993656, 751407683, 750779450, 750126958, 749486566, 748952448, 748519957, 748070657, 747544289, 746975541, 746347725, 745585799, 744711816, 743797779, 742824495, 741745472, 740586042, 739380062, 738154590, 736980021, 735914469, 734958231, 734027505, 733068109, 732252479, 731830835, 731873155, 732269466, 732840955, 733391941, 733760476, 733924150, 733961105, 733887613, 733697116, 733457625, 733203053, 732839108, 732316136, 731779873, 731329620, 730850518, 730301499, 729829252, 729494691, 729203522]
2631G29203522l03387k76030k48014k64347k47300j87754k29419l75569m66227n63562
2651.4G26041913q40485j228869j509249j581371j457095j028002l03089L35634N93841
2669.8G19023228N99622N41866M30346K80499J65284N0783j67370l88622m24981l62337
2690.2G19748318l95357m84169n29170o79195j057446j413941j522601j533806j624108
2708.5G10508525j727640j793623j865983j832485j604557j415194j512944j827598
2724.8F96928501k268314k792120l242195l616691m128932n013764o206751p321418
2741.2F62338316q172452q804977r194910r215236q625090p151008m751325j789808
2757.5F04633510J063228L178775M295468M586041M470289M417002M772306N429566
$$ y = [729203522, 728900135, 728624105, 728376091, 728111744, 727864444, 727676690, 727447271, 727071702, 726605475, 726041913, 725201428, 723972559, 722463310, 720881939, 719424844, 718396842, 718093753, 718429387, 719023228, 719622850, 720164716, 720595062, 720875561, 721040845, 721091628, 720924258, 720535636, 720110655, 719748318, 719352961, 718868792, 718339622, 717660427, 716602981, 715189040, 713666439, 712132633, 710508525, 708780885, 706987262, 705121279, 703288794, 701684237, 700269043, 698756099, 696928501, 694660187, 691868067, 688625872, 685009181, 680880249, 675866485, 669659734, 662338316, 654165864, 645360887, 636165977, 626950741, 618325651, 611174643, 606423318, 604633510, 605696738, 608875513, 613170981, 617757022, 622227311, 626644313, 631416619, 636846185]
2773.8F36846185N897045N956650N776286N412936M822552M116118L334642K325534
2790.1F74487948J220346M94182K96950L32058M96268R16064J260996J074910N48482
2808.5F81128204R9242j66536l32415n21064q54432j343966j835108k185225k440035
2826.8F71548665k679289k719402k247155j162886K83300J515687K224207K492785
2843.1F69255912K247632J615763J146137J159728J386583J421034J258016R41753
2859.5F80432558M38869q106k34723l64304l84271k55406k18570l45469l53992j72197
2879.9F78534389K4080J54495J82450J9789l96669r15945j228332j213730j007378
2898.2F74153149p57277n25653m11630n38886q74042j251102j579523j749873j515269
$$ y = [636846185, 642743230, 648699880, 654476166, 659889102, 664711654, 668827772, 672162414, 674487948, 675708294, 676202476, 676499426, 676831484, 677327752, 678243816, 679504812, 680579722, 681128204, 681227446, 681060910, 680728495, 680207431, 679352999, 678009033, 676173925, 673988700, 671548665, 668869376, 666149974, 663902819, 662739933, 663023233, 664538920, 666763127, 669255912, 671503544, 673119307, 674265444, 675425172, 676811755, 678232789, 679490805, 680432558, 680871427, 680863321, 680628598, 680264294, 679880023, 679624617, 679406047, 679060578, 678706586, 678534389, 678558469, 678712964, 678895414, 678915203, 678518534, 677602589, 676374257, 675160527, 674153149, 673395872, 672870219, 672458589, 671919703, 671045661, 669794559, 668215036, 666465163, 664949894]
2916.6F64949894p73966K22444J088262J589179J685440J415670Q82328L56555J4186
2934.9F71429992k25544m10140n25832o37054p96497r00746p87377m59135j12295P5698
2955.3F66651070j311n20587j601994k823651k880394r84908J351476K053917J072466
2973.7F62316084l70264j495183k267658k732695k553463j625776n93960j08421k71499
2992F50297165q39472j414955j995205k753437l553748m394829n316914o266772p161916
3010.4F16599917p375001o346345n145610n270958o409168p313132p447005o839752
3026.7E64452946n494356l683388k212525j179754Q41498L858864M771352J588106
3043E62942743l681481p412076p733166n645394l131330j156688K37227J645624L696144
$$ y = [664949894, 664175928, 664398372, 665486634, 667075813, 668761253, 670176923, 671059251, 671415806, 671429992, 671204448, 670794308, 670268476, 669631422, 668834925, 667934179, 667146802, 666687667, 666575372, 666651070, 666649759, 666129172, 664527178, 661703527, 658823133, 657838225, 659189701, 661243618, 662316084, 661945820, 660450637, 658182979, 655450284, 652896821, 651271045, 650677085, 650568664, 650297165, 649457693, 648042738, 646047533, 643294096, 639740348, 635345519, 630028605, 623761833, 616599917, 609224916, 602878571, 597732961, 592462003, 586052835, 578739703, 571292698, 564452946, 558958590, 555275202, 553062677, 551882923, 552724421, 556583285, 561354637, 562942743, 559261262, 551849186, 544116020, 538470626, 535339296, 534182608, 534419835, 536065459, 539761603]
3061.4E39761603N662739N969703M621804L782570M701913N630016M707933K459407
3077.7E77297688K46524r99689p68542Q63135K970278L987551L268242J769244P59185
3096E89393616R34779K101899L369271M169643M566133M620910M348695M183710M360378
3114.4F22049034M382670L937304L221809K618313K479732K675236K850234K912104
3130.7F47126436K900005K856314K815187K682864K371610K055883J898766J850724
3147F66557789J815855J700282J481116J342833J351059J274824J084983R35793P96676
3165.4F78341210O51657O27161O73234O30617N78523N86212M99308K66969Q3983N2452
3185.8F82991326M7147K4855R1076J93060J48177J8775J6749R7752Q6546J6510O56
$$ y = [539761603, 545424342, 551394045, 556015849, 559798419, 564500332, 570130348, 574838281, 577297688, 577544212, 576544523, 575775981, 576639116, 579609394, 583596945, 586865187, 588634431, 589393616, 590328395, 592430294, 595799565, 599969208, 604535341, 609156251, 613504946, 617688656, 622049034, 626431704, 630369008, 633590817, 636209130, 638688862, 641364098, 644214332, 647126436, 650026441, 652882755, 655697942, 658380806, 660752416, 662808299, 664707065, 666557789, 668373644, 670073926, 671555042, 672897875, 674248934, 675523758, 676608741, 677544534, 678341210, 678992867, 679620028, 680293262, 680923879, 681502402, 682088614, 682587922, 682854891, 682938874, 682991326, 683038473, 683063328, 683154404, 683347464, 683495641, 683514416, 683531165, 683628917, 683715463, 683731973, 683732629]
3208.2F83732629k4140j25229k02299k13742k89559m40657m92454m39584m58837n86569
3228.6F80459559o89507p09772p27832p58052p14600o26266o46412p10428o72519o75798
3249F73528373p91728q19028p34746p83563r42707r53913q48174p86900o21617k11835
3269.4F66034162M3213r4473k65896l09587l34024m06981n08427n54979o17802p19965
3289.8F62265241p96497r27508j169800j418352j502574j447201j495480j743794j997590
3308.2F49766445k139449k196610k070069j800239j638592j651525j727343j804292
3324.5F34738326j909614k058565k186597k291023k456248k597809k631426k705693
3340.8F15901351k885580l026009l022372l002465l167272l395438l444195l371835
$$ y = [683732629, 683708489, 683583260, 683380961, 683167219, 682877660, 682437003, 681944549, 681504965, 681046128, 680459559, 679770052, 679060280, 678332448, 677574396, 676859796, 676233530, 675587118, 674876690, 674204171, 673528373, 672736645, 671917617, 671182871, 670399308, 669456601, 668502688, 667654514, 666867614, 666245997, 666034162, 666077375, 665982902, 665717006, 665407419, 665073395, 664666414, 664157987, 663603008, 662985206, 662265241, 661468744, 660541236, 659371436, 657953084, 656450510, 655003309, 653507829, 651764035, 649766445, 647626996, 645430386, 643360317, 641560078, 639921486, 638269961, 636542618, 634738326, 632828712, 630770147, 628583550, 626292527, 623836279, 621238470, 618607044, 615901351, 613015771, 609989762, 606967390, 603964925, 600797653, 597402215, 593958020, 590586185]
3357.1E90586185l351807l455758l490925l300548l170669l348827l660619l688813
3373.4E63118219l353238l053665k997458l029942k935410k692282k369881k018094
3389.7E40668249j982570k299606k348066j905381j564563j877129k304375k072215
3406.1E24314344j578331j385748j424373j532495j517355j278281j052022r60708
3422.4E13585031q45253o23167m01974l30627j99854L8505o0082l64423k80440J05799
3442.8E10623515L88741N27918N83172O24776P18355Q68559J072526J211107J145542
3461.1E17764211J145959J421272J582086J263917Q04305Q24511J217902J551151J560330
3479.5E29135644J272738J196087J393020J385033J261175J352489J493692J533807
$$ y = [590586185, 587234378, 583778620, 580287695, 576987147, 573816478, 570467651, 566807032, 563118219, 559764981, 556711316, 553713858, 550683916, 547748506, 545056224, 542686343, 540668249, 538685679, 536386073, 534038007, 532132626, 530568063, 528690934, 526386559, 524314344, 522736013, 521350265, 519925892, 518393397, 516876042, 515597761, 514545739, 513585031, 512739778, 512116611, 511714637, 511384010, 511184156, 511222661, 511162579, 510798156, 510517716, 510623515, 511012256, 511540174, 512123346, 512748122, 513466477, 514335036, 515407562, 516618669, 517764211, 518910170, 520331442, 521913528, 523177445, 523981750, 524806261, 526024163, 527575314, 529135644, 530408382, 531604469, 532997489, 534382522, 535643697, 536996186, 538489878, 540023685]
3495.8E40023685J503109J519740J561582J368821J179635J328230J591265J790643
3512.1E51866710J783490J582027J524150J706183J943767J862347J602292J671911
3528.4E65542877J905262K017856K132416K163767K003134K058625K337992K322912
3544.7E82484841J978994J819432J984477K154409K200246K270997K427697K514005
3561.1E99835098K384543K232731K436518K695442K583920K499044K663911K817213
3577.4F20148420K927780L082634L121137K930761K773880K939165L028274K951264
3593.7F43903315K999306L114223L073573K969265K885878K724052K653837K725244
3610F67048693K757489K720714K517879K355039K487779K461850K175510J892865J918137
$$ y = [540023685, 541526794, 543046534, 544608116, 545976937, 547156572, 548484802, 550076067, 551866710, 553650200, 555232227, 556756377, 558462560, 560406327, 562268674, 563870966, 565542877, 567448139, 569465995, 571598411, 573762178, 575765312, 577823937, 580161929, 582484841, 584463835, 586283267, 588267744, 590422153, 592622399, 594893396, 597321093, 599835098, 602219641, 604452372, 606888890, 609584332, 612168252, 614667296, 617331207, 620148420, 623076200, 626158834, 629279971, 632210732, 634984612, 637923777, 640952051, 643903315, 646902621, 650016844, 653090417, 656059682, 658945560, 661669612, 664323449, 667048693, 669806182, 672526896, 675044775, 677399814, 679887593, 682349443, 684524953, 686417818, 688335955]
3628.4F88335955K223075K076566J787185J640022J494289J385927J386166J341700
3644.7G01670885J096130Q45789Q50678Q86977Q96215J206875J421511J072943O86586
3663G10634589O38604N27442K10166K37286K18689k02000j30355K49863M35769O68287
3683.4G13488340Q44598P75635M43101K26200K94805L15964K37405J23322K3902J45614
3703.8G16918886L05235J64628j73151k30015J16527K55466J53601R8169O8128k4557
3724.2G17652917K3663K37465K13504l0577j67311J8001L53336K57373l42011n81921
3744.6G17634439l2246p5101m21286j2338L02553N4538j36554K0683J11341J3411r0122
3767.1G17369318k29359j94966M589O1572j8597j48237j94013j42097p9811l8803l5882
$$ y = [688335955, 690559030, 692635596, 694422781, 696062803, 697557092, 698943019, 700329185, 701670885, 702767015, 703612804, 704463482, 705350459, 706246674, 707453549, 708875060, 709948003, 710634589, 711273193, 711800635, 712010801, 712248087, 712466776, 712264776, 712134421, 712384284, 712820053, 713488340, 714332938, 715108573, 715551674, 715777874, 716072679, 716388643, 716626048, 716749370, 716773272, 716918886, 717224121, 717388749, 717215598, 716985583, 717102110, 717357576, 717511177, 717609346, 717677474, 717652917, 717676580, 717914045, 718127549, 718096972, 717929661, 717947662, 718300998, 718558371, 718216360, 717634439, 717602193, 717527092, 717105806, 717093468, 717396021, 717450559, 717314005, 717334688, 717446029, 717459440, 717369318, 717139959, 716944993, 716949582, 717011154, 716992557, 716844320, 716650307, 716508210, 716428399, 716389596, 716353714]
3789.5G16353714n3048j38819j60694k0862j48058l16560o8605p7367j71363Q6784
3809.9G15285122K13087p1585k96951j11699k21192l18170n2691N0486O0796o2465
3830.3G14474738j35959m5359k52545n00679k45094J3113M8041N0307P75l54171j065612
3852.7G11987555p62820K66313L28958l9637k76446j68145o7830l01063l48389j94490
3873.1G10424006r1732j6808j44720j36376p1227k37763j97291j42158k10881O497
3893.5G09181547J89424M77k41340l27587l32773j60694K9028J9491k8372o7354j74283
3915.9G08087564k34604j48118q6188j11878n8353n0545k10047l01838k17378j53064
3936.3G06515551j80662k15530j89066q5652k9624l8624o496N3167P2300K3783p6652
$$ y = [716353714, 716300666, 716161847, 716001153, 715980291, 715832233, 715515673, 715447068, 715369701, 715198338, 715285122, 715498209, 715426624, 715129673, 715017974, 714796782, 714478612, 714425921, 714476407, 714537203, 714474738, 714338779, 714293420, 714040875, 713540196, 713295102, 713308215, 713356256, 713406563, 713407338, 713053167, 711987555, 711224735, 711491048, 711820006, 711780369, 711503923, 711335778, 711267948, 710966885, 710618496, 710424006, 710332274, 710315466, 710170746, 710034370, 709963143, 709725380, 709528089, 709385931, 709175050, 709181547, 709370971, 709371448, 709130108, 708802521, 708469748, 708309054, 708338082, 708357573, 708329201, 708261847, 708087564, 707852960, 707704842, 707618654, 707506776, 707448423, 707397878, 707187831, 706885993, 706668615, 706515551, 706334889, 706119359, 705930293, 705844641, 705815017, 705776393, 705769897, 705823064, 705895364, 705919147, 705842495]
3958.8G05842495j41978r2984L577M9233O5446P5102Q345j02997j46330j11103o1094
3981.2G05387712p6414j55627k14577k28465j84893r3997n7161p6055
3997.5G04300523
$$ y = [705842495, 705700517, 705607533, 705611110, 705660343, 705725789, 705800891, 705809236, 705706239, 705559909, 705448806, 705387712, 705311298, 705155671, 704941094, 704712629, 704527736, 704433739, 704376578, 704300523]
##END=$$ End of the data block
