##TITLE=Pirilio-dma1 $$ Begin of the data block
##JCAMP-DX=5.00 $$ ACD/SpecManager v 10.08
##SPECTROMETER/DATA SYSTEM=Alpha
##DATE=23 May 2014 08:10:48
##DATA TYPE=INFRARED SPECTRUM
##DATA CLASS=XYDATA
##ORIGIN=
##OWNER=
##NPOINTS=1765
##FIRSTX=399.75695801
##LASTX=3997.56933594
##MAXX=3997.56933594
##MINX=399.75695801
##MAXY=0.83242267
##MINY=0.13887168
##XFACTOR=1.0000000000
##YFACTOR=1.000000000000000e-9
##FIRSTY=0.78751224
##DELTAX=2.03957629
##XUNITS=1/CM
##YUNITS=ARBITRARY UNITS
##XYDATA=(X++(Y..Y))
$$ plain form
399.8 787512243 783859253 779724538 779101074 780973256 781701148 782495022 784457326 785670459 786077678
418.1 786077678 785807312 783285439 779779196 777702868 777301967 777872622 778309822 776346624 771727145
436.5 771727145 767396808 765075445 764960468 767776012 771834016 774012983 774505973 774965107 775209725
454.8 775209725 774999142 774493396 772131979 766313434 759904146 758491039 762603998 767739952 770654976
473.2 770654976 770841956 770254135 770453155 770154417 769046664 768632174 768149316 766486228 765200555
491.5 765200555 764559448 762899697 760865748 759416699 757078886 753689587 750839889 747436762 742517889
509.9 742517889 737537563 732643604 727022886 722122431 718605697 713767290 705607176 692719817
526.2 692719817 671623468 637759328 588624239 533225000 503802478 533029556 607014835
$$ packed form
399.8G87512243l652990m134715o23464J872182P27892P93874J962304J213133M07219
418.1G86077678k70366k521873l506243k076328m00901N70655M37200j963198m619479
436.5G71727145m330337k321363j14977K815544M058004K178967M92990M59134K44618
454.8G75209725k10583n05746k361417n818545o409288j413107M112959N135954K915024
473.2G70654976J86980n87821J99020k98738j107753m14490m82858j663088j285673
491.5G65200555o41107j659751k033949j449049k337813l389299k849698l403127m918873
509.9G42517889m980326m893959n620718m900455l516734m838407q160114j2887359
526.2F92719817k1096349l3864140m9135089n5399239k9422522K9227078P3985279
$$ plain form
540.5 607014835 677668333 718928993 736737609 742256701 741891384 739398599 735340178 728510976
556.8 728510976 719450831 708396554 693325579 671284020 636280179 579870760 509686649 469593823
573.1 469593823 504789948 595947981 679287672 725843370 744782925 750321448 751297235 751149237
589.4 751149237 750173032 748318195 745656371 741505682 736266613 730068088 721997142 711337566
605.8 711337566 697531998 678195417 648404360 602450371 541166008 470110774 401829660
620 401829660 368044168 379473209 408690214 439945608 490917206 573753715 644173384 668257713
636.3 668257713 689494669 734868288 769602299 771978915 749124289 708757937 667632580 654214144
652.7 654214144 683906853 734881878 772757769 789753735 794548750 793180585 786763132 775757074
$$ packed form
540.5F07014835P0653498M1260660J7808616N519092l65317k492785m058421o829202
556.8G28510976r060145j1054277j5070975k2041559l5003841n6409419p0184111m0092826
573.1D69593823L5196125R1158033Q3339691M6555698J8939555N538523R75787j47998
589.4G51149237r76205j854837k661824m150689n239069o198525q070946j0659576
605.8G11337566j3805568j9336581k9791057m5953989o1284363p1055234o8281114
620D01829660l3785492J1429041K9217005L1255394N0971598Q2836509P0419669K4084329
636.3F68257713K1236956M5373619L4734011K376616k2854626m0366352m1125357j3418436
652.7F54214144K9692709N0975025L7875891J6995966M795015j368165o417453j1006058
$$ plain form
669 775757074 764579117 751753986 740345776 738030255 741014898 739070117 727324903 701872945
685.3 701872945 654557705 581458211 509560525 495497912 555248737 638636887 701077521
699.6 701077521 739565611 763599634 778149605 785799026 789080381 788873255 784105599 774296045
715.9 774296045 762488067 755023062 752897382 746936023 726979494 687320173 627879620 569872200
732.2 569872200 560491204 618326068 698750436 754650593 781824052 793884754 798923731 799935699
748.5 799935699 799065530 797325253 794450998 790822983 787088633 782537997 776265085 767914951 755590618
766.9 755590618 735110879 700064659 641675591 561212659 494504631 493347436 561198711 648856223
783.2 648856223 714783788 751819730 769902587 778413951 781568110 780271947 774743021 765879333
$$ packed form
669G75757074j1177957j2825131j1408210k315521K984643j944781j1745214k5451958
685.3G01872945m7315240p3099494p1897686j4062613N9750825Q3388150O2440634
699.6G01077521L8488090K4034023J4549971P649421L281355k07126m767656r809554
715.9G74296045j1807978p465005k125680n961359j9956529l9659321n9440553n8007420
732.2E69872200r380996N7834864Q0424368N5900157K7173459J2060702N038977J011968
748.5G99935699q70169j740277k874255l628015l734350m550636o272912q350134j2324333
766.9G55590618k0479739l5046220n8389068q0462932o6708028j157195O7851275Q7657512
783.2F48856223O5927565L7035942J8082857Q511364L154159j296163n528926q863688
$$ plain form
799.5 765879333 756849229 753501475 757691085 763384104 764722645 761611164 755577862 745925009
815.8 745925009 729364395 700526416 664966166 647644639 654121876 647979677 602161527 533918858
832.1 533918858 482600868 487365216 559761226 658394217 730986536 767509580 784081697 791713595
848.5 791713595 793902516 793013930 791362166 789676070 787446976 784388781 780046344 773518085 764977336
866.8 764977336 757833719 756991863 761060178 763352633 761007428 755619586 748629868 739767790 727928758
885.2 727928758 712223172 691430390 663021028 624777675 582367599 560022891 585404813
899.4 585404813 648774862 708207726 740602314 752596259 754832625 751705587 744961321 735380948
915.8 735380948 721877575 702187061 674917877 646740258 635887384 648205280 662777960
$$ packed form
799.5G65879333r030104l347754M189610N693019J338541l111481o033302r652853
815.8G45925009j6560614k8837979l5560250j7321527O477237o142199m5818150o8242669
832.1E33918858n1317990M764348P2396010R8632991P2592319L6523044J6572117P631898
848.5G91713595K188921q88586j651764j686096k229094l058195m342437o528259q540749
866.8G64977336p143617q41856M068315K292455k345205n387842o989718q862078j1839032
885.2G27928758j5705586k0792782k8409362l8243353m2410076k2344708K5381922
899.4E85404813O3370049N9432864L2394588J1993945K236366l127038o744266r580373
915.8G35380948j3503373j9690514k7269184k8177619j0852874J2317896J4572680
$$ plain form
930 662777960 666180134 670023382 682534516 695059657 698722184 694115996 683670282 666903794
946.4 666903794 647022605 637113154 643414974 651496947 648051262 634568691 614548504 586294472
962.7 586294472 545390189 495934814 458039522 436603904 411967993 396225750 427691996
977 427691996 496338785 551737249 568861127 558419466 542000890 538318098 550728440 564422250
993.3 564422250 562037408 542033494 526820481 531215429 535929382 523336232 497446597 463170350
1009.6 463170350 419979751 371406466 333767712 331265450 372734874 429951608 460082084
1023.9 460082084 449322820 411524981 363142759 318411082 289616972 278050065 273718625
1038.1 273718625 267690867 259001166 251501083 249244258 254528731 266196907 278657436 286634088
$$ packed form
930F62777960L402174L843248J2511134J2525141L662527m606188j0445714j6766488
946.4F66903794j9881189r909451O301820Q081973l445685j3482571k0020187k8254032
962.7E86294472m0904283m9455375l7895292k1435618k4635911j5742243L1466246
977D27691996O8646789N5398464J7123878j0441661j6418576l682792J2410342J3693810
993.3E64422250k384842k0003914j5213013M394948M713953j2593150k5889635l4276247
1009.6D63170350m3190599m8573285l7638754k502262M1469424N7216734L0130476
1023.9D60082084j0759264l7797839m8382222m4731677k8794110j1566907m331440
1038.1B73718625o027758q689701p500083k256825N284473J1668176J2460529P976652
$$ plain form
1054.5 286634088 292479157 304538071 327028900 355831087 383851945 405996203 419827521
1068.7 419827521 424947023 423119009 418175906 412576437 404443651 390950292 372024387 349491388
1085 349491388 325220048 300349265 276334047 255282491 238235325 224591866 212880120 201582015
1101.4 201582015 190599397 181431577 176092908 176050767 179202318 179701522 173458710 161991626
1117.7 161991626 151846409 149733424 153781325 154313490 147401884 139469847 138871685 150558084
1134 150558084 176010922 213394046 258972883 308474422 356776237 399658114 436343968 469058275
1150.3 469058275 500391662 530880034 559127390 582827210 599868238 612459838 627245009
1164.6 627245009 646354377 665178657 679902792 689382613 692488074 687282562 670407832 639950871
$$ packed form
1054.5B86634088N845069J2058914K2490829K8802187K8020858K2144258J3831318
1068.7D19827521N119502j828014m943103n599469q132786j3493359j8925905k2532999
1085C49491388k4271340k4870783k4015218k1051556j7047166j3643459j1711746j1298105
1101.4B01582015j0982618r167820n338669m2141L151551M99204o242812j1467084
1117.7A61991626j0145217k112985M047901N32165o911606p932037n98162J1686399
1134A50558084K5452838L7383124M5578837M9501539M8301815M2881877L6685854L2714307
1150.3D69058275L1333387L0488372K8247356K3699820J7041028J2591600J4785171
1164.6F27245009J9109368J8824280J4724135R479821L105461n205512j6874730l0456961
$$ plain form
1180.9 639950871 605976880 592191398 611799598 650753558 686385930 707635641 717764735
1195.2 717764735 726975501 737937510 744741380 744348407 737276733 722333670 698696136 670417547
1211.5 670417547 641688168 609860659 573725164 545102596 540797293 564924657 606166244
1225.8 606166244 649765790 687364042 717529535 741476119 759777606 772126377 778921366
1240.1 778921366 782796264 786820710 791187644 794161558 795629263 797172129 799050629 800264180
1256.4 800264180 800883889 801170349 800261617 797712266 793841958 788398564 781209886 773427606 766058862
1274.7 766058862 758307874 748123527 733021617 710819662 680087924 639618337 597064555
1289 597064555 581856132 616889000 677930653 724052191 745366454 751917899 749132991 737763584
$$ packed form
1180.9F39950871l3973991j3785482J9608200L8953960L5632372K1249711J0129094
1195.2G17764735R210766J0962009O803870l92973p071674j4943063k3637534k8278589
1211.5F70417547k8729379l1827509l6135495k8622568m305303K4127364M1241587
1225.8F06166244M3599546L7598252L0165493K3946584J8301487J2348771O794989
1240.1G78921366L874898M024446M366934K973914J467705J542866J878500J213551
1256.4H00264180O19709K86460r08732k549351l870308n443394p188678p782280p368744
1274.7G66058862p750988j0184347j5101910k2201955l0731738m0469587m2553782
1289E97064555j5208423L5032868O1041653M6121538K1314263O551445k784908j1369407
$$ plain form
1305.3 737763584 719562888 696282625 668574750 641756952 632795930 654331982 688631773
1319.6 688631773 702967227 688085675 658408403 626733005 590255082 542745948 495461971
1333.9 495461971 476219743 504863381 569109082 633975565 680537999 711250663 733749866
1348.1 733749866 753030956 768338561 777565897 781733096 783496857 785031140 787552655 790483057
1364.5 790483057 792302728 792767286 792683363 792635083 792780697 792839229 791835427 788996518 784840703
1382.8 784840703 780101001 774143219 766496658 757594764 746708989 734499753 724857271 718624651
1399.1 718624651 713261783 703800976 685060263 663243294 654848754 670054138 701287568 731230140
1415.5 731230140 752484024 765793741 771440744 771643043 767903447 760688126 750557840 739907980
$$ packed form
1305.3G37763584j8200696k3280263k7707875k6817798q961022K1536052L4299791
1319.6F88631773J4335454j4881552k9677272l1675398l6477923m7509134m7283977
1333.9D95461971j9242228K8643638O4245701O4866483M6562434L0712664K2499203
1348.1G33749866J9281090J5307605R227336M167199J763761J534283K521515K930402
1364.5G90483057J819671M64558q3923m8280J45614N8532j003802k838909m155815
1382.8G84840703m739702n957782p646561q901894j0885775j2209236r642482o232620
1399.1G18624651n362868r460807j8740713k1816969q394540J5205384L1233430K9942572
1415.5G31230140K1253884J3309717N647003K02299l739596p215321j0130286j0649860
$$ plain form
1431.8 739907980 730805755 720339477 705206156 686210513 660395563 622137427 562853336
1446 562853336 492907971 462858856 486082137 525618911 567254424 610592246 638147295 651206970
1462.4 651206970 653287292 643330514 625115156 600953639 569478750 537443638 514742255 509164333
1478.7 509164333 528339088 569199204 616842389 659558356 692774653 716544688 734543562
1493 734543562 749218464 758360684 758497059 751303256 738532722 713615298 663769841 606695771
1509.3 606695771 563978434 554457545 595973194 666573584 720622361 747289360 757642925
1523.6 757642925 763609886 772073328 781482756 789101720 794596255 797630310 798057437 795458496
1539.9 795458496 790942132 787008584 783719301 781489909 779851854 777972460 775648117 773154140
$$ packed form
1431.8G39907980r102225j0466278j5133321j8995643k5814950l8258136n9284091
1446E62853336o9945365l0049115K3223281L9536774M1635513M3337822K7555049J3059675
1462.4F51206970K080322r956778j8215358k4161517l1474889l2035112k2701383n577922
1478.7E09164333J9174755M0860116M7643185M2715967L3216297K3770035J7998874
1493G34543562J4674902R142220J36375p193803j2770534k4917424m9845457n7074070
1509.3F06695771m2717337r520889M1515649P0600390N4048777K6666999J0353565
1523.6G57642925N966961Q463442R409428P618964N494535L034055M27127k598941
1539.9G95458496m516364l933548l289283k229392j638055j879394k324343k493977
$$ plain form
1556.2 773154140 768547773 760965288 755374193 750014126 742697656 731502235 714973271 695999682
1572.5 695999682 667383432 618286729 586028636 606790125 657030463 686639845 679278195
1586.8 679278195 650565505 613386214 579644442 564166129 572154105 587079108 585546136 560424447
1603.1 560424447 523202121 486691982 453664064 422830880 398368657 385312766 389575869
1617.4 389575869 416705608 468167901 539508045 603288770 645471156 671625674 686297715
1631.6 686297715 694473445 697715580 695586622 689700782 680294812 667281687 649311960 629862845
1648 629862845 613991797 586567402 531467497 478442073 433303028 398837537 393846571 418951154
1664.3 418951154 452534705 490334719 540130913 594503701 650392532 700374365 731179357
$$ packed form
1556.2G73154140m606367p582485n591095n360067p316470j1195421j6528964j8973589
1572.5F95999682k8616250m9096703l2258093K0761489N0240338K9609382p361650
1586.8F79278195k8712690l7179291l3741772j5478313P987976J4925003j532972k5121689
1603.1E60424447l7222326l6510139l3027918l0833184k4462223j3055891M263103
1617.4C89575869K7129739N1462293P1340144O3780725M2182386K6154518J4672041
1631.6F86297715Q175730L242135k128958n885840r405970j3013125j7969727j9449115
1648F29862845j5871048k7424395n5099905n3025424m5139045l4465491m990966K5104583
1664.3D18951154L3583551L7800014M9796194N4372788N5888831M9981833L0804992
$$ plain form
1678.6 731179357 748296618 759400368 768937826 778480649 787996173 796654761 802717209 807602465
1694.9 807602465 812079191 815216422 817393899 819087744 820174813 821054935 821940660 822481275 822439909
1713.2 822439909 822243631 822375119 822977483 824243784 825716853 826637626 826859236 827079415 827296495
1731.6 827296495 827094257 826973677 827302217 827671230 828201294 829239726 830279350 830952704 831430495
1749.9 831430495 831790447 831796169 831721008 831913412 832107365 832133830 832331121 832422674 831858516 830983758
1770.3 830983758 830109298 829369128 828811765 828141570 826918244 825341046 824068546 823141754 822357059
1788.7 822357059 822221875 823697507 826024592 827880144 829020977 829376280 829111993 828873813 828791082
1807 828791082 828412831 827772856 827253401 826650262 825651050 824760556 824525237 824945927 825832725 826729894
$$ packed form
1678.6G31179357J7117261J1103750R537458R542823R515524Q658588O062448M885256
1694.9H07602465M476726L137231K177477J693845J087069Q80122Q85725N40615m1366
1713.2H22439909j96278J31488O02364J266301J473069R20773K21610K20179K17080
1731.6H27296495k02238j20580L28540L69013N30064J038432J039624O73354M77791
1749.9H31430495L59952N722p5161J92404J93953K6465J97291R1553n64158q74758
1770.3H30983758q74460p40170n57363o70195j223326j577198j272500r26792p84695
1788.7H22357059j35184J475632K327085J855552J140833L55303k64287k38180q2731
1807H28791082l78251o39975n19455o03139r99212q90494k35319M20690Q86798Q97169
$$ plain form
1827.4 826729894 827004373 826788366 826733470 826674938 826334298 826028168 825761974 824972689 824127555 824081481
1847.8 824081481 824510098 825058639 825818837 826660812 827235103 827572823 827738106 827584863 827194810 826778352
1868.2 826778352 826356530 826015711 825888813 825822294 825532794 825103104 824749827 824384630 824004054 823699772
1888.6 823699772 823307037 822651625 821805060 820796669 819507122 818055034 816632152 814904392 812359691
1907 812359691 808765829 803869426 797859251 792582691 791137278 794871747 801161051 806684971 809924901
1925.3 809924901 811177194 811365306 810936749 810067832 809307575 809141755 809237182 809015393 808425426 807583332
1945.7 807583332 806536138 805698395 805269718 804775953 803953171 802990198 801806033 800200522 798414648
1964.1 798414648 796781421 795368373 794029057 792357504 790134132 788268983 788470328 791192889
$$ packed form
1827.4H26729894K74479k16007n4896n8532l40640l06130k66194p89285q45134m6074
1847.8H24081481M28617N48541P60198Q41975N74291L37720J65283j53243l90053m16458
1868.2H26778352m21822l40819j26898o6519k89500m29690l53277l65197l80576l04282
1888.6H23699772l92735o55412q46565j008391j289547j452088j422882j727760k544701
1907H12359691l593862m896403o010175n276560j445413L734469O289304N523920L239930
1925.3H09924901J252293J88112m28557q68917p60257j65820R5427k21789n89967q42094
1945.7H07583332j047194q37743m28677m93765q22782r62973j184165j605511j785874
1964.1G98414648j633227j413048j339316j671553k223372j865149K01345K722561
$$ plain form
1980.4 791192889 794944882 798143864 800241172 801205158 801275313 800823092 800075054 799378395 799258888
1998.8 799258888 799700499 800111532 800191998 799949944 799257338 798103094 796778858 795422435 793990791
2017.1 793990791 792617619 791301548 789804161 788221955 786968350 786279500 786323726 787250280 788742542
2035.5 788742542 790172935 791242778 791910768 792084038 791949093 791982293 792378306 793061674 794087589
2053.8 794087589 795377254 796569169 797532558 798443019 799361229 800255716 801200151 802121758 802812457
2072.2 802812457 803287268 803647637 803785264 803693950 803556859 803366065 803066730 802831471 802781701 802781343
2092.6 802781343 802740872 802689672 802553535 802274287 801967800 801665485 801281393 800911248 800675154 800513387
2113 800513387 800420463 800447226 800454736 800339639 800213158 800100982 799898207 799636066 799374223 799053490 798712194
$$ packed form
1980.4G91192889L751993L198982K097308R63986P0155m52221p48038o96659j19507
1998.8G99258888M41611M11033Q0466k42054o92606j154244j324236j356423j431644
2017.1G93990791j373172j316071j497387j582206j253605o88850M4226R26554J492262
2035.5G88742542J430393J069843O67990J73270j34945L3200L96013O83368J025915
2053.8G94087589J289665J191915R63389R10461R18210Q94487R44435R21607O90699
2072.2H02812457M74811L60369J37627r1314j37091j90794k99335k35259m9770l58
2092.6H02781343m0471n1200j36137k79248l06487l02315l84092l70145k36094j61767
2113H00513387r2924K6763P510j15097j26481j12176k02775k62141k61843l20733l41296
$$ plain form
2135.4 798712194 798455775 798195362 797852516 797574580 797381759 797111273 796776891 796496451 796224892 795922875
2155.8 795922875 795707285 795578897 795422733 795255899 795127451 794983029 794841945 794764519 794648468 794432461
2176.2 794432461 794250607 794148326 794039786 793963492 793978393 793993592 793959081 793949366 793923736 793803513 793696046
2198.6 793696046 793639541 793468475 793157101 792841196 792508781 792173266 791987240 791885614 791671038 791386485
2219 791386485 791096807 790671706 790137112 789689958 789349377 789072812 788914442 788826346 788710117 788633823
2239.4 788633823 788639843 788581967 788415492 788273394 788146496 787970603 787878692 787920177 787934303 787888408 787859678
2261.9 787859678 787782967 787655592 787652910 787780464 787856400 787835658 787754416 787510216 787089944 786654413 786202908
2284.3 786202908 785684586 785241425 784853399 784255981 783441424 782619119 781779706 780898333 780224860 779870152
$$ packed form
2135.4G98712194k56419k60413l42846k77936j92821k70486l34382k80440k71559l02017
2155.8G95922875k15590j28388j56164j66834j28448j44422j41084p7426j16051k16007
2176.2G94432461j81854j02281j08540p6294J4901J5199l4511r715k5630j20223j07467
2198.6G93696046n6505j71066l11374l15905l32415l35515j86026j01626k14576k84553
2219G91386485k89678m25101n34594m47154l40581k76565j58370q8096j16229p6294
2239.4G88633823O020n7876j66475j42098j26898j75893r1911M1485J4126m5895k8730
2261.9G87859678p6711j27375k682J27554P5936k0742q1242k44200m20272m35531m51505
2284.3G86202908n18322m43161l88026n97418q14557q22305q39413q81373o73473l54708
$$ plain form
2304.7 779870152 779656053 779479861 779246807 778798461 778234243 777747989 777180612 776329398 775380671 774519086
2325.1 774519086 773641825 772871733 772575498 772661805 772672713 772392511 771772742 770919740 770426452 770966232
2345.5 770966232 772229373 773267746 773638427 773381054 772770226 772167861 771770179 771511018 771340072
2363.8 771340072 771295190 771214962 771012545 770852089 770711005 770496964 770327270 770224512 770002306 769657731
2384.2 769657731 769354463 769055784 768707871 768461823 768307984 768052042 767730236 767440438 767040789 766474187
2404.6 766474187 765931368 765448987 764903605 764324248 763714790 762917578 761911333 760803103 759544909
2423 759544909 758076429 756526589 754957974 753323317 751751840 750339687 748877883 747214615 745451570
2441.3 745451570 743644953 741886437 740498364 739663124 739284933 739377677 740040362 741130471 742465258
$$ packed form
2304.7G79870152k14099j76192k33054m48346n64218m86254n67377q51214r48727q61585
2325.1G74519086q77261p70092k96235Q6307J0908k80202o19769q53002m93288N39780
2345.5G70966232J263141J038373L70681k57373o10828o02365l97682k59161j70946
2363.8G71340072m4882q0228k02417j60456j41084k14041j69694j02758k22206l44575
2384.2G69657731l03268k98679l47913k46048j53839k55942l21806k89798l99649n66602
2404.6G66474187n42819m82381n45382n79357o09458p97212j006245j108230j258194
2423G59544909j468480j549840j568615j634657j571477j412153j461804j663268j763045
2441.3G45451570j806617j758516j388073q35240l78191R2744O62685J090109J334787
$$ plain form
2459.7 742465258 744055212 745797575 747428298 748883545 750161588 751073480 751587093 751861691 751886129
2478.1 751886129 751612842 751127541 750401855 749272943 747750103 745947957 743844628 741529644 739356697
2496.4 739356697 737558722 736191809 735404432 735230446 735424042 735861361 736605167 737496316 738287151
2514.8 738287151 738962293 739499152 739793599 739959776 740174711 740360439 740433216 740499675 740534604 740365326
2535.2 740365326 740055382 739734411 739283919 738679588 738108039 737593710 737075031 736642182 736285865 735829115
2555.6 735829115 735272646 734679878 733913124 732940078 731929839 730869412 729625225 728258967 726859689
2573.9 726859689 725385785 723916829 722614408 721395195 720133543 718956113 718022645 717438698 717390358
2592.3 717390358 717889726 718572915 719156265 719667554 720048666 720178843 720191240 720203578 720092058 719826818
$$ packed form
2459.7G42465258J589954J742363J630723J455247J278043R11892N13613K74598K4438
2478.1G51886129k73287m85301p25686j128912j522840j802146k103329k314984k172947
2496.4G39356697j797975j366913p87377j73986J93596M37319P43806Q91149P90835
2514.8G38287151O75142N36859K94447J66177K14935J85728P2777O6459L4929j69278
2535.2G40365326l09944l20971m50492o04331n71549n14329n18679m32849l56317m56750
2555.6G35829115n56469n92768p66754r73046j010239j060427j244187j366258j399278
2573.9G26859689j473904j468956j302421j219213j261652j177430r33468n83947m8340
2592.3G17390358M99368O83189N83350N11289L81112J30177J2397J2338j11520k65240
$$ plain form
2612.7 719826818 719532430 719199181 718774438 718343377 717927992 717423856 716892719 716488421 716145456 715761006
2633.1 715761006 715408623 715101779 714763045 714455247 714210868 713858485 713318586 712663829 711788893 710535586
2653.5 710535586 708943963 707062483 704975307 703089416 701913714 701564908 701848507 702540576 703309536
2671.8 703309536 703861475 704260230 704644680 704858780 704760194 704448700 703961194 703290105 702612162 702025056
2692.2 702025056 701385319 700586855 699583352 698215008 696449995 694553316 692687869 690730393 688591540
2710.6 688591540 686334789 684037983 681855202 679939210 678157985 676242173 674034715 671317816
2726.9 671317816 667922616 664030731 659771740 654857814 648928463 641873956 633714199 624560356
2743.2 624560356 614768445 604750752 594813645 585568964 578086853 573272884 571471274 572578311
$$ packed form
2612.7G19826818k94388l33249m24743m31061m15385n04136n31137m04298l42965l84450
2633.1G15761006l52383l06844l38734l07798k44379l52383n39899o54757q74936j253307
2653.5G10535586j591623j881480k087176j885891j175702l48806K83599O92069P68960
2671.8G03309536N51939L98755L84450K14100r8586l11494m87506o71089o77943n87106
2692.2G02025056o39737p98464j003503j368344j765013j896679j865447j957476k138853
2710.6F88591540k256751k296806k182781j915992j781225j915812k207458k716899
2726.9F71317816l395200l891885m258991m913926n929351p054507q159757r153843
2743.2F24560356r791911j0017693r937107r244681p482111m813969j801610J107037
$$ plain form
2759.5 572578311 575959146 580489874 585225701 589868069 594540477 599574387 605288386 611568093
2775.8 611568093 617995799 624271333 630182385 635509491 640129864 643933415 646634459 648121536
2792.2 648121536 648829162 649310172 649801731 650534093 651816010 653426468 654738605 655488551 655755162
2810.5 655755162 655644596 655312121 654796720 653859019 652304113 650234222 647754133 644815505 641511798
2828.9 641511798 638210058 635420620 633730650 633626103 634990454 637165844 639571071 641728938
2845.2 641728938 643285513 644415200 645711601 647487998 649473310 651275218 652639806 653388619
2861.5 653388619 653591454 653473198 653152347 652778029 652500868 652194619 651753485 651389956 651234031 651221871
2881.9 651221871 651362062 651582301 651570261 651029348 649916887 648427606 646891236 645607531 644676626
$$ packed form
2759.5E72578311L380835M530728M735827M642368M672408N033910N713999O279707
2775.8F11568093O427706O275534N911052N327106M620373L803551K701044J487077
2792.2F48121536P07626M81010M91559P32362J281917J610458J312137P49946K66611
2810.5F55755162j10566l32475n15401r37701j554906k069891k480089k938628l303707
2828.9F41511798l301740k789438j689970j04547J364351K175390K405227K157867
2845.2F41728938J556575J129687J296401J776397J985312J801908J364588P48813
2861.5F53388619K02835j18256l20851l74318k77161l06249m41134l63529j55925j2160
2881.9F51221871J40191K20239j2040n40913j112461j489281j536370j283705r30905
$$ plain form
2900.2 644676626 644002736 643405318 642664254 641556680 639963269 637925684 635686874 633764029 632764757
2918.6 632764757 632983685 634263217 636165380 638219595 640017629 641216695 641793728 642010927 642002761
2937 642002761 641772270 641354859 640757799 639983714 639149785 638466418 638131738 638191402 638447046 638518333
2957.4 638518333 637896836 635993302 632667065 629230499 627902508 629214168 631343544 632452726
2973.7 632452726 632061720 630447924 627979934 625089526 622486174 620893836 620414138 620470583 620320559
2992 620320559 619542480 618169844 616143882 613209307 609370172 604663193 599006474 592331350 584685385
3010.4 584685385 576884210 570357084 565223575 559952021 553496182 546143293 538599968 531619072
3026.7 531619072 526094139 522477865 520285249 519104958 520051003 524126947 529111862 530816257
$$ packed form
2900.2F44676626o73890n97418p41064j107574j593411k037585k238810j922845r99272
2918.6F32764757K18928J279532J902163K054215J798034J199066N77033K17199q166
2937F42002761k30491m17411n97060p74085q33929o83367l34680N9664K55644P1287
2957.4F38518333o21497j903534l326237l436566j327991J311660K129376J109182
2973.7F32452726l91006j613796k467990k890408k603352j592338m79698N6445j50024
2992F20320559p78079j372636k025962k934575l839135m706979n656719o675124p645965
3010.4E84685385p801175o527126n133509n271554o455839p352889p543325o980896
3026.7E31619072n524933l616274k192616j180291R46045M075944M984915J704395
$$ plain form
3043 530816257 527129471 519597292 511739552 506109059 503101110 502048016 502332926 504017711 507757902
3061.4 507757902 513469517 519526243 524237871 528062463 532811344 538549304 543342113 545735300
3077.7 545735300 545794785 544600308 543691337 544514418 547598898 551824868 555308640 557145894 557865918
3096 557865918 558818221 561020553 564478874 568776131 573580146 578433633 582959592 587422431 592145443
3114.4 592145443 596781075 600901544 604403317 607354760 610093772 613008201 616145492 619327545
3130.7 619327545 622497380 625700891 628886938 631879270 634516597 636865973 639103413 641281545
3147 641281545 643377185 645354569 647136748 648727477 650300801 651892543 653311372 654468119 655437410
3165.4 655437410 656336248 657242775 658154249 659063160 659950435 660756290 661434710 661956608 662302971 662517667
$$ packed form
3043E30816257l686786p532179p857740n630493l007949j053094K84910J684785L740191
3061.4E07757902N711615O056726M711628L824592M748881N737960M792809K393187
3077.7E45735300N9485j194477r08971Q23081L084480M225970L483772J837254P20024
3096E57865918R52303K202332L458321M297257M804015M853487M525959M462839M723012
3114.4E92145443M635632M120469L501773K951443K739012K914429L137291L182053
3130.7F19327545L169835L203511L186047K992332K637327K349376K237440K178132
3147F41281545K095640J977384J782179J590729J573324J591742J418829J156747R69291
3165.4F55437410Q98838R06527R11474R08911Q87275Q05855O78420N21898L46363K14696
$$ plain form
3185.8 662517667 662744522 663067877 663437784 663821816 664212763 664554596 664828360 665124536 665480852 665805519
3206.2 665805519 666056097 666272342 666415870 666449487 666433930 666347921 666119039 665818512 665519595 665180445
3226.6 665180445 664775133 664301634 663718402 663039386 662382305 661810219 661275148 660765290 660308361 659816384
3247 659816384 659178257 658457637 657740474 656995177 656209826 655413866 654572546 653695345 652924240 652428806
3267.4 652428806 652293921 652377188 652461290 652468979 652397633 652278662 652068615 651713848 651281595 650817394
3287.8 650817394 650327504 649758697 648979783 647932649 646673083 645340860 644062221 642780423 641286671
3306.1 641286671 639502466 637560725 635612130 633805931 632256866 630931616 629714727 628479600
3322.4 628479600 627109826 625603080 624013841 622291207 620390236 618365824 616274953 614105880
$$ packed form
3185.8F62517667K26855L23355L69907L84032L90947L41833K73764K96176L56316L24667
3206.2F65805519K50578K16245J43528L3617j5557q6009k28882l00527k98917l39150
3226.6F65180445m05312m73499n83232o79016o57081n72086n35071n09858m56929m91977
3247F59816384o38127p20620p17163p45297p85351p95960q41320q77201p71105m95434
3267.4F52428806j34885Q3267Q4102P689p1346j18971k10047l54767m32253m64201
3287.8F50817394m89890n68807p78914j047134j259566j332223j278639j281798j493752
3306.1F41286671j784205j941741j948595j806199j549065j325250j216889j235127
3322.4F28479600j369774j506746j589239j722634j900971k024412k090871k169073
$$ plain form
3338.8 614105880 611828983 609430790 606898606 604331672 601839662 599238038 596358299 593394637
3355.1 593394637 590525031 587667167 584700704 581729054 578968287 576340139 573494017 570286632
3371.4 570286632 567045152 564130068 561483622 558895946 556287348 553738654 551399231 549389899
3387.7 549389899 547722697 546022594 543961883 541919172 540402770 539166749 537511170 535472631
3404 535472631 533757687 532509565 531370640 530160248 528824985 527486503 526402116 525542855 524722874
3422.4 524722874 523997426 523528218 523269594 523025274 522863746 522917390 522881448 522538304 522237301 522293448
3442.8 522293448 522627950 523088574 523606360 524167240 524776876 525493562 526424289 527525306 528563380
3461.1 528563380 529555500 530771077 532129407 533178389 533827543 534563422 535682738 537070751 538413048
$$ packed form
3338.8F14105880k276897k398193k532184k566934k492010k601624k879739k963662
3355.1E93394637k869606k857864k966463k971650k760767k628148k846122l207385
3371.4E70286632l241480k915084k646446k587676k608598k548694k339423k009332
3387.7E49389899j667202j700103k060711k042711j516402j236021j655579k038539
3404E35472631j714944j248122j138925j210392j335263j338482j084387q59261q19981
3422.4E24722874p25448m69208k58624k44320j61528N3644l5942l43144l01003N6147
3442.8E22293448L34502M60624N17786N60880O09636P16686R30727J101017J038074
3461.1E28563380R92120J215577J358330J048982O49154P35879J119316J388013J342297
$$ plain form
3479.5 538413048 539436579 540393531 541596591 542823613 543946564 545173466 546519041 547868669
3495.8 547868669 549158335 550438583 551781297 553030193 554124773 555278480 556669831 558305502
3512.1 558305502 559928477 561359882 562760711 564293981 565974295 567588151 569012165 570500493
3528.4 570500493 572203338 574003100 575842798 577655196 579410434 581338525 583472252 585442483
3544.7 585442483 587014914 588500679 590185463 591990054 593857050 595821202 597882509 599947929
3561.1 599947929 601864159 603628457 605548322 607781947 610041916 612211287 614424348 616716743
3577.4 616716743 619138360 621758580 624415338 626828015 629018962 631412745 633973897 636431038
3593.7 636431038 638896286 641495228 644059777 646525383 648931384 651132584 653205037 655425727
$$ packed form
3479.5E38413048J023531R56952J203060J227022J122951J226902J345575J349628
3495.8E47868669J289666J280248J342714J248896J094580J153707J391351J635671
3512.1E58305502J622975J431405J400829J533270J680314J613856J424014J488328
3528.4E70500493J702845J799762J839698J812398J755238J928091K133727J970231
3544.7E85442483J572431J485765J684784J804591J866996J964152K061307K065420
3561.1E99947929J916230J764298J919865K233625K259969K169371K213061K292395
3577.4F16716743K421617K620220K656758K412677K190947K393783K561152K457141
3593.7F36431038K465248K598942K564549K465606K406001K201200K072453K220690
$$ plain form
3610 655425727 657742083 660014749 662092805 663912654 665834010 667952895 669956625 671547771 672779799
3628.4 672779799 674345195 676134527 677677453 679028034 680272639 681412220 682524204 683586657
3644.7 683586657 684286773 684532702 684928954 685696065 686518073 687594414 688931882 689917505 690505981
3663 690505981 691060722 691429496 691329896 691331625 691454768 690949142 690601051 690950930 691452444 692108989
3683.4 692108989 692955673 693642080 693859756 694036007 694519818 695007443 695293427 695361674 695262551 695324838
3703.8 695324838 695629239 695802867 695523798 695079803 695167780 695577204 695841193 695912242 695890784 695862353
3724.2 695862353 695933104 696190596 696406841 696316540 695972145 695802033 696202099 696715951 696439207 695566952
3744.6 695566952 695465922 695551217 695061862 694991350 695534170 695809782 695613503 695518851 695658684 695705354
$$ packed form
3610F55425727K316356K272666K078056J819849J921356K118885K003730J591146J232028
3628.4F72779799J565396J789332J542926J350581J244605J139581J111984J062453
3644.7F83586657P00116K45929L96252P67111Q22008J076341J337468R85623N88476
3663F90505981N54741L68774r9600J729J23143n05626l48091L49879N01514O56545
3683.4F92108989Q46684O86407K17676J76251M83811M87625K85984O8247r9123O2287
3703.8F95324838L04401J73628k79069m43995Q7977M09424K63989P1049k1458k8431
3724.2F95862353P0751K57492K16245r0301l44395j70112M00066N13852k76744q72255
3744.6F95566952j01030Q5295m89355p0512N42820K75612j96279r4652J39833M6670
$$ plain form
3765 695705354 695608675 695352435 695136249 695171297 695277750 695286632 695113063 694890380 694752872 694648206 694609463
3787.5 694609463 694611251 694571257 694458783 694323182 694299400 694096982 693658888 693609297 693598151 693443596 693627894
3809.9 693627894 693889081 693720400 693280578 693183064 692979395 692608118 692704797 692878127 692907751 692838490
3830.3 692838490 692723870 692710519 692432344 691817641 691556454 691605747 691634655 691721141 691847086 691550255
3850.7 691550255 690261841 689287305 689692140 690208793 690259039 689975917 689749420 689664543 689293921 688838124
3871.1 688838124 688662231 688648760 688712895 688542366 688291550 688184261 687913656 687772989 687772095 687555134
3891.5 687555134 687518120 687761486 687787175 687477469 687049329 686661124 686548352 686718464 686852515 686853468
3911.9 686853468 686758339 686483026 686154187 686050653 686090946 686028361 685898483 685770690 685514569 685154974
$$ packed form
3765F95705354r6679k56240k16186L5048J06453Q882j73569k22683j37508j04666l8743
3787.5F94609463J788l9994j12474j35601k3782k02418m38094m9591j1146j54555J84298
3809.9F93627894K61187j68681m39822r7514k03669l71277R6679J73330K9624o9261
3830.3F92838490j14620j3351k78175o14703k61187M9293K8908Q6486J25945k96831
3850.7F91550255j288414r74536M04835N16653N0246k83122k26497q4877l70622m55797
3871.1F88838124j75893j3471O4135j70529k50816j07289k70605j40667q94k16961
3891.5F87555134l7014K43366K5689l09706m28140l88205j12772J70112J34051R53
3911.9F86853468r5129k75313l28839j03534M0293o2585j29878j27793k56121l59595
$$ plain form
3932.3 685154974 684914470 684792638 684633553 684390843 684136629 684024990 684027374 684023619 684076488 684183002
3952.7 684183002 684223592 684197009 684154212 684067845 683937371 683861792 683886826 683977604 684109211 684189022 684141338
3975.1 684141338 683995008 683818877 683724761 683699429 683590591 683355689 683079898 682856798 682709455 682640553
3995.5 682640553 682639658
3997.5 682639658
$$ packed form
3932.3F85154974k40504j21832j59085k42710k54214j11639K384l755N2869J06514
3952.7F84183002M0590k6583m2797q6367j30474p5579K5034R0778J31607P9811m7684
3975.1F84141338j46330j76131r4116k5332j08838k34902k75791k23100j47343o8902
3995.5F82640553q95
3997.5F82639658
##END=$$ End of the data block
