##TITLE=Pirilio-ciano $$ Begin of the data block
##JCAMP-DX=5.00 $$ ACD/SpecManager v 10.08
##SPECTROMETER/DATA SYSTEM=Alpha
##DATE=26 May 2014 07:44:42
##DATA TYPE=INFRARED SPECTRUM
##DATA CLASS=XYDATA
##ORIGIN=
##OWNER=
##NPOINTS=1765
##FIRSTX=399.75695801
##LASTX=3997.56933594
##MAXX=3997.56933594
##MINX=399.75695801
##MAXY=0.80675203
##MINY=0.16575959
##XFACTOR=1.0000000000
##YFACTOR=1.000000000000000e-9
##FIRSTY=0.72081113
##DELTAX=2.03957629
##XUNITS=1/CM
##YUNITS=ARBITRARY UNITS
##XYDATA=(X++(Y..Y))
399.8 720811129 719487071 722392201 727293372 727940798 726221442 727206945 727847159 724268079 720813215
418.1 720813215 721905649 721988380 719496369 719110131 719816267 717353821 714350224 714768946 715227544
436.5 715227544 712776005 711255431 712008715 710551739 707098961 706618607 707615018 705376744 702152908
454.8 702152908 701726019 700880468 696543157 692702472 691283464 688388765 683907568 682708085 684551179
473.2 684551179 684769988 684330702 686307907 687559187 685147405 683159590 683760345 682461321 678384781
491.5 678384781 676401317 676527202 674526691 671697736 671683013 671715558 667904317 663044870 659428239
509.9 659428239 653422177 643636882 633449554 624210596 617110848 617709339 628374517 641659141
526.2 641659141 647813141 647643685 647934020 648513019 644423544 634694517 619184613 598058164 582017660
544.6 582017660 585916519 606220484 625080287 635183036 640875757 643913388 643707693 644048154
560.9 644048154 648024440 652252674 653816760 655494452 658533514 660336733 662223876 667832375
577.2 667832375 674724877 678112447 679525971 682681620 685321093 684547246 683735907 685388505 685787320
595.6 685787320 683502913 682599783 683661580 682613075 679909825 679602742 679987013 676636815 673089147
613.9 673089147 675002158 678663313 678968132 678033650 675632060 666732728 657394767 662296534 678474188
632.3 678474188 688816905 690340161 691716850 693406940 690606117 684738934 678771615 668853402
648.6 668853402 653957069 647475064 659567595 678164542 688745975 693202913 695733011 694493771
664.9 694493771 688507080 680295110 670664012 653770626 627523661 594937027 561280787 538196743
681.2 538196743 534189284 542605460 552407086 560989499 568354070 569449544 559859633 545175850
697.5 545175850 536460161 538999438 551260948 571038008 595342994 616621077 626735449 624296188
713.8 624296188 616021514 612924516 622959614 643628180 664114654 676301599 681296408 684118688
730.2 684118688 684784770 681164920 675910234 671814442 665496111 653355062 638522089 626581013
746.5 626581013 618613958 611850977 604460835 595295668 582748652 568764150 558418572 553713202
762.8 553713202 553429246 556865156 561829865 562239170 553597569 539527059 528350472 530597508
779.1 530597508 558628798 609740913 662387788 699739456 721051514 733962834 743027866 747112870
795.4 747112870 747622669 749105215 750956714 749570191 746801555 746052921 744879484 740383387 735288203
813.8 735288203 731445909 725427389 715670645 705116570 693629146 677242637 656860292 639605582
830.1 639605582 630535245 627494872 624782145 617051363 599232554 573942721 557778120 564568222
846.4 564568222 588685930 615638912 638237357 656151533 669220746 678600490 687924683 697699666
862.7 697699666 704775751 709370852 714841843 720453501 722741187 722303808 721872926 720934391 718597472
881.1 718597472 717686653 720327675 723843455 726017296 728760719 732535839 734430611 734496713 736029923
899.4 736029923 738524437 738643289 737174213 736905754 736290753 732907534 728977561 726714373 723758399
917.8 723758399 718650222 714287460 712081850 709841430 707479775 707578957 709415197 709895670 709769964
936.2 709769964 711460948 713045657 711420357 707988083 704779029 699570775 690164864 678288698
952.5 678288698 666218936 655988932 651535749 654242218 658565879 658010900 652789056 646872401
968.8 646872401 640993178 633958340 627508223 623992980 621760070 618030727 613361776 608757734
985.1 608757734 602485597 592645586 578228354 556543171 530385256 515181422 519116223 530028641
1001.4 530028641 535072446 531720936 520968318 504479945 486219823 470061928 455186337 440642536
1017.7 440642536 430692136 427180886 424082249 416103423 404948056 394689739 386434555 378732532
1034.1 378732532 371082604 365196347 362173736 359647691 353366345 341011971 324247092 307386607
1050.4 307386607 294260114 286202580 282404661 281383872 281826049 283303380 286194861 290728003
1066.7 290728003 296626061 302980989 308257759 311510205 312341243 308890253 299969614 293499410
1083 293499410 303637236 330476165 359160483 381128013 398067534 412103474 423350155 432165444
1099.3 432165444 439324439 444943815 449582189 455603153 464983374 476881206 489289433 501251638
1115.6 501251638 511984944 520152807 526506364 536349416 554444492 577015758 596251488 609987319
1132 609987319 620646536 630646467 641136289 651428640 659504592 664386034 667364776 669504762
1148.3 669504762 670078635 669095457 668271303 668069541 667106211 665552437 665763319 668534756 671945989
1166.6 671945989 674208581 674197912 670163989 661569178 650926173 640872359 632044554 625343144
1182.9 625343144 620733559 614904284 607124507 603653789 608962417 619032383 629395366 639431477
1199.3 639431477 646695793 647101402 639808178 627510786 612886846 596616566 579841197 566271365
1215.6 566271365 559390426 559268653 563954592 571919382 580973446 587743759 590643048 590415180 587285519
1233.9 587285519 580796957 571808636 561553299 549461544 534348190 517684758 505234063 504520476
1250.3 504520476 517542541 537110329 552840054 558225811 552377284 538983226 524131000 512019455
1266.6 512019455 503021240 498108745 500357509 509212315 519661665 527522564 531507552 532566488
1282.9 532566488 533695817 538526356 548394442 561810374 576657414 590906084 602424979 610485196
1299.2 610485196 616235435 620499134 623128712 625031948 628165424 632676721 637117386 641249597
1315.5 641249597 645601273 648965657 649624765 648795843 649815083 654087365 659811258 664588690 666698873
1333.9 666698873 664529562 657384634 647889078 640965044 638497531 639655292 643350780 646553159
1350.2 646553159 645439863 640025139 633060336 626043856 618939877 612432241 607926667 605257332
1366.5 605257332 603636265 602752864 601735055 599776030 597391963 595238566 593183339 591000795
1382.8 591000795 589442372 589444518 590121210 589316368 585885227 580395877 575691462 575568795 581063151
1401.2 581063151 589137077 596260905 599613667 598267019 593507111 588075101 584795713 585390270
1417.5 585390270 589228928 591771007 589786947 583066285 570156217 546881080 511881292 470052660
1433.8 470052660 432458103 429784536 469414592 516559362 541434109 542005837 535910845 535050452
1450.1 535050452 537091136 535599589 523993373 499374181 471322268 443778634 425719649 437308073
1466.4 437308073 473079950 509283066 530184507 530671954 517560899 496863514 469826043 437227726
1482.8 437227726 401180208 361369193 318077803 278412342 251809031 239199102 242953032
1497 242953032 264786065 295112520 323568612 346901417 361980259 364201128 359999299 355662793
1513.4 355662793 356927931 368331850 390451789 422541350 454184115 477705359 496046782
1527.6 496046782 509405971 520187259 532158554 543486536 552185357 561438799 571283519 578976452
1543.9 578976452 584589303 588376701 591032803 592316806 591175556 587127328 578937113 568896472
1560.3 568896472 562136769 555917084 550366282 547249436 546538770 544690728 534031868 510361075
1576.6 510361075 493671626 500981152 523158610 538129747 533519030 512660325 480686218 441812366
1592.9 441812366 402961195 373385340 356851727 346878439 334173083 317383945 301805794
1607.2 301805794 290636837 283311009 276911318 265025079 241775945 214740396 189946264 170355707
1623.5 170355707 165759593 181155860 214765683 257277012 303817689 354986310 394269139
1637.8 394269139 415820658 429223925 438070416 444332093 448909581 450890988 450628489 449945480
1654.1 449945480 450006992 449376255 447966903 446381807 445649534 445825726 446930707 449890584 454501867
1672.4 454501867 461855710 473135442 486314893 500360429 518340230 545085311 571855664
1686.7 571855664 595283210 619877815 641773999 660025835 674199104 682179749 685866058 686354816
1703 686354816 684198797 681202710 678135872 674787521 671841145 670131505 671541750 677369237 685941458
1721.4 685941458 696426451 708381653 720564902 732484818 742848039 752496243 761936724 768969238
1737.7 768969238 774497628 779428482 783917010 787973940 791221142 794294298 798249424 801678360
1754 801678360 803445101 804359198 805247962 806172371 806752026 806715667 806294739 805334628 804044724 803968668
1774.4 803968668 804537177 804282725 803432763 803142548 803388655 803292692 802481830 801317930 800699294 800463796
1794.8 800463796 799938321 799326658 798855543 798381150 798058152 797926486 797512889 796951175 797066331 797710598
1815.2 797710598 798013866 797997177 798141539 798341691 798375428 798437834 799043834 800310612 801179290 801420748
1835.6 801420748 801893830 802376151 802094877 801781535 802736700 803990006 804557562 804931581 805379212
1854 805379212 805506170 805344224 805427313 805570304 805044293 803782403 802758455 802595019 802440941 801862836
1874.4 801862836 801263928 800513268 799340606 798178852 797294557 796148837 794490993 793192983 792423785
1892.7 792423785 791353703 790047526 789034605 788155138 787025690 785883605 785114050 784515679 783764243
1911.1 783764243 783002079 782351255 781697154 781207621 781060934 781178415 781231701 780891359 780475199 780279338
1931.5 780279338 780013084 779694855 779754877 780005991 779954791 779915571 780245364 780509353 780347705 780046344
1951.9 780046344 779965341 779880166 779466093 778964043 778651953 778250754 777617574 777249634 777274311 777142584
1972.3 777142584 776743472 776516259 776580811 776611984 776587725 776836574 777220964 777241170 776947021 776903093
1992.6 776903093 777114749 777073562 776872873 776914001 776991725 776814222 776661515 776766181 776800394 776554883
2013 776554883 776339054 776338339 776274621 775999427 775787771 775659680 775313914 774859905 774674892 774632573 774348617
2035.5 774348617 773939013 773703337 773502409 773106694 772724509 772563338 772351623 771882057 771467149 771275222
2055.9 771275222 770986319 770529568 770232618 770090401 769788742 769391358 769203842 769123018 768818259 768459201
2076.3 768459201 768379509 768363476 768114328 767856658 767832220 767768741 767479181 767284274 767322659 767232120 766921580
2098.7 766921580 766735375 766694784 766461074 766083717 765938222 765915036 765678763 765405655 765391588 765406489
2119.1 765406489 765177250 764941454 764923155 764858723 764562786 764304936 764194608 763932049 763456941 763111889
2139.5 763111889 762904227 762519777 762046993 761827230 761785805 761617124 761436462 761490047 761564493 761382163
2159.9 761382163 761123419 760974050 760675251 760030329 759336650 758800566 758221507 757654130 757474422 757643402
2180.3 757643402 757718742 757581294 757479489 757402539 757044375 756431758 755848467 755225241 754349709 753392100
2200.7 753392100 752586544 751727581 750492811 748838246 746585310 742959201 736913264 727430403 713338614
2219 713338614 693862379 670154810 646744847 632139504 634567797 653606296 679910839 704130530
2235.4 704130530 722451627 735288441 744130313 749937892 753364325 755279183 756426811 756964922
2251.7 756964922 756906807 756639242 756493747 756281674 755860388 755521774 755362391 755080998 754649818 754355550
2272.1 754355550 754134476 753703296 753222644 753010690 752832651 752307534 751606822 751022398 750392258 749565065
2292.5 749565065 748833239 748365998 747839987 747091651 746457934 746009588 745316088 744303942 743402123
2310.8 743402123 742682457 741780102 740649402 739565372 738584340 737601399 736778140 736238539 735679805
2329.2 735679805 734945476 734339714 733981311 733669281 733375847 733351946 733721077 734378457 735048473 735166788
2349.6 735166788 734319150 732670903 731044292 730145752 729812264 729660332 729907453 730734408 731747448
2367.9 731747448 732634425 733539462 734522879 735321820 735865951 736400485 736905277 737073123 736908793 736752033
2388.3 736752033 736642838 736346841 735952437 735699415 735455394 735031366 734640598 734451830 734206736 733721912
2408.7 733721912 733240783 732919991 732508957 731908441 731421292 731101692 730638683 730030119 729550540 729174256
2429.1 729174256 728682578 728181362 727902889 727692604 727294087 726848900 726574481 726313055 725888371 725479126
2449.5 725479126 725220203 724880159 724344730 723880768 723573148 723193049 722747505 722441971 722227275 721907139
2469.9 721907139 721522987 721261442 721065044 720752954 720397651 720154107 719888449 719421923 718920231 718559802
2490.3 718559802 718184829 717694640 717264652 716938317 716508985 715932071 715408444 714965224 714428008 713862777
2510.7 713862777 713476241 713178039 712762713 712291062 711906910 711539686 711088359 710658848 710350335 710023165
2531.1 710023165 709562659 709109604 708772302 708423853 707997799 707640469 707368195 706990838 706476152 705962062
2551.5 705962062 705447912 704825819 704155624 703589439 703063846 702417612 701730669 701161981 700663805 700150490
2571.9 700150490 699711144 699430645 699163914 698759913 698309302 697887599 697361290 696701109 696124375 695734203
2592.3 695734203 695400417 695084333 694886327 694751859 694490612 694106281 693749130 693386555 692907870 692416549
2612.7 692416549 692080557 691859663 691681802 691643119 691782117 691900373 691853166 691791713 691836476 691855311
2633.1 691855311 691799819 691825151 691923678 691911042 691769719 691629708 691510558 691337049 691170216 691146433
2653.5 691146433 691188931 691112697 690971792 690904975 690802753 690551579 690300822 690140963 689899921 689502478
2673.9 689502478 689129174 688834429 688444793 687949836 687536955 687193632 686746001 686239421 685814500 685391009
2694.3 685391009 684851944 684320986 683926284 683519661 682965517 682420671 681991696 681502104 680915356 680421710
2714.6 680421710 679999232 679436028 678740382 678121567 677577257 676929474 676232696 675667763 675169230 674595237
2735 674595237 674018919 673553467 673127890 672680914 672339201 672142506 671896875 671494365 671088517 670775533
2755.4 670775533 670422971 670020401 669777632 669693708 669560611 669387758 669309437 669272661 669127464 668885529
2775.8 668885529 668647647 668358803 667956650 667572081 667301774 667048573 666727841 666394591 666060865 665605605
2796.2 665605605 665011883 664407253 663826108 663214803 662629068 662141323 661624432 660932899 660133064 659341156
2816.6 659341156 658516765 657591581 656654060 655788839 654900491 653901696 652898133 651966453 650982797
2835 650982797 649876297 648718715 647502363 646166205 644762337 643371463 641986907 640624583 639421701
2853.3 639421701 638471067 637648702 636743724 635712922 634637237 633487225 632234335 631079137 630246699
2871.7 630246699 629767597 629596531 629650831 629762709 629778564 629693568 629591048 629429877 629081368 628563046
2892.1 628563046 628019691 627462804 626802921 626127481 625562131 625006020 624301136 623480797 622652173 621731520
2912.5 621731520 620580614 619296730 618030131 616721332 615312696 613940001 612703800 611630023
2928.8 611630023 610906541 610782921 611262202 612114370 613148212 614251256 615214825 615812421 616083086
2947.2 616083086 616251349 616388679 616407335 616272688 615993202 615476906 614680409 613740206 612744987 611662149
2967.6 611662149 610596538 609813452 609408438 609265089 609318674 609566569 609902740 610172987 610366583 610550106
2987.9 610550106 610654831 610637128 610568762 610356271 609848022 609135330 608470738 607985139 607553899 607019842
3008.3 607019842 606328487 605282664 603553593 600994825 597680330 593833029 589961886 586841226
3024.7 586841226 584984481 584211767 584015191 584073722 584214449 584228158 583924353 583250761 582080424 580132306
3045.1 580132306 577377796 574134469 570756435 567541301 564894497 563154280 562333405 562379003 563371301
3063.4 563371301 565304518 567839682 570477664 572948456 575178206 577073157 578685760 580314457
3079.7 580314457 582163393 584143996 586061060 587782741 589103043 589758158 589845240 589819074 589970410
3098.1 589970410 590340555 590993524 591901362 592799485 593414247 593723238 593973577 594420671 595136881 596068561
3118.5 596068561 596985340 597606301 597937167 598162353 598309517 598238468 597970486 597684681 597384572 596999288
3138.9 596999288 596527278 595998347 595432818 594835937 594318926 593935668 593491077 592840254 592114210 591397762
3159.3 591397762 590558946 589539528 588416338 587177515 585748196 584193408 582649291 581125200
3175.6 581125200 579619229 578233421 576958835 575630367 574195385 572790265 571490645 570261657
3191.9 570261657 569172144 568333387 567671716 566980243 566168249 565312028 564467013 563584566 562660456
3210.3 562660456 561759293 560856342 559853017 558749735 557662487 556598723 555482030 554356933 553237915
3228.6 553237915 552027047 550775349 549644113 548606157 547531962 546418548 545337737 544310391
3244.9 544310391 543388128 542657733 542051733 541428447 540764511 540111482 539460003 538746655 537957907 537124932
3265.3 537124932 536246359 535297036 534292459 533270955 532245278 531178296 530027986 528800726 527498543
3283.7 527498543 526104748 524635136 523130417 521600366 520008445 518316090 516554117 514788210
3300 514788210 513009310 511190057 509314716 507346690 505262554 503077626 500870526 498669147 496402860
3318.4 496402860 494051635 491631657 489110976 486462027 483719140 480908483 477995366 475010663
3334.7 475010663 472030252 468990237 465791851 462481648 459123939 455728054 452312976 448849142
3351 448849142 445289940 441675633 438100129 434595466 431128502 427731246 424521655 421519279 418576092
3369.3 418576092 415626019 412839562 410373420 408170938 406141073 404290199 402684093 401326269
3385.7 401326269 400206774 399347633 398552865 397624254 396756589 396247417 395955116 395400077 394539535
3404 394539535 393849224 393514693 393321753 393070012 392692178 392262936 391862720 391465962 391058654 390685767
3424.4 390685767 390430361 390339226 390289068 390284657 390421510 390525222 390473574 390469790 390734911 391263902 391949117
3446.8 391949117 392699361 393473327 394268572 395089447 395963848 396912038 397869408 398890883 400151998
3465.2 400151998 401544482 402684748 403473049 404347032 405634940 407257438 408892632 410288155 411687165
3483.6 411687165 413357496 415114999 416829318 418658793 420645148 422723860 424831092 426953286
3499.9 426953286 429161340 431399256 433619082 435977846 438600779 441417515 444170058 446698219
3516.2 446698219 449135661 451628804 454208702 456663311 458790720 460813135 462958813 465157062
3532.5 465157062 467354029 469496965 471491456 473452300 475437850 477314591 479065359 480859965
3548.8 480859965 482782781 484899253 487202287 489487171 491689652 493797213 495613039 497237056
3565.1 497237056 499526590 502775311 505962908 508608341 511060834 513591707 516292512 519101560
3581.5 519101560 521670222 523799539 526021421 528875530 531724691 534196854 536757588 539583981
3597.8 539583981 542400062 545134783 547657013 549717426 551692367 553999782 556459785 558990598
3614.1 558990598 561394870 563699126 566535890 569554508 571842968 573215961 574642897 577493191
3630.4 577493191 580810070 583656430 586163044 588470042 590702355 592786491 594324112 595257282
3646.7 595257282 596848965 600203335 603741288 606451273 609272182 612492383 615302026 617580593
3663 617580593 619454861 620655239 621532381 623057902 624563217 625818908 628080904 630759716 632910967
3681.4 632910967 634398043 635115802 635171235 635294616 636272490 637638867 638628304 638993323 638779223
3699.8 638779223 638488352 638677716 638861239 638347864 637379944 637113512 637938023 638644516 638562679 638017178
3720.1 638017178 637487173 637202084 637221396 637349367 636961937 635861039 634933233 635178268 636161208 636562705
3740.5 636562705 635647893 634347439 634148061 633910358 633341134 634004533 635232091 635651410 635506094
3758.9 635506094 635680795 635914505 635668576 635250986 635014713 635206163 635642767 635715365 635282040 634724796
3779.3 634724796 634480655 634413600 634377122 634494662 634554267 634303510 633653879 632742465 631962717 631147325
3799.7 631147325 630520582 630738378 630917251 630910516 631277561 631370604 630577266 629423022 628710628 628027380
3820.1 628027380 627776504 628276825 628495097 628318846 627976418 627501428 626983166 626203418 625486910 625577688
3840.5 625577688 626173973 626815319 627252996 627010286 625625491 623518348 623123586 624436021 625226200
3858.8 625226200 625012159 624363661 624038637 623862147 623211622 622696280 622834563 623223424 623356044 622804344
3879.2 622804344 622232616 622080386 621876657 621796906 621610999 621171653 621186316 621333778 620711744 619505286
3899.6 619505286 618575335 618367672 618922174 619716465 620106518 620017350 619570673 618904889 618409157 618294179
3920 618294179 618272960 618162692 618124127 618083358 617862463 617694199 617793381 617905319 617789805 617469728 617127061
3942.5 617127061 616980433 616880417 616677642 616547763 616521776 616470695 616355300 616198421 616002798 615802646
3962.9 615802646 615628481 615446091 615252674 615062833 614848256 614644468 614497244 614345789 614159644 613962770
3983.2 613962770 613732398 613446891 613150299 612887681 612636149 612387896 612169564
3997.5 612169564
##END=$$ End of the data block
