##TITLE=Pirilio $$ Begin of the data block
##JCAMP-DX=5.00 $$ ACD/SpecManager v 10.08
##SPECTROMETER/DATA SYSTEM=Alpha
##DATE=30 May 2014 08:24:52
##DATA TYPE=INFRARED SPECTRUM
##DATA CLASS=XYDATA
##ORIGIN=
##OWNER=
##NPOINTS=1765
##FIRSTX=399.75695801
##LASTX=3997.56933594
##MAXX=3997.56933594
##MINX=399.75695801
##MAXY=0.81801224
##MINY=0.06884636
##XFACTOR=1.0000000000
##YFACTOR=1.000000000000000e-9
##FIRSTY=0.79950172
##DELTAX=2.03957629
##XUNITS=1/CM
##YUNITS=ARBITRARY UNITS
##XYDATA=(X++(Y..Y))
399.8G99501717j68502N022108O531179R52542k166152J906097K604961k530455k352894
$$ 799501717 799333215 804355323 810886502 811839044 809672892 811578989 814183950 811653495 809300601
418.1H09300601M123927J758754l295899J28091L271460j819670m524290J027941K824664
$$ 809300601 813424528 815183282 811887383 812015474 815286934 813467264 808942974 809970915 812795579
436.5H12795579k225220k052545K982199R72390m595637k229929J455664l042280o856859
$$ 812795579 810570359 808517814 811500013 812472403 807876766 805646837 807102501 804060221 797203362
454.8G97203362j716912K107382k301395l395259R20474r95695q214713r853541r202779
$$ 797203362 795486450 797593832 795292437 791897178 792817652 791821957 783607244 773753703 764550924
473.2G64550924j3749599j5046895l782630R911001J3420582J2389839J3916730J1467219
$$ 764550924 750801325 735754430 731971800 741882801 755303383 767693222 781609952 793077171
489.5G93077171L501177J117706N069971L515482k416313j292765L378689O51896l710985
$$ 793077171 796578348 797696054 802766025 806281507 803865194 802572429 805951118 806603014 802892029
507.9H02892029l94284K908527j227736l995419K76089K041042k508998l159642J499951
$$ 802892029 802497745 805406272 804178536 800183117 800459206 802500248 799991250 796831608 798331559
526.2G98331559J339972l323674k482832J706898J04189l502190j092076K167582q10384
$$ 798331559 799671531 796347857 793865025 795571923 795676112 792173922 791081846 793249428 792439044
544.6G92439044l407062l1530J973211j749277l050625N61356O00815l908694n165159
$$ 792439044 789031982 789000452 790973663 789224386 786173761 786735117 787335932 783427238 778262079
562.9G78262079l405333m636407m354000K137125P053673L629565j194656m98592Q64565
$$ 778262079 774856746 770220339 765866339 768003464 775057137 778686702 777492046 776993454 777858019
581.3G77858019k012193m257262j996636j439631n176723p485211p551849j5507758
$$ 777858019 775845826 771588564 769591928 768152297 762975574 755490363 747938514 732430756
597.6G32430756m2924225q0327273n6012332M3212891Q2400500K4186433l3171475
$$ 732430756 689506531 609179258 553166926 596379817 678780317 702966750 669795275
611.9F69795275o6264332q6515247p1692020l9311260q106470N8578819J23984366
$$ 669795275 603530943 517015696 445323676 406012416 397905946 456484765 580469131
626.1E80469131J05202079L3192754j4072776q408069K6212573L7119090J7643571
$$ 580469131 685671210 718863964 704791188 696383119 722595692 759714782 777358353
640.4G77358353K148926k91168J659691L834307M514396J373291l824234m861712l313422
$$ 777358353 779507279 779216111 780875802 784710109 789224505 790597796 786773562 781911850 778598428
658.8G78598428n818188j0645152j1880278j8219352l5820246l8734197l8450599m8977077
$$ 778598428 772780240 762135088 750254810 732035458 696215212 657481015 619030416 570053339
675.1E70053339o4309895p0764244n1078170p383973L6985159O3806057P0571244N9482277
$$ 570053339 505743444 434979200 383901030 376517057 413502216 477308273 547879517 607361794
691.4F07361794M2254328L2515526K8999388K3179293J4627397J0269165J0756612
$$ 607361794 649616122 682131648 711131036 734310329 748937726 759206891 769963503
705.7G69963503P700264j136899j3147235l2658696n1693499l8796961J0254860M9827993
$$ 769963503 777663767 776526868 763379633 730720937 679027438 640230477 650485337 700313330
722G00313330M8862338K8467178J4745951P885217Q19445l242433j798212j772047
$$ 700313330 749175668 777642846 792388797 800274014 801093459 797851026 796052814 794280767
738.3G94280767n777239p152915m933775o014764j0426581j1915624j2439192j8639445
$$ 794280767 788503528 781350613 776416838 770402074 759975493 748059869 735620677 716981232
754.6G16981232k9355883m2379439o3572586r2962861j09263927q6001515k8745025
$$ 716981232 687625349 645245910 581673324 488710463 379446536 293445021 264699996
768.9B64699996K5218874N7714730Q0944658R4672977Q4712625N4249466K4393200
$$ 264699996 289918870 347633600 428578258 523251235 607963860 662213326 686606526
783.2F86606526J4598430K2801935L1663239L0926347J9980788O468058P14064K269446
$$ 686606526 701204956 724006891 755670130 786596477 806577265 813045323 813759387 816028833
799.5H16028833J983405j498640j531780J000405p06017n134881o477654o792724p575274
$$ 816028833 818012238 816513598 814981818 815982223 815276206 810141325 803663671 796870947 789295673
817.9G89295673k092421Q666337J1652112M015148k656043l106475m171789r550154
$$ 789295673 787203252 795869589 807521701 811536849 808880806 805774331 801602542 792052388
834.2G92052388j2865960q315087L96967N219937N832195O053150M169225J17362j230240
$$ 792052388 779186428 770871341 771268308 776488245 782320440 788373590 792542815 792660177 791429937
852.5G91429937n90086l354907q468092j2877345k2064626l8438082m6240508l3273757
$$ 791429937 790839851 787484944 779016852 766139507 744074881 705636799 659396291 626122534
868.9F26122534l672123L1248689M8098087L9372623K4290085J2719929N426824L614068
$$ 626122534 622450411 653699100 701797187 741169810 765459895 778179824 783606648 787220716
885.2G87220716K753854q8274j188100N80371P57754j429975j759768k2054m24683
$$ 787220716 789974570 789886296 788698196 789278567 790036321 788606346 786846578 786824524 786399841
903.5G86399841k548754k237737l68238j001060k939522k549529j709878l904105o808102
$$ 786399841 783851087 781613350 781245112 780244052 777304530 774755001 773045123 769141018 762332916
921.9G62332916p255971p182300o917119k531350M952967Q018851M238129M7088n00739
$$ 762332916 755076945 747894645 740977526 738446176 743399143 751417994 755656123 755703211 755202472
940.2G55202472p70986l072142m905642n825281q766770j3168633j6706049k1297455
$$ 755202472 754431486 751359344 746453702 740628421 731861651 718693018 701986969 680689514
956.6F80689514k1990121k593398K8629482L6649346J8150449R92894m089951m537702
$$ 680689514 658699393 656105995 684735477 721384823 739535272 740528166 736438215 731900513
972.9G31900513o343961q251726p355452m361093j670956p60019q89480k099812o821990
$$ 731900513 725556552 717304826 709949374 705588281 703917325 703157306 702267826 700168014 693346024
991.2F93346024j6075910k9166936l5872221j4886380K3548246L7430465K1366954
$$ 693346024 677270114 648103178 612230957 597344577 620892823 658323288 679690242
1005.5F79690242L403425m562259p343590j0752320j1033178k231001M761517p51675
$$ 679690242 683093667 678531408 671187818 660435498 649402320 647171319 651932836 651181161
1021.8F51181161j0083317j3374806j0718286n190432L90351K933621L23832n248189
$$ 651181161 641097844 627723038 617004752 611814320 612204671 615138292 615462124 610213935
1038.1F10213935r125411j0114789j1226475j3493121j4099836j2857557j3916731
$$ 610213935 601088524 590973735 579747260 566254139 552154303 539296746 525380015
1052.4E25380015j8179655k2180348k5074631k8718949l3171594l7146419m0588021
$$ 525380015 507200360 485020012 459945381 431226432 398054838 360908419 320320398
1066.7C20320398m3261797m3399617l9481252l1870648k2338763j3608083p971131
$$ 320320398 277058601 233658984 194177732 162307084 139968321 126360238 118389107
1081A18389107n816713p368527j1711627j4073283r947471o25126R698078J9306801
$$ 118389107 112572394 105203867 93492240 79418957 69471486 68846360 78544438 97851239
1097.3I7851239K9899396M2709068N4851591O1975733O3234955O0607254N4836780
$$ 97851239 127750635 170459703 225311294 287287027 350521982 411129236 465966016
1111.6D65966016M7042519L8911581K8749824J8687188K0263195L1609476L2879352
$$ 465966016 513008535 551920116 580669940 599357128 619620323 651229799 684109151
1125.8F84109151K2297502J4414608J1210978P592500M617870M439413M181564J786470
$$ 684109151 706406653 720821261 732032239 739624739 744242609 748682022 752863586 754650056
1142.2G54650056K88129R87649M94003j957893l157079l721058q755029k0318269l0756355
$$ 754650056 754938185 755925834 756419837 754461944 751304865 747583807 738828778 718510509 687754154
1160.5F87754154k4413764o1989K1205902K6489913K0490826J0258674K444446o0856
$$ 687754154 663340390 663278401 684484303 710974216 731465042 741723716 744168162 744107306
1176.8G44107306j135528m044712o738424p554114q183002q663953o719947k205133
$$ 744107306 742971778 738927066 732188642 724634528 716451526 707787573 701067626 698862493
1193.1F98862493K759397O037235O379962L911913o85275n489886q153557r787381
$$ 698862493 701621890 707659125 714039087 717951000 717265725 711775839 703622282 693834901
1209.5F93834901j2952268j6687572j9062519k1039784k3014367k2530913j8835664
$$ 693834901 680882633 664195061 645132542 624092758 601078391 578547478 559711814
1223.7E59711814j4546096j0538102o010890l367722n201459r317636j1727274j1601895
$$ 559711814 545165718 534627616 528616726 525249004 520047545 510729909 499002635 487400740
1240.1D87400740j0963767j0223210n725533O364822K4108470L7912756L6992490K0221353
$$ 487400740 476436973 466213763 460488230 466853052 490961522 528874278 565866768 586088121
1256.4E86088121k349258j7440378j7335415m911423J1629343K6169420L4610450L4614742
$$ 586088121 583738863 566298485 548963070 544051647 555680990 581850410 616460860 651075602
1272.7F51075602K8059065K0203590J4637649J0508299N806566J690268L30865M40360
$$ 651075602 679134667 699338257 713975906 724484205 730290771 731981039 732311904 732752264
1289G32752264k18094q60214l89934l12805j428723j710415q0586J827658K719223
$$ 732752264 732534170 731673956 731284022 730971217 729542494 727832079 727751493 729579151 732298374
1307.4G32298374L092408K785743Q82685j604855k443254j880825j706779j676976
$$ 732298374 735390782 738176525 739059210 737454355 735011101 733130276 731423497 729746521
1323.7G29746521p44701J13666p78973k719820m383206o835878j0679245j0825932
$$ 729746521 729001820 729115486 728336513 725616693 721233487 714397609 703718364 692892432
1340F92892432l140688O155372J0544121R953976P009685L328681k45571k551496l292084
$$ 692892432 689751744 695907116 706451237 716405213 723414898 726743579 726498008 723946512 720654428
1358.3G20654428m136324n606294n761563m087925j768470K99454J174926N99921j233697
$$ 720654428 716518104 710911810 705150247 701062322 699293852 699593306 700768232 701368153 700134456
1376.7G00134456l349602m279137m249453m742563o190002p496715r062707j3738513
$$ 700134456 696784854 692505717 688256264 683513701 677323699 669826984 660764277 647025764
1393F47025764j9937217j9912362j1991859j348138O538153J0411143R935439N785227
$$ 647025764 627088547 607176185 595184326 593836188 600374341 610785484 620720923 626506150
1409.3F26506150L02613n606711j2134374k1562337l2543600l1246126j5641570J1946202
$$ 626506150 626808763 621202052 609067678 587505341 554961741 523715615 508074045 520020247
1425.7E20020247L7749469M1474521K3534238M891217m562497r760916j4980376k5616169
$$ 520020247 557769716 599244237 622778475 627669692 623107195 613346279 598365903 572749734
1442E72749734l9855123m1283249q501351L4385323L5360634O977916j8619120k7883410
$$ 572749734 532894611 491611362 483110011 517495334 552855968 559833884 541214764 513331354
1458.3E13331354k3820132l1044454n1613688o1873347m5279026r319216N2295327
$$ 513331354 489511222 458466768 406853080 344979733 299700707 290381491 342676818
1472.6C42676818R3504042P0306986K8009415m724622k3137092l2549203m1675895
$$ 342676818 436180860 506487846 534497261 529772639 506635547 474086344 432410449
1486.8D32410449n4264158o1283738n2424967m2044312l1439736j2146995K953112
$$ 432410449 378146291 316862553 264437586 222393274 190953538 178806543 181759655
1501.1A81759655Q888349J3315916J7395482J3464749J0689914R949297O992399L251464
$$ 181759655 190648004 203963920 221359402 234824151 245514065 255463362 262455761 265707225
1517.4B65707225J34676l000408m432619l603309o5327O128967J6344190L3487588
$$ 265707225 265841901 262841493 258408874 254805565 254740238 260869205 277213395 310700983
1533.7C10700983M3158233M9744517P2467804P3932111M8697829L3594191K3548246
$$ 310700983 353859216 403603733 476071537 550003648 598701477 632295668 655843914
1548F55843914J6510903R963751L936768n61536o392419j1869252r805560q565008
$$ 655843914 672354817 682318568 686255336 685693800 679301381 667432129 657626569 649061561
1564.3F49061561q704603j4014602k5416791l3720970m8926294o5057397l1192869
$$ 649061561 640356958 626342356 600925565 567204595 518278301 453220904 422028035
1578.6D22028035K1402121M2252600K1792799j7331004m7955513o2641233n3028822
$$ 422028035 443430156 485682756 507475555 490144551 442189038 379547805 326518983
1592.9C26518983j2622863L5913586N3406030L1679183J00017q360028J337081k661020
$$ 326518983 313896120 349809706 403215736 434894919 434994936 426634908 427971989 425310969
1609.2D25310969k4527788m0831417n1891088o1466664n0764576m0474146l9485030
$$ 425310969 400783181 359951764 308060676 246594012 195829436 155355290 115870260
1623.5A15870260k8575369j0147124Q144908K4700507M5547061P8846901Q4856555
$$ 115870260 87294891 77147767 85292675 109993182 155540243 234387144 319243699
1637.8C19243699O5791041N6977153N1983326N3205044M9558103L1632006K7062714
$$ 319243699 385034740 442011893 493995219 547200263 596758366 628390372 655453086
1652F55453086L4664869K5420726J7841637J6222834J4547706J1417985P184684M709661
$$ 655453086 690117955 715538681 733380318 749603152 764150858 775568843 782753527 787463188
1668.4G87463188L658712L237724M164577M892826K859294N58496l66569N35488J035452
$$ 787463188 791121900 794359624 798524201 803417027 806276321 806834817 806468248 807003736 808039188
1686.7H08039188k05695j018048j728773l471911m431367l473520k519429j490771
$$ 808039188 807833493 806815445 805086672 801614761 797183394 793709874 791190445 789699674
1703G89699674j150966n91397l83377j314402k057016k122223j551867l55840K62499
$$ 789699674 788548708 787957311 787573934 786259532 784202516 782080293 780528426 780172586 780435085
1721.4G80435085k8729o56366j366258j580417j526714j905918j276970l34799k68221
$$ 780435085 780406356 779749990 778383732 776803315 775276601 773370683 772093713 771758914 771490693
1739.7G71490693k98440n3823M41849Q23796R61125J444399J656890J015007O9678
$$ 771490693 771192253 771138430 771580279 772404075 773365200 774809599 776466489 777481496 777551174
1758.1G77551174n51939m32193k37227p61449j039267n49197j46210o2525j45078j4841
$$ 777551174 776999235 776567042 776329815 775568366 774529099 773979902 773833692 773771167 773626089 773611248
1778.5G73611248O69419J568079K183974K025247P46488o82771o94752q3506n49733
$$ 773611248 774280667 775848746 778032720 780057967 780804455 780121684 779426932 779343426 778793693
1796.9G78793693j025498l74079L12865k79546j331925j912117k191604k293408j756370
$$ 778793693 777768195 777394116 777706981 777427435 776095510 774183393 771991789 769698381 767942011
1815.2G67942011m95314P08818J164198J427353J895725J594067Q17180Q53240Q16405
$$ 767942011 767446697 768155515 769319713 770747066 772642791 774236858 775054038 775907278 776723683
1833.6G76723683j18256q57413p58290p21633j067341p16388O8903K35975j72317n29707
$$ 776723683 776605427 775748014 774989724 774268091 773200750 772484362 772553265 772789240 772616923 772087216
1854G72087216l80337l05056p28727j079380j081586j436770j986265j500845n58436
$$ 772087216 771706879 771401823 770673096 769593716 768512130 767075360 765089095 763588250 763029814
1872.3G63029814l98755n34892k26438K39372J98543k46346n06878o16550q65102j293183
$$ 763029814 762631059 762096167 761869729 762109101 762307644 762061298 761554420 760937870 760072768 758779585
1892.7G58779585j623809j760781k023935k077043j407743n72085k89619p0810N76079
$$ 758779585 757155776 755394995 753371060 751294017 749886274 749314189 749024570 748953760 749529839
1911.1G49529839R68158N90980Q6307P749k30372o70135n61416j05739P6235o259r239
$$ 749529839 750497997 751088977 751175284 751183033 750952661 750282526 749721110 749615371 749691606 749685347 749676108
1933.5G49676108J39952J29342p9751j00016J16527k5452n03599p35283q23498j040578
$$ 749676108 749816060 749945402 749865651 749765635 749882162 749856710 749353111 748617828 747794330 746753752
1953.9G46753752j155376r70423p76649q41200j066089j285672j488805j789808k084315
$$ 746753752 745598376 744627953 743851304 743010104 741944015 740658343 739169538 737379730 735295415
1972.3G35295415k116978j943350j689792j263261p83741n73397o79493q45372r86100
$$ 735295415 733178437 731235087 729545295 728282034 727498293 726924896 726245403 725400031 724413931
1990.6G24413931j143217j292646j438141j549422j611531j465857r33349k99692p2480
$$ 724413931 723270714 721978068 720539927 718990505 717378974 715913117 714979768 714680076 714607596
2009G14607596k79367m90665k72393O33061K011180L129661L456235L019809K251685
$$ 714607596 714328229 713837564 713565171 714198232 716209412 719339073 722795308 725815117 728066802
2027.3G28066802J650989J303375R74059O08861L31045J10805j38700l53098m23789
$$ 728066802 729717791 731021166 731995225 732604086 732935131 733045936 732907236 732554138 732130349
2045.7G32130349l77953l51370l75151l98398m33743n31137o05285n03957l35694l07679
$$ 732130349 731752396 731401026 731025875 730627477 730193734 729662597 729057312 728553355 728217661 727909982
2066.1G27909982l44753l23772l28303l82662l42607k02120j38878j99676k47598k26974
$$ 727909982 727565229 727241457 726913154 726530492 726187885 725985765 725846887 725647211 725399613 725172639
2086.5G25172639k79844m53770n41866m26233l15189l53932l70622l05414l37303m42266
$$ 725172639 724892795 724439025 723897159 723470926 723155737 722801805 722431183 722125769 721788466 721346200
2106.9G21346200m21942l42309l76165m41134l68357k87592l86179n15818n13971m96686
$$ 721346200 720924258 720581949 720205784 719764650 719396293 719108701 718722522 718206704 717692733 717196047
2127.3G17196047n65469n87940m77493m04596m82500n06878l85523l36766m44293m95851
$$ 717196047 716630578 716042638 715565145 715160549 714678049 714171171 713785648 713448882 713004589 712508738
2147.7G12508738m00364l70801m95910n54383m52876m43221n94854o59943o11841o76155
$$ 712508738 712108374 711737573 711241663 710687280 710234404 709791183 709196329 708536386 707924545 707248390
2168G07248390q25227q43107p93159q47638q79526o66440l36885j52528p4268R8288
$$ 707248390 706423163 705580056 704786897 703939259 703059733 702393293 702056408 701903880 701829612 701927900
2188.4G01927900K73586K41756J23143Q4460J4067j81198l48449l68416l56377m08530
$$ 701927900 702201486 702443242 702566385 702650845 702664912 702483714 702135265 701766849 701410472 701001942
2208.8G01001942l84629k46822k06411k88427k49803n6148M3869J8001L3736N7817
$$ 701001942 700617313 700370491 700164080 699875653 699625850 699569702 699613571 699631572 699665308 699723125
2229.2F99723125o7592k82884l92139l88264m02272m14014l26157k44379l14176m24742
$$ 699723125 699655533 699372649 698980510 698592246 698189974 697775960 697449803 697205424 696891248 696466506
2249.6F96466506m53830n06103o53327p75695p41243o19590n65231n09322l18110j56104
$$ 696466506 696012676 695506573 694853246 694077551 693336308 692716718 692151487 691642165 691324055 691167951
2270F91167951j88828k58863k21014j86682k66313l59655m20689n59747p35641p59005
$$ 691167951 690979123 690720260 690499246 690312564 690046251 689686596 689265907 688706160 687970519 687211514
2290.4F87211514o54340o33538p14302o96182n10395l83019m34935m80354m62056n55276
$$ 687211514 686557174 685923636 685209334 684513152 684002757 683619738 683184803 682704449 682242393 681687117
2310.8F81687117p31111q28981r36568j199603j442433j386404j151561j005829q89539
$$ 681687117 680956006 680127025 679190457 677990854 676548421 675162017 674010456 673004627 672115088
2329.2F72115088o05464k59936o7115J08003L65079M84109M58777N72204O11842J54853
$$ 672115088 671509624 671249688 671182573 671290576 671655655 672139764 672598541 673170745 673782587 673937440
2349.6F73937440o28352j177013j084984p36951n12839j84595L17454N83053O04272
$$ 673937440 673309088 672132075 671047091 670310140 669797301 669612706 669930160 670513213 671117485
2367.9F71117485P11977Q10802O33240L33607K12729K10404N7876j79350k37524j81795
$$ 671117485 671829462 672640264 673273504 673607111 673819840 674030244 674088120 673908770 673671246 673489451
2388.3F73489451k66373m19795l76106k59637l40462m17352k68519j89125l82364n40793
$$ 673489451 673223078 672803283 672427177 672167540 671827078 671409726 671141207 670952082 670569718 670028925
2408.7F70028925m55499l76999m59135m57167k80321k57730m94719o08683m92692m84228
$$ 670028925 669573426 669196427 668737292 668280125 667999804 667742074 667247355 666638672 666145980 665661752
2429.1F65661752o12199n31852l14653l67880n80311n68271m52280n26428o12140m71115
$$ 665661752 665049553 664517701 664203048 663835168 663254857 662686586 662234306 661707878 661095738 660624623
2449.5F60624623l24785m15624n01930l39866j96040l13997m20988k64883r9480j67608
$$ 660624623 660299838 659884214 659382284 659042418 658846378 658532381 658111393 657846510 657747030 657579422
2469.9F57579422k19166q5175r9302l36051l83138k07842k13146m08411m17411k69413
$$ 657579422 657360256 657275081 657175779 656839728 656456590 656248748 656035602 655627191 655209780 654940367
2490.3F54940367l11971m78268m41312k97189l80874n91040n86450m92870n82040o58333
$$ 654940367 654628396 654150128 653708816 653411627 653030753 652439713 651853263 651360393 650778353 650120020
2510.7F50120020m94182l60728n13970o45042n02407m06325n29528n22554k87413j88172
$$ 650120020 649625838 649265110 648751140 648106098 647603691 647197366 646667838 646145284 645857871 645669699
2531.1F45669699l14653l44217k12252k54631n12481o04331m89414n27084p40826q04901
$$ 645669699 645355046 645010829 644798577 644543946 644031465 643427134 642937720 642410636 641669810 640864909
2551.5F40864909o94752o91176p31647n59449l71575n02825p25806o77943n83351o98924
$$ 640864909 640170157 639478981 638747334 638187885 637816310 637313485 636587679 635909736 635326385 634627461
2571.9F34627461p54356n85139m98235o16670o47664m90248m25279n22077m49240j62363
$$ 634627461 633873105 633287966 632789731 632173061 631525397 631035149 630609870 630087793 629638553 629476190
2592.3F29476190l2545j59919k81334l39925m90129o25551n14686k71678j50382q4937
$$ 629476190 629443645 629283726 629002392 628662467 628172338 627546787 627032101 626760423 626610041 626525104
2612.7F26525104J24455L49938L05713J10089P7308Q2314j09613k45929q3387J13726
$$ 626525104 626649559 626999497 627305210 627415299 627492607 627574921 627465308 627219379 627135992 627249718
2633.1F27249718J16110J31905L02434L87907K83420K33948L07262K72453R9480P331
$$ 627249718 627365828 627497733 627800167 628188074 628471494 628705442 629012704 629285157 629384637 629391968
2653.5F29391968L1293l6002k40862l48210k79129k51591l16679k78652j55032j75178
$$ 629391968 629423261 629387259 629146397 628798187 628519058 628267467 627950788 627672136 627517104 627341926
2673.9F27341926l07143l29613k95878m03583n61178n32984m08709m56989n94378n39839
$$ 627341926 627034783 626705170 626409292 626005709 625444531 624911547 624502838 624045849 623451471 622911632
2694.3F22911632l95596m28557n06103m21167l38614m17292m89950m51744m53114n46992
$$ 622911632 622516036 622087479 621581376 621160209 620821595 620404303 619914353 619462609 619009495 618462503
2714.6F18462503n87404n24759n31793o74188p69734p82311q46982q91984p56860n22434
$$ 618462503 617875099 617350340 616818547 616144359 615374625 614592314 613745332 612853348 612096488 611574054
2735F11574054m38094m89533l82960j39594n2154j28746j59085j46568k25186l07381
$$ 611574054 611135960 610646427 610263467 610123873 610071719 609942973 609783888 609637320 609412134 609104753
2755.4F09104753k25544o8665k9743m5776J8895M0948r4473k16306k04444k44379m08291
$$ 609104753 608879209 608810544 608780801 608735025 608753920 608794868 608700395 608484089 608279645 608035266 607626975
2777.9F07626975m62413l48091k80798k97129k12371n8651j6153n3346n4300o1989
$$ 607626975 607164562 606816471 606535673 606238544 606026173 605967522 605951369 605898023 605843723 605781734
2798.3F05781734k24173m72546n74112n54919o48439q57591r47357q97705r20654j009106
$$ 605781734 605557561 605085015 604510903 603955984 603307545 602449954 601502597 600604892 599684238 598675132
2818.7E98675132r94444r55105j058698j209914j256883j318872j518250j669824j599252
$$ 598675132 597680688 596725583 595666885 594456971 593200088 591881216 590362966 588693142 587093890
2837E87093890j499951j620054j918912k276957k410174j753568k91884R64105J173436
$$ 587093890 585593939 583973885 582054973 579778016 577367842 575614274 575322390 576286495 577459931
2855.4E77459931O54400J18434j95861l73840m83572m90129l50178j75535j02044k2173
$$ 577459931 578114331 578232765 578036904 577663064 577179492 576689363 576339185 576163650 576061606 576039433
2875.8E76039433J46389J87099J5855j91748l87192o16788p79629p74443p37906q14974
$$ 576039433 576185822 576372921 576388776 576197028 575809836 575193048 574413419 573638976 572901070 572086096
2896.2E72086096r40919j000404r76086r62854j033783j162648j403331j804531k079547
$$ 572086096 571145177 570144773 569168687 568205833 567172050 566009402 564606071 562801540 560721993
2914.5E60721993j829206j083255k48492L76344P06076P35998O05166N36859N52059
$$ 560721993 558892787 557809532 557561040 557937384 558643460 559379458 559984624 560521483 561073542
2932.9E61073542N15043L91245K46883R9003j18315l78192n96940p76470r39190j028419
$$ 561073542 561588585 561979830 562226713 562325716 562207401 561829209 561232269 560455799 559516609 558488190
2953.3E58488190j001477r20236q19206o10650k21372K47896O09875P74622P63476
$$ 558488190 557486713 556566477 555747271 555136621 554915249 555163145 555773020 556547642 557311118
2971.6E57311118O20007L98517J89543L8564r2685k30551l82960n44131o76751p10607
$$ 557311118 557931125 558329642 558519185 558557749 558465064 558234513 557851553 557307422 556630671 555920064
2992E55920064n76734l57926j66416k2531M9711M0769r7334m09782p44999q69155p51376
$$ 555920064 555343330 554985404 554818988 554796457 554846168 554886937 554789603 554379821 553634822 552765667 552014291
3014.5E52014291n43475l43382j71244j42873k82108m12405m59194m54962m11869l80277
$$ 552014291 551470816 551127434 550956190 550813317 550531209 550118804 549659610 549204648 548792779 548412502
3034.9E48412502m12882m51624m00007k98917l12746n79536j101076j727343k409100
$$ 548412502 547999620 547547996 547147989 546849072 546536326 545956790 544855714 543128371 540719271
3053.2E40719271l171385l735959l668070k820730j442611P5936J384318K237022K656102
$$ 540719271 537547886 533811927 530143857 527323127 525880516 525956452 527340770 529577792 532233894
3071.6E32233894K875328K994001K887606K477885J900255J362086R09924N20945K15471
$$ 532233894 535109222 538103223 540990829 543468714 545368969 546731055 547640979 548161924 548377395
3089.9E48377395j5021j48773j71959j53721j78277k68340k95282j71959o1870o1333
$$ 548377395 548362374 548213601 548041642 547887921 547709644 547441304 547146022 546974063 546912193 546850860
3110.3E46850860R5964M97520P36355O16193L09110O0081R1613K88427L76403L28660
$$ 546850860 546946824 547444344 548180699 548796892 549106002 549166083 549257696 549546123 549922526 550251186
3130.7E50251186K83658K90931L02851K62797J32441K623o0618j10805j76847k78473
$$ 550251186 550534844 550825775 551128626 551391423 551523864 551526487 551465869 551355064 551178217 550899744
3151.1E50899744l90291m03822k93851k04682k08557k59935l83616n58555o67393o90758
$$ 550899744 550509453 550105631 549811780 549607098 549398541 549138606 548754990 548196435 547529042 546838284
3171.5E46838284p02441p47323q07405q70287r93908j098573r86636p49349o13570
$$ 546838284 546135843 545388520 544581115 543710828 542716920 541618347 540631711 539882362 539268792
3189.9E39268792n34237l39627l2246J97887K50221K12967Q8930j51813l76582n01335
$$ 539268792 538734555 538394928 538362682 538560569 538810790 539023757 539112687 538960874 538584292 538082957
3210.3E38082957o18577p73251r01282r17375p66277n77688m64142l37839k47121l31044
$$ 538082957 537464380 536691129 535789847 534872472 534106195 533528507 533064365 532726526 532479405 532148361
3230.7E32148361m52220m62473m88281n92709o89685p89225r05335q97586p54774o25193
$$ 532148361 531696141 531233668 530745387 530152678 529462993 528673768 527768433 526870847 526116073 525490880
3251.1E25490880n33462l96549j69456P15l7789j68622k56956l46601m72128n32925
$$ 525490880 524957418 524560869 524391413 524392128 524354339 524185717 523928761 523582160 523110032 522577107
3271.4E22577107m78804m52042n59926o84440o81817o39737p02739p58648o80029o16670
$$ 522577107 522098303 521646261 521086335 520401895 519720078 519080341 518377602 517618954 516938925 516322255
3291.8E16322255o97374q31664r24289r33409q28087o79314p18653j014352j291991
$$ 516322255 515624881 514793217 513868928 512935519 512107432 511428118 510709465 509695113 508403122
3310.2E08403122j324534j200795j164317j216650j184166j044929j010775j268566
$$ 508403122 507078588 505877793 504713476 503496826 502312660 501267731 500256956 498988390
3326.5D98988390j526415j492888j383096j294166j151919j200170j472205j686185
$$ 498988390 497461975 495969087 494585991 493291825 492139906 490939736 489467531 487781346
3342.8D87781346j776993j639039j361072j489103j895934j924038j683444j590311
$$ 487781346 486004353 484365314 483004242 481515139 479619205 477695167 476011723 474421412
3359.1D74421412j692802j742810j517028j342117j612366k082646k165675j826524
$$ 474421412 472728610 470985800 469468772 468126655 466514289 464431643 462265968 460439444
3375.5D60439444j575977j545846j579017j533925j346738j102805q67605r38475j294553
$$ 460439444 458863467 457317621 455738604 454204679 452857941 451755136 450887531 449949056 448654503
3393.8D48654503j317889q89718o16163r88543j472593j322448q77351o87122p49588
$$ 448654503 447336614 446446896 445830733 444842190 443369597 442047149 441169798 440482676 439733088
3412.2D39733088q97408r27865p58261o31630o30200n33134l21865j70201j79380j26094
$$ 439733088 438835680 437907815 437149554 436517924 435887724 435354590 435032725 434862524 434683144 434557050
3432.6D34557050L2127j32709n07743m90605j29760J06514J76072K55942L15875K90454
$$ 434557050 434589177 434456468 433948725 433458120 433328360 433434874 433610946 433866888 434182763 434473217
3453D34473217L01361M41312N48453M88519N17965P56442Q16286M60922Q5354J60665
$$ 434473217 434774578 435215890 435764343 436252862 436770827 437527269 438343555 438804477 438889831 439050496
3473.4D39050496M82857P04616O76185M47542M15116N56052N24640M59939N58108O83695
$$ 439050496 439533353 440237969 440914154 441361696 441776812 442332864 442857504 443317443 443875551 444559246
3493.8D44559246P31319O54251N47439N19424M59522M16488N02258P07180R32902Q83758
$$ 444559246 445290565 445944816 446492255 447011679 447471201 447887689 448389947 449097127 450030029 450913787
3514.2D50913787O40064N81772P23153Q57323P30127N12421O27608Q87930R83804J002253
$$ 450913787 451553851 452135623 452858776 453716099 454446226 454958647 455586255 456474185 457457989 458460242
3534.5D58460242R61482Q59648Q78125R35495Q35121O77198O81401P68363Q40426R40144
$$ 458460242 459421724 460281372 461159497 462094992 462930113 463607311 464288712 465057075 465897501 466837645
3554.9D66837645R45538Q83639Q52585O65903M03523O81937J341194J422405J136065
$$ 466837645 467783183 468666822 469519407 470185310 470588833 471270770 472611964 474034369 475170434
3573.3D75170434J037180J067460J104027J169443J096546P45505O45876J206130J418889
$$ 475170434 476207614 477275074 478379101 479548544 480645090 481390595 482036471 483242601 484661490
3591.7D84661490J067847R94712J231909J243770J147866J038164P44194O08116P75427
$$ 484661490 485729337 486724049 487955958 489199728 490347594 491385758 492129952 492738068 493513495
3610D93513495Q57502Q99970Q10892O49810J052350J415193R82761J56403j37389Q88169
$$ 493513495 494370997 495270967 496081859 496731669 497784019 499199212 500181973 500338376 500200987 501089156
3630.4E01089156J477062J081050P18117N38349L93748K09570j67787o76751n33521
$$ 501089156 502566218 503647268 504365385 504903734 505297482 505507052 505339265 504662514 504128993
3648.8E04128993O10590J093149O54459N41270P96616N46634J09374j05977m65750
$$ 504128993 504739583 505832732 506487191 507028461 507825077 508371711 508481085 508375108 507909358
3667.1E07909358p74742l08632j53363n01454K41816R29415P21932L78728N8412l62694
$$ 507909358 507134616 506825984 506672621 506171167 506412983 507342398 508064330 508443058 508501470 508138776
3687.5E08138776n63920l0398M51744L13162n4300k79843j58012K16067K06828k64943
$$ 508138776 507574856 507544458 507996202 508309364 508255064 507975221 507817209 508033276 508240104 507975161
3707.9E07975161o18935j99019O03616O19590N0902l89874m05252k27868m3988Q8274
$$ 507975161 507356226 507157207 507760823 508380413 508431315 508041441 507636189 507408321 507364333 507452607
3728.3E07452607j95324o98388o40511J13487N61118P9393q82804j079321j61588j74463
$$ 507452607 507257283 506558895 505918384 506031871 506592989 506672382 505789578 504710257 504548669 504374206
3748.7E04374206m38750M22001P92623K21073j80721O8545J90020j24395l38018l51250
$$ 504374206 503935456 504357457 505150080 505371153 505190432 505258977 505448997 505324602 504986584 504635334
3769.1E04635334o8963K33233P9692k37942l41594k00212j39356j58012o6399o6638
$$ 504635334 504566371 504799604 504879296 504641354 504299760 504099548 503960192 503802180 503735781 503669143
3789.5E03669143k11120m49598o34193n28097o15955o30378k5928P7188M7981L29852
$$ 503669143 503458023 503008425 502374232 501846135 501230180 500599802 500573874 500651062 500699043 501028895
3809.9E01028895J10388n48422q71867n55098n06997k57343K81602J31339j48595k79993
$$ 501028895 501139283 500590861 499718994 499163896 498656899 498399556 498681158 498812497 498663902 498383909
3830.3D98383909l25679l49075o91652p35492n2005L49909L51697K25246k27093j062453
$$ 498383909 498058230 497709155 497017503 496282011 496230006 496579915 496931612 497156858 496929765 495867312
3850.7D95867312j678765m14342R73165O55205o5476m83692m00096k91616n46962m09215
$$ 495867312 494188547 493774205 494747370 495402575 495337099 494853407 494453311 494161695 493614733 493205518
3871.1D93205518N7488K14339J2695n08636n21004j37597j38551l3379n5879k49237
$$ 493205518 493263006 493477345 493490040 492981404 492460400 492322803 492184252 492150873 492094994 491845757
3891.5D91845757j9372j281n20677q37713o18190j43677L64274N13882K39461q5443
$$ 491845757 491826385 491825104 491304427 490466714 489848524 489704847 490069121 490583003 490822464 490737021
3911.9D90737021l25143m72099l40491o6370m2379j65314j55925j86921l09407j95444
$$ 490737021 490411878 489939779 489599288 489532918 489490539 489325225 489169300 488982379 488672972 488477528
3932.3D88477528M0472j490k13325l37631l21597k11835j91986k19703j07497Q047
$$ 488477528 488518000 488516510 488303185 487965554 487643957 487432122 487240136 487020433 486912936 486920983
3952.7D86920983k1100j14799j94222k56091k51085k08437k03699j88231j63258k01553
$$ 486920983 486899883 486785084 486590862 486334771 486083686 485875249 485671550 485483319 485320061 485118508
3973.1D85118508k59101k56836j99199j48863j72794k19553k19852k39939k65002k13563
$$ 485118508 484859407 484602571 484403372 484254509 484081715 483862162 483642310 483402371 483137369 482923806
3993.4D82923806j70201j93477
$$ 482923806 482753605 482560128
3997.5D82560128
$$ 482560128
##END=$$ End of the data block
