##TITLE=Patricia I $$ Begin of the data block
##JCAMP-DX=5.00 $$ ACD/SpecManager v 10.08
##SPECTROMETER/DATA SYSTEM=Alpha
##DATE=02 Apr 2015 08:25:20
##DATA TYPE=INFRARED SPECTRUM
##DATA CLASS=XYDATA
##ORIGIN=
##OWNER=
##NPOINTS=1765
##FIRSTX=399.76428223
##LASTX=3997.64306641
##MAXX=3997.64306641
##MINX=399.76428223
##MAXY=0.85995406
##MINY=0.30717397
##XFACTOR=1.0000000000
##YFACTOR=1.000000000000000e-9
##FIRSTY=0.84078830
##DELTAX=2.03961372
##XUNITS=1/CM
##YUNITS=ARBITRARY UNITS
##XYDATA=(X++(Y..Y))
399.8H40788305O890535N410910M054069P21276l235280k658487J372159K888262O65724
418.1H56897473j308918l34263J585126K479494O35147j980066j921177K89321J302302
436.5H57644439l41654k531648j915335J096844J977742m32670k369583j120209J080513
454.8H53088439O87539j461983j895487j50561J484215M90785k081573k861739m50134
473.2H46849501J637280R6262k671957l222049j387536k67446k049685m961550n806327
491.5H28216493n159497p368326j5146792k9430509n1291644n7814122l0841171j4223934
507.9F16940498k1659314O588578O6526413Q6329400N6227446K2893250Q758545N189061
524.2H47793877L263176J84238j979948j343548O36816J123250J1086m92453O37889
$$ plain form
399.8 840788305 847678840 853089750 857143819 857865095 854629815 851971328 853343487 856231749 856897473
418.1 856897473 855588555 855254292 856839418 859318912 859954059 857973993 856052816 856342137 857644439
436.5 857644439 857302785 854771137 852855802 853952646 855930388 855497718 853128135 852007926 853088439
454.8 853088439 853775978 852313995 850418508 850267947 851752162 852242947 850161374 847299635 846849501
473.2 846849501 848486781 848583043 845911086 842689037 841301501 841034055 838984370 834022820 828216493
491.5 828216493 823056996 815688670 800541878 771111369 719819725 662005603 631164432 616940498
507.9 616940498 595281184 601869762 668396175 754725575 810953021 833846271 842604816 847793877
524.2 847793877 851057053 851241291 849261343 847917795 848554611 849677861 849688947 849196494 849834383
542.5H49834383J706600R41813q06213j531005n25534O85096L54767j132727j539886
560.9H47987294k41756P61211Q6546j093865j122176r2745P53283J88112j129090j396776
581.3H44700038l02553M03226n91100k300798l035367k555311k554595m885197j0969102
599.6H17909241k1741271l0235529j7256975J5057981L1807899K1529257N017937q230806
616H13857734j6367793p025182J4832973K3318708J4686346N356372J070261k02477
632.3H49526942M7982K47836p24495k722204m654884m107773J78695L951251L304899
650.6H45048249J003265K91050L28421j74224q65877q22067l87907p61628j222909
669H42436373n75840m20571l15964j74463p56681j518845j447737o48737l75152j173139
$$ plain form
542.5 849834383 851540983 852482796 851676583 850145578 849620044 850305140 850659907 849527180 847987294
560.9 847987294 847745538 848506749 848593295 847499430 846377254 846284509 847037792 847225904 846096814 844700038
581.3 844700038 844397485 844800711 844209611 841908813 838873446 836318135 833763540 828878343 817909241
599.6 817909241 796167970 765932441 748675466 763733447 795541346 817070603 822088540 813857734
616 813857734 797489941 790464759 805297732 828616440 843302786 848659158 849729419 849526942
632.3 849526942 849574924 849822760 849098265 846376061 841721177 837613404 837792099 841743350 845048249
650.6 845048249 846051514 846342564 846670985 846496761 845630884 844808817 844420910 843659282 842436373
669 842436373 841860533 841439962 841123998 840949535 840192854 838674009 837226272 836577535 836202383 835029244
689.4H35029244k112031k118229j428247j258254k220631l790557m567087k806604
705.7H14727604l4630o3658k109468l000497k736271k895117l816127m618705m698217
724.1G90754914m513561m820288n867541p088065p924676q729219j0235131j2414992
740.4G29161441j4266908j4928222j4275431j2651980j0105312o470084j807749L311872
756.7F57967627P990599J1541307J3694763J4151931J1018812L104389O37531J4523030
773G34629989K8429746K4653256J3704360P187783M258812K801061J902878R60410
789.3H18528295J2695m48703n11289q73089k168238m554153p933437j2000859j6898573
807.7G73152649k4455309l7963926n8962703p9850793p9739749m6450287K605527M2585641
$$ plain form
689.4 835029244 832917213 830798984 829370737 828112483 825891852 822101295 817534208 814727604
705.7 814727604 814692974 814629316 812519848 809519351 806783080 803887963 800071836 795453131 790754914
724.1 790754914 786241353 781421065 775553524 768465459 760540783 751811564 741576433 729161441
740.4 729161441 714894533 699966311 685690880 673038900 662933588 656463504 654655755 657967627
756.7 657967627 665958226 677499533 691194296 705346227 716365039 719469428 720106959 734629989
773 734629989 763059735 787712991 801417351 808605134 812863946 815665007 817567885 818528295
789.3 818528295 818540990 818092287 817580998 816707909 814539671 809985518 802052081 790051222 773152649
807.7 773152649 748697340 710733414 651770711 571919918 492180169 445729882 448335409 490921050
824D90921050O2072903O2195361N4735660M7687471L7410617K3324430J3304174J0743737
840.3H02395403R611965N680322P74741l318429n046784j933933M622400Q764744Q022189
858.7H29572618N353332L289282J949489J018286O23643Q36015J111686R22501N19872
877H45196724L86476N84007P28130M50313r2208l08454n1618J93298j4961m77016n42283
899.5H46052408r6082K45749N305m32312m49956P332K60472j88589r05752j137257
919.9H43361318p97987n32269p77126j388728k025366l356993p480085j3071418r532213
938.2H04399133N376696J3881445Q717656J291931k545059m436969n553186n978406
954.5H15153241o334245p677317p101595l570557J014N892455J1347234R504557M356265
$$ plain form
824 490921050 552993953 615189314 669924974 717612445 755023062 778347492 791651666 802395403
840.3 802395403 812007368 817687690 818462431 815144002 810097218 808163285 812785685 821550429 829572618
858.7 829572618 834925950 838215232 840164721 841183007 841806650 842642665 843754351 844676852 845196724
877 845196724 845583200 846167207 846895337 847345650 847253442 846944988 846893370 847086668 847071707 846594691 846052408
899.5 846052408 845956326 846202075 846207380 845775068 845325112 845332444 845592916 845404327 844498575 843361318
919.9 843361318 842563331 842031062 841253936 839865208 837839842 834482849 827002764 813931346 804399133
938.2 804399133 809775829 823657274 832374930 833666861 831121802 826684833 821131647 815153241
954.5 815153241 808818996 801141679 794040084 790469527 790470541 796362996 807710230 817214787 821571052
972.9H21571052R71258j156152k816021m049540n367994q010030j1844039j2535631
989.2G76762903m719198P168710J1938930P527411R56714l462315o183028q962929
1005.5G81027198j3304651j9102633k1700859j2535334Q305908K2023677J3969183
1019.8G58682489M088045J0201990J4329136O773889j643777q110881j5699685k4096548
1036.1G44524658k7004779j5113532Q969605K7420282K9192925K0832240J2324989
1050.4H01146388P108569M399538K855599J679540Q81195O20782O67990N31733O2942
1068.8H19954276l56793l89338j12593M2438j15036l61920l62277j30892j6033k74301
1089.2H17877531o84380q33512p61449r07600j483858k107560k456010k978146m926979
$$ plain form
972.9 821571052 822542310 821386158 818570137 814520597 809152603 801142573 789298534 776762903
989.2 776762903 772043705 779212415 791151345 798678756 799635470 796173155 789990127 781027198
1005.5 781027198 767722547 748619914 726919055 714383721 722689629 744713306 758682489
1019.8 758682489 762770534 772972524 787301660 794075549 792431772 784320891 768621206 744524658
1036.1 744524658 717519879 702406347 711375952 738796234 767989159 788821399 801146388
1050.4 801146388 808254957 812654495 815510094 817189634 818070829 818691611 819359601 819891334 819954276
1068.8 819954276 819597483 819208145 819095552 819137990 819022954 818661034 818298757 818167865 818151832 817877531
1089.2 817877531 817193151 816359639 815598190 814690590 813206732 811099172 808643162 805665016 800738037
1107.5H00738037r264648j3258398r288371K173186P786929L288687j735151p73788
1123.8G79666483N072594R503305P934153L703535J189410M53175J74224k43008n85497
1142.2H06868374o02662m08769l00467m32074o49214o91175o11007p29859j069963
1160.5H01373184j331270j250207r69828q53955j145363j791775l021181o196439j0742545
1178.9G74070621q297086M266143J2239337Q282423K326846k26260j074790j326442
1195.2G90260792j471758j903236k649605l717482n564154p678747o000995M82022
1211.5G61756837M300595K733051R75252K42710j159489l105522m915595n321443k981484
1229.9G52524912L43025J076877q73804l067791m404545m961074m871428m508078m420399
$$ plain form
1107.5 800738037 791473389 778214991 768926620 771099806 778886735 782175422 780440271 779666483
1123.8 779666483 784739077 794242382 802176535 805880070 807069480 807522655 807696879 807453871 806868374
1142.2 806868374 806265712 805856943 805556476 805124402 804475188 803784013 803173006 802443147 801373184
1160.5 801373184 800041914 798791707 797821879 796967924 795822561 794030786 791009605 784813166 774070621
1178.9 774070621 765773535 770039678 782279015 790561438 792888284 792662024 791587234 790260792
1195.2 790260792 788789034 786885798 784236193 780518711 774954557 767275810 761274815 761756837
1211.5 761756837 766057432 768790483 769765735 770008445 768848956 765743434 760827839 755506396 752524912
1229.9 752524912 752867937 753944814 753071010 750003219 745598674 740637600 735766172 731258094 726837695
1248.2G26837695n052209o856919j0242283j5614629k3347497l2296717l3973098j2183129
1264.6E87271214L1165540O0423016N1993788K5762498P019162j186192m673719o400347
1280.9G51374960p173717p533968q034825q868754r391427q870184q176267r287477
1297.2F84038341j2058377j3026893p439137L67284l598988j9736171l4484804m3717563
1313.5E50343692m9715399m8686088l6002367j1452407K7823329P3030353R3941033
1327.8E99282146P9323112M9207807K3754954Q442164J10149n038261q423269j0472536
1344.1G36186266j1547089j1922776j2774110j4150501j5438079j7526985k3488879
1358.4F29337847l5464227m5231521k8188527J5595794N1497340N3119123K7941168
$$ plain form
1248.2 726837695 721785486 714928567 704686284 689071655 665724158 633427441 599454343 587271214
1264.6 587271214 618436754 678859770 730853558 756616056 763635218 762449026 757775307 751374960
1280.9 751374960 744201243 736667275 728632450 719763696 710372269 701502085 693325818 684038341
1297.2 684038341 671979964 658953071 651513934 651881218 648282230 628546059 594061255 550343692
1313.5 550343692 500628293 451942205 415939838 404487431 432310760 505341113 599282146
1327.8 599282146 678605258 727813065 751568019 760010183 760120332 755082071 746658802 736186266
1344.1 736186266 724639177 712716401 699942291 685791790 670353711 652826726 629337847
1358.4 629337847 593873620 548642099 520453572 536049366 587546706 640665829 668606997
1372.7F68606997n557955k8887212j4941335K2655368L5524845J8064678k6465r570539
1389F85868382j5219867k2868395l3287704m3291270n4030717m2102307J3092905P8376115
1405.3E66537142R1160595N5941880K2153139L119052n606652j0196566j3046623j2937069
1421.6F97124898j4303982j6807556j7155886j6651690j4149248j2255073j6580760
1435.9E89220703k1446348j6872227r318769l095805k022267p923543j5664280j8514275
1452.2D94363189j1898637J1687100M5656621M7025144L3856571K3605824J1952161
1466.5F56247973K281666l365814p144034p070661m966557m659295n854189p304490
1482.8F18164599q215547r475886j0805965j0459900q840024j0062099j4256954j7125130
$$ plain form
1372.7 668606997 663049042 634161830 619220495 641875863 677400708 695465386 695438921 685868382
1389 685868382 670648515 647780120 614492416 571201146 517170429 475068122 488161027 566537142
1405.3 566537142 657697737 713639617 735792756 738911808 733305156 723108590 710061967 697124898
1421.6 697124898 682820916 666013360 648857474 632205784 618056536 605801463 589220703
1435.9 589220703 567774355 550902128 541583359 538487554 536465287 528541744 512877464 494363189
1452.2 494363189 482464552 494151652 539808273 586833417 620689988 644295812 656247973
1466.5 656247973 658529639 655163825 648019791 640949130 635982573 631323278 625469089 618164599
1482.8 618164599 609949052 600473166 589667201 579207301 570367277 560305178 546048224 528923094
1499.1E28923094j8510043k0221174k8492957m0926159k5631308r55493J9396216L8006544
1515.4D51588720M4505835L1386226J4761627K312124o113410j0348022r994626q476317
1531.8E09622157o521345l102779k006978m937201r963751j6864539k4824678k7576358
1548.1D13824528k0866036J38611K5550872L9602786N5506349O2264084L5040617K5944412
1564.4F37006223K6215732K4905086K2225022J3123930L467917m657626j0166943j4368773
1580.7F97750568j9990027k4639964k7944803l0535936l2156825l2931984l3371985
1595D96179044l1975925k6999801j8273950p526934O02454K742589K161711O644487
1611.3D23553675J8050939L5094619M7481716L3660471J5415371N602002J500547J537204
$$ plain form
1499.1 528923094 510413051 490191877 461698920 420772761 395141453 394185960 413582176 451588720
1515.4 451588720 496094555 527480781 542242408 544554532 538441122 528093100 518098474 509622157
1531.8 509622157 503100812 499998033 497991055 493053854 483090103 466225564 441400886 413824528
1548.1 413824528 392958492 393097103 418647975 458250761 513757110 576021194 611061811 637006223
1564.4 637006223 663221955 688127041 710352063 723475993 726943910 722286284 712119341 697750568
1580.7 697750568 677760541 653120577 625175774 594639838 562483013 529551029 496179044
1595 496179044 464203119 437203318 418929368 411402434 412004888 414747477 416909188 423553675
1611.3 423553675 441604614 476699233 524180949 557841420 573256791 578858793 580359340 581896544
1627.6E81896544K72512m100204j0332048j8058419j8403291j4923215j4063895j2066156
1643.9D90221828r736687p379621p078111j9256026m2482882l8745642l1062246k3138195
1660.3C11342418m168451J5545458K5118798L7816793N3148359M8925429M2615742
1674.5E30344546L8707435K8759360K2199869K1954895K6677846K2313536J5778660
1688.8G06736147J4168203J1604846J0660767J0723174R681642J0294437Q398474O175816
1705.1G88443506N851865M683971L295720K381026K107740L278374M354895L359854
1721.5H17756951J831353R22739J96159j90556k59400Q51810L134490L521800L345847
1739.8H31111193L268778K676606J777053J057685R96649J535952J090884n603m96745
$$ plain form
1627.6 581896544 582169056 578068852 567736804 549678385 531275094 516351879 502287984 490221828
1643.9 490221828 480485141 473105520 466027409 446771383 404288501 365542859 334480613 311342418
1660.3 311342418 307173967 322719425 347838223 385655016 438803375 487728804 530344546
1674.5 530344546 569051981 597811341 620011210 641966105 668643951 690957487 706736147
1688.8 706736147 720904350 732509196 743169963 753893137 763574779 773869216 782267690 788443506
1705.1 788443506 794295371 798979342 802275062 804656088 806763828 810042202 814397097 817756951
1721.5 817756951 819588304 820511043 820707202 820516646 820257246 821109056 824243546 827765346 831111193
1739.8 831111193 834379971 837056577 838833630 839891315 840887964 842423916 843514800 843509197 843012452
1758.2H43012452m34637N9426P32958O20365K06650K36272Q87633J717031J276970
1776.5H48315120K58386l28541m70757p05421j001656j488209k077759j011729J106501
1794.9H42595935J727462J361727J307249J490713J230478O40988J78933J43290K11477
1813.2H50888252j11937o47128q44180p99478n56409K8312L46780L08633O70969P25270
1833.6H50009084J83940q2791j48297m97758o46770O0797M40895J42873j97411m54008
1854H48810554n77093o07073n53727n54741p96556j250029j153171q5055O13987M36783
1874.4H44283879J24633l7610j18912k04503m07994p56145j289308j988172l439427
1892.8H36166441o040334q531451q228124k885341N006313Q968055P417798M389048
$$ plain form
1758.2 843012452 842577815 842637241 843370199 843990564 844197214 844433486 845321119 847038150 848315120
1776.5 848315120 848573506 848244965 847774208 847068787 846067131 844578922 842501163 841489434 842595935
1794.9 842595935 844323397 845685124 846992373 848483086 849713564 850354552 850533485 850676775 850888252
1813.2 850888252 850776315 850129187 849285007 848485529 847929120 847957432 848304212 848612845 849283814 850009084
1833.6 850009084 850193024 850110233 849961936 849464178 848817408 848878205 849319100 849461973 849264562 848810554
1854 848810554 848233461 847626388 847072661 846517920 845721364 844471335 843318164 843233109 843847096 844283879
1874.4 844283879 844408512 844370902 844251990 844047487 843639493 842883348 841594040 839605868 836166441
1892.8 836166441 830126107 821594656 813366532 810481191 815487504 824455559 831873357 836262405
1909.1H36262405K507806J527667P10487J11520j09314m92514p85291l09348L16381
1927.5H39739799M78745K44498j59859m47750n23091n42819m52340O020L99649L60310
1947.9H39103162J60396o7830l03328m57942n32687o10948p71403r82284r21965l73542
1968.3H34241629J16467P8380j81556l05295j55508J54495K84910J18792m5835j2696
1988.7H34293783L7729n185j82569m67837n55813l48151j23978l1233j1563J9252J8657
2011.1H32643092q3208k56718l36825k73943l33071n80132o63757l47972k7180j3173
2031.5H29727113r5308r6619j7285R0003J60396J05739n3823j92583k02894j35720
2051.9H29289019j59085k93672l74019l28362k58922k61128l28184l96013m06384l33548
$$ plain form
1909.1 836262405 838770211 840297878 841008365 841119885 841010571 840518057 839732766 839423418 839739799
1927.5 839739799 840218544 840463042 840303183 839855433 839332342 838789523 838337183 838343203 838742852 839103162
1947.9 839103162 839263558 839195728 838892400 838434458 837901771 837290823 836519420 835537136 834615171 834241629
1968.3 834241629 834358096 834436476 834254920 833949625 833794117 833948612 834233522 834352314 834306479 834293783
1988.7 834293783 834331512 834326327 834143758 833675921 833120108 832771957 832647979 832616746 832605183 832624435 832643092
2011.1 832643092 832559884 832303166 831966341 831692398 831359327 830779195 830115438 829767466 829740286 829727113
2031.5 829727113 829631805 829535186 829517901 829607904 829768300 829874039 829820216 829627633 829424739 829289019
2051.9 829289019 829129934 828836262 828462243 828133881 827874959 827613831 827285647 826889634 826483250 826149702
2072.3H26149702k78652l03089l92854m62294m54545l87907k49803n2750K07781M29452
2092.7H24205041M32014K02775n7995j76668j43111j07109j96457l32475l81351l16679
2113.1H23127985k56181k68519k86162k11894p4983J848q2970k81334m34398m54426
2133.5H20778966l81112l39866l43501l35813k70784k09927k71440l67045l21031j42992
2153.9H17795455N544j3709j88649l34501l60310l76523m82976n30184k90811J81675
2174.3H15405011N38707M89831J59621r6142j25528q1121j17898k07186k14517q3626
2194.6H15667152M0710l5047k48611k96474j14023J0430j18911l75807n22137m50074
2215H13557208l03269k99811l75569k90990l7312J42693Q2135j42991l24488l34978
$$ plain form
2072.3 826149702 825871050 825567961 825175107 824712813 824258268 823870361 823620558 823567808 823775589 824205041
2092.7 824205041 824637055 824839830 824781835 824605167 824462056 824354947 824158490 823826015 823444664 823127985
2113.1 823127985 822871804 822603285 822317123 822105229 822030246 822032094 821949124 821667790 821233392 820778966
2133.5 820778966 820397854 820057988 819714487 819378674 819107890 818897963 818626523 818259478 817938447 817795455
2153.9 817795455 817800999 817787290 817598641 817264140 816903830 816527307 816044331 815514147 815223336 815405011
2174.3 815405011 815943718 816433549 816593170 816497028 816371500 816290379 816172481 815965295 815750778 815667152
2194.6 815667152 815707862 815672815 815424204 815127730 815013707 815024137 814905226 814529419 814007282 813557208
2215 813557208 813253939 812954128 812578559 812287569 812250257 812392950 812475085 812332094 812007606 811672628
2235.4H11672628k48730k70963m55618n65767m17710j28924L1471l1889j12593o2942
2255.8H09408963O854m8220k22385l92437m39524l89517m23431o11961p35641n77032
2276.2H05575669k32458M2796J25170R4175M3333k0147j88053n01275o86168n70655
2296.6H03682387m36306n82516q71957q88347m39763J49667L62635J11937l08990o84083
2317H00094664r09805r34005q48591o78659l54945K3841K15531M5478l89635o75798
2337.4G95588076n18143r9957L19183P08997P77185K22504o42121j348495j626015
2355.8G93381214j422703q02994k51233q107K24352N70297R23157J078010Q82864N35249
2376.2G95110106M09306N34653N54145K55644j51813l45588k60353j34408k31028l88443
$$ plain form
2235.4 811672628 811423898 811152935 810697317 810131550 809713840 809584916 809616387 809584498 809471905 809408963
2255.8 809408963 809415817 809367597 809145212 808752775 808313251 807923734 807500303 806888342 806152701 805575669
2276.2 805575669 805343211 805386007 805511177 805605352 805648685 805628538 805440485 804939210 804253042 803682387
2296.6 803682387 803246081 802663565 801791608 800903261 800463498 800613165 800975800 801087737 800778747 800094664
2317 800094664 799184859 798250854 797402263 796723604 796368659 796392500 796608031 796653509 796263874 795588076
2337.4 795588076 795069933 794969976 795289159 795998156 796775341 796997845 796355724 795007229 793381214
2355.8 793381214 791958511 791155517 790904284 790896177 791120529 791690826 792613983 793691993 794574857 795110106
2376.2 795110106 795519412 796054065 796608210 796863854 796712041 796366453 796106100 795971692 795740664 795352221
2396.6G95352221k30849J79052L85523J81317j72019l29137j99973k7538o3359k07544
2417G94867694k01583n2452K1816o5863k17438k69354j86741j58906k99096m44293
2437.4G92993784m37319l20196k36869k84791m09842m39286l00765j55807k16782l95596
2457.8G89796531l92973j64032P5042J24514k563j15394j05739r1434j89423l02613
2478.1G88631916l13461k22862j54018k59042m72903n62906m89235m08352m08649l55125
2498.5G84985363p4565K65837L76582J96338j14799l19481l54290l33488l95119n78523
2518.9G83653855p61509q50021q38161o78122l42369J00434M61340N25176K90275n7101
2539.3G81503797l54529n59330o89626p05778n30005j48594K74718M75406L54648O9141
$$ plain form
2396.6 795352221 795121372 795300424 795685947 795867264 795695245 795366108 795166135 795138597 795075238 794867694
2417 794867694 794666111 794613659 794635475 794569612 794352174 794082820 793896079 793737173 793438077 792993784
2437.4 792993784 792556465 792236269 791999400 791714609 791304767 790865481 790564716 790408909 790192127 789796531
2457.8 789796531 789403558 789239526 789314568 789439082 789436519 789321125 789215386 789123952 788934529 788631916
2478.1 788631916 788318455 788095593 787941575 787682533 787209630 786646724 786157489 785749137 785340488 784985363
2498.5 784985363 784910798 785176635 785553217 785749555 785634756 785315275 784960985 784627497 784232378 783653855
2518.9 783653855 782892346 782042325 781204164 780526042 780183673 780284107 780745447 781270623 781560898 781503797
2539.3 781503797 781149268 780589938 779900312 779194534 778664529 778515935 778790653 779266059 779620707 779689848
2559.7G79689848j31964j69039j30832j10030j01448o2763m4584j68860m90427p92146
2580.1G77487755o49154n7757M06623M13358J83642J0967l7432p2479j90854l52562
2600.5G77142107m49240m41551l85106m24385o12676p94947r07898j039684j160621
2618.9G70925999j059771n66304J76192P70569R54568Q50975P39634O78242N43534
2637.2G74013638K99335M7147j20461k02834k74301m26829o25789p37071p60913q16941
2657.6G70394981r56655j098334j020074n59092P3373M60148M41730J83523m0114j50442
2678G67729044k56717l50118l54588k91586j96993r9302q4936j70767k82944l77834
2698.4G65263259m45127n27620o37412o96302p15077q02398r23812r31263p82072n32568
$$ plain form
2559.7 779689848 779557884 779388845 779258013 779147983 779046535 778983772 778939188 778770328 778279901 777487755
2580.1 777487755 776838601 776780844 777187467 777600825 777784467 777795434 777758002 777685523 777494669 777142107
2600.5 777142107 776692867 776251316 775866210 775441825 774829149 774034202 773126304 772086620 770925999
2618.9 770925999 769866228 769299924 769476116 770246685 771201253 772052228 772791862 773470104 774013638
2637.2 774013638 774312973 774360120 774239659 774036825 773762524 773335695 772709906 771972835 771211922 770394981
2657.6 770394981 769438326 768339992 767319918 766760826 766834199 767294347 767736077 767919600 767879486 767729044
2678 767729044 767472327 767122209 766767621 766476035 766279042 766179740 766094804 765924037 765641093 765263259
2698.4 765263259 764818132 764290512 763653100 762956798 762241721 761439323 760515511 759584248 758802176 758269608
2718.8G58269608k77698j96576m72963j144946j890540j654923K46883K240181K328992
2737.2G57448018J050293j6391m77314o29962o56008o17981n36085m65095n19037p12752
2757.6G53867686r12965j006662j067639j167774j171231j000405q15749p90715r57012
2775.9G44977534j164496j268089j368403j613856j970649k299070k531886k653122
2792.2G30107963k560794k081991j138210J08719J315355K110839K336324K146124
2808.6G32344329J765371J272380O76274Q3447l73423o64771q78870j170814j541496
2826.9G31512427j827299j967371k071440k216935k324581k435685k608299k718568
2843.2G13342249k794206k855181k687812k196431j652360j430512j578927j957536
$$ plain form
2718.8 758269608 757991910 757795334 757322371 756177425 754286885 752631962 752878845 755119026 757448018
2737.2 757448018 758498311 758481920 758004606 757374644 756718636 756100655 755564570 755099475 754580438 753867686
2757.6 753867686 752954721 751948059 750880420 749712646 748541415 747541010 746725261 745934546 744977534
2775.9 744977534 743813038 742544949 741176546 739562690 737592041 735292971 732761085 730107963
2792.2 730107963 727547169 725465178 724326968 724435687 725751042 727861881 730198205 732344329
2808.6 732344329 734109700 735382080 736058354 736141801 735768378 735103607 734224737 733053923 731512427
2826.9 731512427 729685128 727717757 725646317 723429382 721104801 718669116 716060817 713342249
2843.2 713342249 710548043 707692862 705005050 702808619 701156259 699725747 698146820 696189284
2859.5F96189284k428472k466500j142621J880050N302489O937921N971491L628195
2875.9G13871837J398623k66970j483380k303422k700567k661049k246380j601756
2892.2G02006936q91149l20852p6175j16169k87056o14703j300275k513051m247129
2910.5F91640377o348729q274138q428097m735648K239704P925093Q511960N392313
2926.8F87922835K257884N49436o82831k947986p200778j3000488j6687393j1885643
2943.2F38325036J909077J4412760J6748608J1477470N072355R2686l706336o988884
2959.5F77342772r510874r535730n403638J707017P911981J0346293R235740O448030
2975.8F88541591L713012J858115Q22425K46167j61409o25849j219928j862526k344966
$$ plain form
2859.5 696189284 693760812 691294312 690151691 692031741 697334230 704272151 710243642 713871837
2875.9 713871837 715270460 715003490 713520110 711216688 708516121 705855072 703608692 702006936
2892.2 702006936 701115787 700794935 700718760 700602591 700315535 699700832 698400557 695887506 691640377
2910.5 691640377 685291648 677017510 668589413 663853765 666093469 674018562 682530522 687922835
2926.8 687922835 690180719 690730155 690047324 687099338 679898560 666898072 650210679 638325036
2943.2 638325036 640234113 654646873 671395481 682872951 687945306 688037992 684331656 677342772
2959.5 677342772 667831898 658296168 652892530 654599547 662511528 672857821 682093561 688541591
2975.8 688541591 692254603 694112718 694935143 695181310 695019901 694394052 693174124 691311598 688966632
2994.2F88966632k311766j555264j53184J469195K475440K294660J218974K3723o50108
3012.5F91778302o61313n38886q93950j763821k860665l960967m952312n768061o049573
3030.9F64328754n043507k879440j299799j589715k735138k868534j686811n49674
3047.2F45676136n66065j512707k621352l401399l723025l658355l302991k627253
3063.5F24262989j523853j1563J683056L284633M586757N398631N616426N275369M535258
3081.9F53107703L625214K714097J828969Q45849l93629j873433l428638m942715o159068
3100.2F45324349o389737n177021l454149k923727m082799n869746p140636p469475
3116.5F02817059o778300n090297k449989R85086M529894P188856Q374572Q225977
$$ plain form
2994.2 688966632 686654866 685099602 684946418 686415613 688891053 691185713 692404687 692428410 691778302
3012.5 691778302 691116989 690578103 689684153 687920332 685059667 681098700 676146388 670378327 664328754
3030.9 664328754 659285247 656405807 655106008 653516293 650781155 647912621 646225810 645676136
3047.2 645676136 645110071 643597364 640976012 637574613 633851588 630193233 626890242 624262989
3063.5 624262989 622739136 622727573 624410629 627695262 632282019 637680650 643297076 648572445 653107703
3081.9 653107703 656732917 659447014 661275983 662121832 661728203 659854770 656426132 651483417 645324349
3100.2 645324349 638934612 633757591 630303442 627379715 623296916 617427170 610286534 602817059
3116.5 602817059 596038759 590948462 588498473 589483559 594013453 601202309 609576881 617802858
3132.8F17802858P308841O143868M860401L438771K169907J260996N90026P1586m57287
3151.2F43189967j246810k071560k507746k701878l004015l451705l939509m393518
3167.5F19873226m813910n274951n802155o240368o367564o096005n504311m555225
3183.8E75218737l043115r52780J422226L622472N224646O035804O032050N274653
3200.1E98834693L980756K469123J081586j014q23080j504123k087355k515137k775848
3218.5E96659601k964735l261388l781736m422664n055845n707502o446660p269382
3234.8E57749689p982493q368432q476973q443594q243382p805347p091999n876303
3251.1D95461166m032493j827299L83377K229362L085733K458304O36458j544386l385633
$$ plain form
3132.8 617802858 625111699 631255567 636115968 639554739 641724646 642985642 643575668 643647254 643189967
3151.2 643189967 641943157 639871597 637363851 634661973 631657958 628206253 624266744 619873226
3167.5 619873226 615059316 609784365 603982210 597741842 591374278 585278273 579773962 575218737
3183.8 575218737 572175622 571222842 572645068 576267540 581492186 587527990 593560040 598834693
3200.1 598834693 602815449 605284572 606366158 606365144 605542064 604037941 601950586 599435449 596659601
3218.5 596659601 593694866 590433478 586651742 582229078 577173233 571465731 565019071 557749689
3234.8 557749689 549767196 541398764 532921791 524478197 516234815 508429468 501337469 495461166
3251.1 495461166 491428673 489601374 489984751 492214113 495299846 497758150 498394608 496850222 493464589
3269.5D93464589m639625n249590n372256n430639n660534n999327o199866n871326
3285.8D49041426m737884k807289l20286K366662M984528P348866R283542J0739237
3302.1D75898802J1662543J1977464J1932880J1769593J1442899J0822654R801030
3316.4E55307865Q503199P335543O766618O948054P548332P989228P894217P335306
3332.7F15628362O589234N812347N077660M464209L942430L398299K831697K343357
3349F50087595J938224J562357J227021R28938O07849K82883R7156Q6426J4365l02791
3369.4F56530023p04766q51094p08998o27577p17461p97212p67887o88314n66840m10915
3389.8F49688959m94420p70271p78795m85360l53575o81281j007676q61406o37114
$$ plain form
3269.5 493464589 488824964 483575374 478203118 472772479 467111945 461112618 454912752 449041426
3285.8 449041426 444303542 441496253 441175967 443542629 448527157 455876023 465159565 475898802
3302.1 475898802 487561345 499538809 511471689 523241282 534684181 545506835 555307865
3316.4 555307865 563811064 571146607 577913225 584861279 592409611 600398839 608293056 615628362
3332.7 615628362 622217596 628029943 633107603 637571812 641514242 644912541 647744238 650087595
3349 650087595 652025819 653588176 654815197 655744135 656351984 656634867 656732023 656818449 656832814 656530023
3369.4 656530023 655825257 654974163 654265165 653637588 652920127 652122915 651355028 650666714 650099874 649688959
3389.8 649688959 649194539 648424268 647645473 647160113 646806538 646125257 645117581 644256175 643619061
3408.2F43619061o35148o64889p28608p61985o33955n54085n28515l43322j30534j06931
3428.6F38531089k18392j26779J11223j7643l86477m30524j23382J66416K95043L27826
3449F38128400L19719L66926M82381N99086O24895N04077N43534Q72195J002967O17207
3469.4F44061387J39594J45256N02587P84039P15852M11630M29689P08461P30813O24299
3489.8F49253607O66261P50422P63416O54519N58615O16133O41882N88477O11603Q06928
3510.2F55911863J116097J137316Q79824P79808Q76486R71317Q42631O36995P57217
3528.5F63909554J041651J151860J167238J099944R70960R87470R90450Q21471P45356
3546.9F72885954R02176R83835R77993J075625J100004J031220R11414N13494J27673
$$ plain form
3408.2 643619061 642983913 642319024 641590416 640828431 640194476 639640391 639111876 638768554 638638020 638531089
3428.6 638531089 638312697 638185918 638297141 638279498 637893021 637462497 637339115 637505531 637800574 638128400
3449 638128400 638448119 638815045 639297426 639896512 640521407 641025484 641569018 642441213 643444180 644061387
3469.4 644061387 644200981 644346237 644848824 645632863 646348715 646760345 647190034 647898495 648629308 649253607
3489.8 649253607 649919868 650670290 651433706 652088225 652646840 653262973 653904855 654493332 655104935 655911863
3510.2 655911863 657027960 658165276 659045100 659824908 660701394 661672711 662515342 663152337 663909554
3528.5 663909554 664951205 666103065 667270303 668370247 669341207 670328677 671319127 672140598 672885954
3546.9 672885954 673788130 674771965 675749958 676825583 677925587 678956807 679868221 680381715 680509388
3565.2F80509388P44045J897454J949072J403392J185417J241505J408875J523018
3581.5F91862166J245737O48975O79493J586795J727641J211703J259982J593530J536966
3599.9G03352988J396060J197040P27236O03378R96530J157045J122475R46999Q77499
3618.3G12377250J528979J793086R94980r7572l20375J151144J885653J425802R97842
3636.6G21736789O87837M90785L00705l00824j102746o81817J154482J549900P26938
3655G24562049O30975J019776O30080L0577k96771q73149j298546n75483l34799p82848
3675.4G22711861K36035J113414Q92580M83870K4438m28200l86834N17130J146794
3693.7G26311088R17255L44575j64032k29955J90139J27137o03378j091480k99454
$$ plain form
3565.2 680509388 681253433 683150887 685099959 686503351 687688768 688930273 690339148 691862166
3581.5 691862166 693107903 693756878 694436371 696023166 697750807 698962510 700222492 701816022 703352988
3599.9 703352988 704749048 705946088 706673324 707276702 708273232 709430277 710552752 711499751 712377250
3618.3 712377250 713906229 715699315 716694295 716596723 716276348 717427492 719313145 720738947 721736789
3636.6 721736789 722424626 722915411 723216116 722915292 721812546 721130729 722285211 723835111 724562049
3655 724562049 725193024 726212800 726842880 726873457 726576686 725703537 724404991 723829508 723494709 722711861
3675.4 722711861 722947896 724061310 724953890 725437760 725462198 725033998 724647164 725164294 726311088
3693.7 726311088 727228343 727572918 727408886 727178931 727369070 727496207 726892829 725801349 725501895
3712.1G25501895R32634Q76665Q8751m83453n59688l02136Q9407K37108l38197j179636
3732.5G24863350j061618K81751J065552L03746j143813j464606k11477j78278l95894
3750.8G22058713Q31366J204908L80754j05083K37883L23534j47343l63410k27987
3769.2G24193335J66893M22239J26004k79903l63410j61409q1539n901K07782J77741
3789.6G24401832j00077m96447p98702p10249p53999o01172J31369R7692R6857N24461
3810G21791565J35839q27491j205146o77586m01318J62244P06136L29256k5630k31564
3830.4G19756305m22001n03659q37326q12829J23263P56562P33852L41892m06265j487970
3850.8G17241824k116263k22087J477241R46403o2764o22630l89576j99616n53369
$$ plain form
3712.1 725501895 726434529 727311194 727399945 726916492 726356804 726054668 726144075 726381183 726042986 724863350
3732.5 724863350 723801732 724083483 725149035 725452781 724308968 722844362 722632885 722454607 722058713
3750.8 722058713 722890079 724094987 724475741 724370658 724608541 724932075 724784732 724421322 724193335
3769.2 724193335 724360228 724782467 724908471 724628568 724265158 724103749 724022210 724016309 724224091 724401832
3789.6 724401832 724301755 723805308 723006606 722296357 721542358 720941186 721072555 721170247 721267104 721791565
3810 721791565 721927404 721099913 719894767 719217181 718815863 718978107 719684243 720013499 719987869 719756305
3830.4 719756305 719334304 718830645 717993319 717180490 717303753 718060315 718794167 719136059 718729794 717241824
3850.8 717241824 715125561 714903474 716380715 717327118 717264354 716641724 716252148 716052532 715499163
3869.1G15499163l12448L04699M30048J29938m86315m31060k98r1553N603m7207k03371
3891.6G14797199J98304J54853o27279j062810o86586N5849P92086R60112N23508L7670
3912G15142906l65734o68168m88639m1068k2530k53499j88589j39237l07679j13010
3932.3G12554753K92837K35141p0453k87831l21865j45316r2149j10149L3438Q3268
3952.7G12171674k9266r9361p8201l3677o199m3928r3759o8783m8638q7917r5605p9334
3977.2G11407006r2387n8592k9504j32620k65003k80320j90318j54138j99735j50621
3997.6G09853768
$$ plain form
3869.1 715499163 715186715 715491414 715921462 716051400 715565085 715134025 715133727 715042174 715047777 715000570 714797199
3891.6 714797199 714995503 715150356 714523077 713460267 712773681 712829530 713621616 714581728 715105236 715142906
3912 715142906 714777172 714109004 713620365 713579297 713556767 713303268 713114679 712975442 712667763 712554753
3932.3 712554753 712847590 713082731 713012278 712724447 712402582 712257266 712165117 712054968 712088406 712171674
3952.7 712171674 712142408 712043047 711964846 711931169 711924970 711881042 711787283 711718500 711669862 711581945 711486340 711407006
3977.2 711407006 711314619 711256027 711226523 711093903 710828900 710548580 710358262 710204124 710004389 709853768
3997.6 709853768
##END=$$ End of the data block
