##TITLE=Patina Cremma $$ Begin of the data block
##JCAMP-DX=5.00 $$ ACD/SpecManager v 10.08
##SPECTROMETER/DATA SYSTEM=Alpha
##DATE=20 Feb 2015 13:16:36
##DATA TYPE=INFRARED SPECTRUM
##DATA CLASS=XYDATA
##ORIGIN=
##OWNER=
##NPOINTS=1667
##FIRSTX=599.57470703
##LASTX=3997.16503906
##MAXX=3997.16503906
##MINX=599.57470703
##MAXY=0.03931272
##MINY=0.00961843
##XFACTOR=1.0000000000
##YFACTOR=1.000000000000000e-10
##FIRSTY=0.03931272
##DELTAX=2.03937006
##XUNITS=1/CM
##YUNITS=ABSORBANCE
##XYDATA=(X++(Y..Y))
599.6C93127240j06245o06701l859885n237348l454648l930032m384481k307705j433157
617.9C67807038r30168j072213k523064j388118j918711n296841l930926J053065K394207
636.3C54194269r20259l562122l191121k378486k149232j830384k344810k525560j276918
654.6C34015377r48161j012757n50710k455451n601160m544146P11009K97315k215803
673C17695513k462417k025887j446772j250543k192669k566259q94219L47104j89654
691.3C05014197q09971j073219j405403j717564j624543j491458j697931p73501K78429
709.7B94699036p67336j900252k058558k118703j146905L53418L84413n84349r19122
728.1B85941642J58436J828783J840628J23419q67732m5634J078583M01847j687110
$$ plain form
599.6 393127240 393020995 392414294 388554409 383317061 379862413 375932381 371547900 369240195 367807038
617.9 367807038 366876870 365804657 363281593 361893475 359974764 354677923 350746997 351800062 354194269
636.3 354194269 353274010 349711888 346520767 344142281 341993049 340162665 337817855 335292295 334015377
654.6 334015377 333067216 332054459 331503749 329048298 323447138 318902992 319614001 319911316 317695513
673 317695513 315233096 313207209 311760437 310509894 308317225 305750966 304856747 305203851 305014197
691.3 305014197 304204226 303131007 301725604 300008040 298383497 296892039 295194108 294420607 294699036
709.7 294699036 293931700 292031448 289972890 287854187 286707282 287060700 287445113 286860764 285941642
728.1 285941642 286100078 287928861 289769489 289892908 289025176 288979542 290058125 290459972 288772862
746.4B88772862k716742k132002j657773j962539k393294k092142o88974K67793p1432
764.8B75325757l62099M13414J904834J950693P06464J230463K746843K581030J929943
783.1B88427342K872143M182513M259777L998540M533269N254149O011613P496998
799.4C27036344R213238R195842N020947k068729r408109j6886368k3361426k6676375
815.7B72065364k6926845k3977794j6746205p925778q56053L411639M993864O220750
832.1B10258942P411502P253532O628074O093792N908217O103814N741213N109980
848.4B60509066M354362L364309L139042L874581M227534K874527R51775O65672J660641
866.7B85621509J966320J377873J271479J686849J137759k90498q87141l62657K28398
$$ plain form
746.4 288772862 286056120 283924118 282266345 280303806 277910512 275818370 275129396 275397189 275325757
764.8 275325757 274963658 275377072 277281906 279232599 279939063 281169526 283916369 286497399 288427342
783.1 288427342 291299485 295481998 299741775 303740315 308273584 313527733 319539346 327036344
799.4 327036344 336249582 345445424 350466371 348397642 338989533 322103165 298741739 272065364
815.7 272065364 245138519 221160725 204414520 196488742 195632689 199044328 204038192 210258942
832.1 210258942 217670444 224923976 231552050 237645842 243554059 249657873 255399086 260509066
848.4 260509066 264863428 268227737 271366779 275241360 279468894 282343421 283295196 283960868 285621509
866.7 285621509 287587829 288965702 290237181 291924030 293061789 292771291 291884150 291521493 291749891
885.1B91749891p2532r03252j110863p58693p57724r70810p31144n39162l85400n5842
905.5B85464469L78210J363215J928024J436211R22288J069531J584702K089645K502390
923.8B98738685K461951K403091K720263K450962J708809J832135K025478R21786j44728
942.2C15118432k1420L16761P6257p7673J59219K35811J118l69400n72279n02616k35737
964.6C14128473k74628n52610o18174q96193j195502j292471j429356j592487j861249
983C04415803j877937j500100j421366j653787j624897j355819j486149k163332k328530
1001.3B89003886j835897j746081k464075l059637k694651k538823k807714k535432
1017.6B69321576j978725j405161j442377k336744l144220l210846k304353j411661
$$ plain form
885.1 291749891 291677359 290774107 289663244 288904551 288146827 287176017 286444873 285905711 285520311 285464469
905.5 285464469 285842679 287205894 289133918 290570129 291492417 292561948 294146650 296236295 298738685
923.8 298738685 301200636 303603727 306323990 308774952 310483761 312315896 314341374 315263160 315118432
942.2 315118432 315097012 315413773 315490030 315412357 315571576 315807387 315808505 315439105 314866826 314364210 314128473
964.6 314128473 313853845 313301235 312683061 311786868 310591366 309298895 307869539 306277052 304415803
983 304415803 302537866 301037766 299616400 297962613 296337716 294981897 293495748 291332416 289003886
1001.3 289003886 287167989 285421908 282957833 279898196 277203545 274664722 271857008 269321576
1017.6 269321576 267342851 265937690 264495313 262158569 259014349 255803503 253499150 252087489
1034B52087489j797043k570562k157092n76005O86944N79115j62460l36673R2313L9171
1054.4B45885197j018643j926292j799818j631677j962725j708232r06997q01366j121610
1072.7B33007837r68389n02970L4403K07238l50848l02773R71463J562796Q96901P19186
1093.1B35274844J117270J115110J127143J375284J074969j16285r20128n05801j75610
1111.5B39366796q11480j199562o30971k06102n72093j125354j017153o59675n04441
1129.8B32639965j04066L11900N05298O89477Q35228P06949N19547L99612J78777q2273
1150.2B36600414k92212k63769l26317o96033j116917j685489k321917k521705k377108
1168.6B24998947k285633k271887k268795k069026j848564j644175j180209r33167
$$ plain form
1034 252087489 250290446 247719884 245562792 244986787 245673731 246252846 246090386 245753713 245846026 245885197
1054.4 245885197 244866554 242940262 241140444 239508767 237546042 235837810 234930813 234129447 233007837
1072.7 233007837 232039448 231536478 231570881 231778119 231427271 231124498 232095961 233658757 234555658 235274844
1093.1 235274844 236392114 237507224 238634367 240009651 241084620 240968335 240048207 239542406 239366796
1111.5 239366796 238555316 237355754 236724783 236518681 235946588 234821234 233804081 233144406 232639965
1129.8 232639965 232535899 232847799 233353097 234042574 234877802 235584751 236104298 236503910 236682687 236600414
1150.2 236600414 236308202 236044433 235718116 235022083 233905166 232219677 229897760 227376055 224998947
1168.6 224998947 222713314 220441427 218172632 216103606 214255042 212610867 211430658 210497491
1184.9B10497491r50899p49696o22757n13512j24909O519k79397p36005j264047j671147
1205.3B03591641j492072r45274r36649j022909p49547m44912L93689J245234R62559
1223.6B00601760Q63001J790505K648327L196151L569293L720261L784150L652275
1239.9B23825723L468227L193933K586339K224389J824200J105722R36408R88599J114141
1258.3B41267681J538172J521204J217649J251995J280569J248587J334250J167878
1274.6B51827985P10245L03723L36133M14904J90456K16272M75104O62357O40508M68716
1295B56246403O40396J053065R77777L19276q8196K74498N74365K36351N2229J71233
1315.4B60457397N8282j03079j58046n44991j116414j453962j439470j068712j219939
$$ plain form
1184.9 210497491 209546592 208796896 208174139 207660627 207535718 207542237 207262840 206526835 205262788 203591641
1205.3 203591641 202099569 201154295 200217646 199194737 198445190 198000278 198393967 199639201 200601760
1223.6 200601760 201464761 203255266 205903593 209099744 212669037 216389298 220173448 223825723
1239.9 223825723 227293950 230487883 233074222 235298611 237122811 238228533 239164941 240153540 241267681
1258.3 241267681 242805853 244327057 245544706 246796701 248077270 249325857 250660107 251827985
1274.6 251827985 252538230 252841953 253178086 253592990 253783446 253999718 254474822 255137179 255777687 256246403
1295 256246403 256886799 257939864 258917641 259236917 259148721 259423219 259997584 260233935 260286164 260457397
1315.4 260457397 260515679 260412600 260254554 259709563 258593149 257139187 255699717 254631005 253411066
1333.8B53411066k028272k214834j687053j816769k374537k364237k275687k290364
1350.1B36359313j900382j606215k100859k564769k173316j466814j699031k492554
1366.4B20355373k477802k144222j567229p80151j036059j391824p97771m64041l28962
1384.7B09367312O70460M79295j239404j008212N59762O29369L80054J30944j42362
1403.1B09827218Q03154J166668J026969J627934J948233J814645L198683N586967
1419.4B27000471M195832K539214K270657J816843K361163J665596J98707K162177
1435.7B44210660L519357L90820p55843o26929p05197L94769N83883q88798j747758
1454.1B44374964J283158M114639j142099l187024l88380M66723k106167j853388J918543
$$ plain form
1333.8 253411066 251382794 249167960 247480907 245664138 243289601 240925364 238649677 236359313
1350.1 236359313 234458931 232852716 230751857 228187088 226013772 224546958 222847927 220355373
1366.4 220355373 217877571 215733349 214166120 213385969 212349910 210958086 210160315 209696274 209367312
1384.7 209367312 210037772 210517067 209277663 208269451 208829213 209458582 209838636 209969580 209827218
1403.1 209827218 210630372 211797040 212824009 214451943 216400176 218214821 221413504 227000471
1419.4 227000471 231196303 233735517 236006174 237823017 240184180 241849776 242048483 244210660
1435.7 244210660 247730017 248120837 247364994 246738065 246032868 246427637 247011520 246122722 244374964
1454.1 244374964 245658122 249772761 248630662 245443638 245055258 245521981 243415814 241562426 243480969
1472.4B43480969K294388p15442k124030k112296j856126j894682q52049J170021N48754
1490.8B37939507k628044k778023j63578N2155k263319l994405j944714M503373J497697
1509.1B30220649m330407m614834l009699j797788j288969M72236M00189p34776j52066
1527.5B15164535j137927p58358K360903P97417j407005M028250O189402L91807j769494
1545.9B23859530k140105j508128j505688k383515k388749J770612L777854l464725
1562.2B16017086m866347l271792j839101k63006j751948k499409O7260p71656l117733
1580.5A97703354k724025k086405k277996k646316k917294k753082k791267l356152
1596.8A76150817l489311k917797k581179l018677l453903l191344k974142l456184
$$ plain form
1472.4 243480969 245775357 245059915 242935885 240823589 238967463 237072781 236220732 237390753 237939507
1490.8 237939507 235311463 232533440 232369862 232422017 230158698 226164293 224219579 228722952 230220649
1509.1 230220649 225890242 221275408 218265709 216467921 215178952 215651188 216051377 215316601 215164535
1527.5 215164535 214026608 213268250 215629153 216426570 215019565 219047815 225237217 225629024 223859530
1545.9 223859530 221719425 220211297 218705609 216322094 213933345 215703957 219481811 216017086
1562.2 216017086 211150739 207878947 206039846 205776840 204024892 201525483 201592743 200821087 197703354
1580.5 197703354 194979329 192892924 190614928 187968612 185051318 182298236 179506969 176150817
1596.8 176150817 172661506 169743709 167162530 164143853 160689950 157498606 154524464 151068280
1613.2A51068280l072862j827041k464205k645179j174817j055841j510065j329528
1629.5A35988742k188813k014544M72060p740k227211k505435k178959m91282K2380
1647.8A24869198k381327j143720J971349j660958l401404k280399j132433j048706
1664.1A13791600j819348j053857K52016r00989j496459q28048r83365j269337o83730
1682.5A05008483J081861O98232p87350j235390j775548j218365q7442N45913J205234
1700.9A03435628l70853q01514j80221q28886j055766p77943l59919J032967J024464
1719.2A01117957o79558r48561n59082m08339l17748m61219P08000J143534q08816
1737.6I8786168q85986K43327L06088k13152k09966L26475K70884l31793m39519n33983
$$ plain form
1613.2 151068280 147995418 146168377 143704172 141058993 139884176 138828335 137318270 135988742
1629.5 135988742 133799929 131785385 132257445 132249705 130022494 127517059 125338100 124846818 124869198
1647.8 124869198 122487871 121344151 123315500 121654542 118253138 115972739 114840306 113791600
1664.1 113791600 111972252 110918395 111170411 110269422 108772963 107944915 106961550 105692213 105008483
1682.5 105008483 106090344 106788576 106001226 104765836 102990288 101771923 101684481 102230394 103435628
1700.9 103435628 103064775 102263261 102083040 101254154 100198388 99420445 99060526 100093493 101117957
1719.2 101117957 100438399 99489838 98930756 98522417 98204669 97743450 98451450 99594984 98786168
1737.6 98786168 97900182 98143509 98449597 98236445 98026479 98352954 98623838 98292045 97852526 97318543
1758I7318543l74569O16797K26628q47401o47940R4753R55295N18625n46956k89064
1778.4I7024711J65971l7588r2117k26591o24107k5938J132880P36797j77659q2869
1798.7I7793490K71909k06251o37490k36659J74977J14618j92970j38711J62795l1497
1819.1I7074211l27174Q5495N37895L24044O27768M40357q29054r05925j57757j18325
1839.5I6751535k72095N82589R04612m1835k34833j67852k10991j1120O2473R8487
1859.9I7460970K78773J24695q7368L96884M75300j78739l06890k24784k89380k46466
1880.3I7402995j58045m2887J74194M94803M69973m498q2879J06711J39810K21636
1900.7I8721813J71075o3553j07782o0378r2154P1497J69482P7589O0648P0706J88304
$$ plain form
1758 97318543 96943974 97560771 97787399 96939998 96292058 96386811 97342106 97860731 97313775 97024711
1778.4 97024711 97190682 97153094 97060977 96834386 96210279 96184341 97317221 98054018 97876359 97793490
1798.7 97793490 98065399 97859148 97221658 96984999 97159976 97274594 97081624 96942913 97105708 97074211
1819.1 97074211 96747037 96832532 97370427 97694471 98322239 98762596 97933542 97027617 96869860 96751535
1839.5 96751535 96479440 97062029 97966641 97924806 97689973 97522121 97311130 97300010 97362483 97460970
1859.9 97460970 97739743 97864438 97777070 98173954 98649254 98470515 98163625 97938841 97649461 97402995
1880.3 97402995 97244950 97202063 97376257 97871060 98341033 98336535 98253656 98360367 98500177 98721813
1900.7 98721813 98892888 98829335 98721553 98661175 98569021 98640518 98810000 98887589 98948237 99018943 99207247
1923.2I9207247L17022M64590K81055l08343m21675j45407j13090o1179M30653N26858
1943.5A00177731k15890m82071j11237N1651n038n821J01440J73486l0202j33226K68053
1966I9788876K51103k31238n0328K58786J59201J09141J47028N7221k09548k95620
1986.4I9984622o0127M52977O81402j8282m99673p6564J52867k15116k14046K25175
2006.8A00413235J20802n0338K86391L14219k6757k72626j76709L31169N24092J88137
2027.2A01651615l1796K1467K00868J27731l88222o09160j49691M31342M76958J25878
2047.6A01856990J1660m4517l6834J84439J6429k88850j95028m3456N8031J86814J32229
2070A01837907L4980M8494R4353K08039J88164K3330R1968J50809j00453j55316K915
$$ plain form
1923.2 99207247 99524269 99988859 100269914 99961571 99539896 99394489 99281399 99220220 99650873 100177731
1943.5 100177731 99961841 99479770 99368533 99420184 99415146 99409325 99510765 99684251 99654049 99520823 99788876
1966 99788876 100039979 99808741 99758413 100017199 100176400 100285541 100432569 100489790 100280242 99984622
1986.4 99984622 99924495 100377472 101058874 101040592 100540919 100464355 100617222 100402106 100188060 100413235
2006.8 100413235 100534037 100483699 100770090 101084309 101057552 100784926 100608217 100939386 101463478 101651615
2027.2 101651615 101619819 101641286 101842154 101969885 101581663 100972503 100822812 101254154 101731112 101856990
2047.6 101856990 101868650 101824133 101787299 101971738 101988167 101699317 101504289 101460833 101518864 101705678 101837907
2070 101837907 101872887 101921381 102015734 102223773 102411937 102435267 102527235 102678044 102577591 102422275 102425190
2092.4A02425190p4739j4836K33762J36495J09477K06744j17160k31127N5926N0627
2112.8A02780359n3011P8455J30143l5251j05491L8697K00653J26706Q9603L00352
2133.2A03551215J75507k03075k52639O5211K76770j4314l39598j94041L0753M4265
2153.6A03140054K66414N06631K72560j65179l22396Q7489N34523L76003o9216m99292
2174A04127591o16405k75438q0048J16369N48773O08228J07130m00646k71238J58818
2194.4A04023134J12150j45826j0077J76318R7044J32843Q7768k32802k46317R2267
2214.8A04086502L16053L80520J72369k87192n37475m00879N8599M03533K18479k8368
2235.2A04382141J4584l3947k10786j34958J3784j48202j66501J43162L69074N46240
$$ plain form
2092.4 102425190 102350451 102335615 102569377 102705872 102815349 103022093 102904933 102673806 102729732 102780359
2112.8 102780359 102727348 102805803 102935946 102900695 102795204 102833901 103034554 103161260 103250863 103551215
2133.2 103551215 103726722 103523647 103271008 103336219 103612989 103598675 103259077 103065036 103095789 103140054
2153.6 103140054 103406468 103913099 104185659 104020480 103698084 103785573 104320096 104696099 104626883 104127591
2174 104127591 103511186 103235748 103155700 103272069 103820842 104429070 104536200 104135554 103864316 104023134
2194.4 104023134 104135284 103989458 103979381 104155699 104252743 104385586 104473354 104240552 103994235 104086502
2214.8 104086502 104402555 104783075 104955444 104668252 104130777 103729898 103788497 104192030 104410509 104382141
2235.2 104382141 104396725 104362778 104151992 104017034 104030818 103882616 103716115 103859277 104228351 104774591
2255.6A04774591L39970k51402l40482K02060L46601k80570l13698M79436O57989m8532
2276A05565963o31464l85577K09221L52972J39232p8762j84048j38171o3376j2731
2296.4A04773259l0762j25160k26181j68104J29389K59597J67060j5385k23806q5915
2316.7A04453992J93575L06815J16686m11300l78657J75535J49822k50842m0569O04056
2337.1A04919113O24834K01575O21770J104493m61946k180626j471518L87579j50846
2355.5A03594428j402730n18877P06520J534288J395066Q72640R68063M91943j50716
2373.8A07490625j73002j11712o5267j43005l95570n36125l58354K7054L7402j01318
2394.2A05670728K20416L85689J12736j80649k52788K6524J64192L2103R9735J45640
$$ plain form
2255.6 104774591 105114561 104863159 104522677 104724737 105071338 104790768 104477070 104956506 105614495 105565963
2276 105565963 104934499 104548922 104758143 105111115 105250347 105171585 104987537 104849366 104785990 104773259
2296.4 104773259 104742497 104617337 104391156 104223052 104352441 104612038 104779098 104763713 104539907 104453992
2316.7 104453992 104647567 104954382 105071068 104659768 104281111 104456646 104606468 104355626 104315057 104919113
2337.1 104919113 105543947 105745522 106367292 107471785 107009839 104829213 103357695 103745274 103594428
2355.5 103594428 102191698 101672821 102379341 103913629 105308695 106181335 107149398 107641341 107490625
2373.8 107490625 107317623 107205911 107140644 106997639 106602069 106065944 105707590 105734644 105772046 105670728
2394.2 105670728 105891144 106276833 106389569 106208920 105956132 105982656 106146848 106178951 106278686 106424326
2414.6A06424326k6533j61017m8279M8540j15391J60225O04596J58660n86053n74300
2435A05884774O8172L61288K41409L40109K06949o370J50977J1939j39568J87066K79406
2457.5A07586151J35330J56826j12243l90066K9719L87411J593k75178Q5979L22145
2477.9A07927667J13323j03498k09910j72481Q6510K65623J53919m4843j13584j3802
2498.2A07888924J18623N7853j01635m7237K81567M34462Q4136k98852m11356l7952
2518.6A07968533O49430O01467J3011p3528K64393K99718J6997p3277M9118N7603j95923
2541.1A09577542l77223k71545m6716K86671O23055O79707L03238l41208n75101k47956
2561.5A09610464J72826N25163K02330n58905l86545K06008J14162j25571k92295m45964
$$ plain form
2414.6 106424326 106397793 106236776 106188497 106237037 106121646 106281871 106886467 107045127 106459074 105884774
2435 105884774 105952946 106314234 106555643 106895752 107102701 107096331 107247308 107259247 107119679 107306745 107586151
2457.5 107586151 107721481 107878307 107766064 107375998 107405717 107793128 107794721 107519543 107605522 107927667
2477.9 107927667 108040990 107937492 107727582 107555101 107641611 107907234 108061153 108016310 107902726 107888924
2498.2 107888924 108007547 108065400 107963765 107916528 108198095 108632557 108716693 108417841 108006485 107968533
2518.6 107968533 108617963 109219430 109232441 109158913 109423306 109723024 109740021 109666744 109715862 109773465 109577542
2541.1 109577542 109200319 108928774 108882058 109168729 109791784 110471491 110774729 110433521 109858420 109610464
2561.5 109610464 109783290 110308453 110510783 109951878 109565333 109771341 109885503 109759932 109467637 109021673
2581.9A09021673j58995L97367Q26977M72088m13945m32497J5665M1946J96202L04803
2602.2A10271284j8850j81608j17886k0713J66474J68867R5852K03922J09142l1600
2622.6A10644884K54652L09916o0284r0022Q4182L1339k54409n49667j32229P16411
2643A10954773O99544q5523n08055m20111p5940N24465N42319L986L0808J08629n4184
2665.5A11720711J12625K97492M63817M86179q233m51645l58894M516K02423J4604
2685.9A12483595n2331K73631M34909K52948k2846p9712m3045j17701k92519k34051
2706.3A12602878M04884O39809K67066J38720L0827l18894l40389L2689K25064L25525
2726.6A14008179M14317L39132j28113n05484M5439O24843M17046J28392N0776j02082
$$ plain form
2581.9 109021673 108862678 109260045 110087022 110559110 110145165 109712668 109728333 109770279 109966481 110271284
2602.2 110271284 110252434 110070826 109952940 109932227 110098701 110267568 110363420 110567342 110676484 110644884
2622.6 110644884 110899536 111209452 111149168 111059146 111143328 111174667 110920258 110370591 110238362 110954773
2643 110954773 111654317 111568794 111060739 110640628 110564688 111089153 111631472 111635458 111666266 111774895 111720711
2665.5 111720711 111833336 112130828 112594645 113080824 113072591 112620946 112262052 112266568 112468991 112483595
2685.9 112483595 112431264 112704895 113139804 113392752 113369906 113290194 113247149 113129448 112836929 112602878
2706.3 112602878 113007762 113647571 113914637 114053357 114084184 113765290 113424901 113457590 113682654 114008179
2726.6 114008179 114422496 114761628 114633515 114128031 114173470 114798313 115215359 115343751 115394527 115292445
2747A15292445n7416L2699M3325K70083L59435K29711J03963Q773m1742j02101j07940
2769.5A16031235J11926J90111M8392J41458L9088k39043k65613j52876J55270K86083
2789.9A16346031J02632L31858Q64035N95813p5809j7025K18656J73440Q3000o380
2810.3A18616251K20007N74952K81250l02270o9179M69908N34095M73736K52593K35308
2830.7A21286651O11749L77800Q1472P91382J170840K32281m83468j55018k7437m6883
2851A23839369M69070P93338O65318P4869n06528k06483L88203O43786O57486J83107
2871.4A27001535m94672j96947N54352M59793J08760K19122M78011M25791J39726J48788
2891.8A28844259L73600K78149j28010k07210j9996J06665M88320Q90633J016222P17286
$$ plain form
2747 115292445 115235029 115267728 115311053 115581136 115940571 116170282 116274245 116283018 116241276 116139175 116031235
2769.5 116031235 116143161 116333272 116381664 116523122 116562210 116323167 116057554 115904678 116059948 116346031
2789.9 116346031 116448663 116780521 117644556 118240369 118164560 118147535 118366191 118539631 118622631 118616251
2810.3 118616251 118836258 119411210 119692460 119390190 119321011 119790919 120325014 120798750 121051343 121286651
2830.7 121286651 121898400 122276200 122357672 123149054 124319894 124552175 124068707 123913689 123886252 123839369
2851 123839369 124308439 125101777 125767095 125841964 125335436 125128953 125517156 126160942 126818428 127001535
2871.4 127001535 126506863 126309916 126864268 127324061 127432821 127651943 128129954 128555745 128695471 128844259
2891.8 128844259 129217859 129496008 129367998 129160788 129140792 129247457 129735777 130626410 131642632 132359918
2912.2A32359918N3644r6075J43582J82549L65646L91575l8706j6009L81190Q1686
2932.6A33809000l34484J03572M26863j13193l28618j17719j50548j8422K38903K98452
2953A33813806K0293m22578n02616m22215n11315q38078j146542m97140K81632k61097
2973.4A29514150p04555k18916p0930l31141m52157n53662m33391j41263L4115L10242
2993.8A26952492L65972Q9295j02892o5304K7725k8526J5990K15117L75081M00180
3014.2A28245130J20774k53282j37035K21282L12747K63183K76789L74950K95239J15214
3034.6A29834991q4816k58963p6005K20285K76845M25447N69271M03654J76634O7503
3055A31554846J59293M8299l33526k09715L10298L97321L30899N71925M72972O3796
$$ plain form
2912.2 132359918 132413562 132317487 132461069 132643618 133009264 133400839 133362133 133346124 133727314 133809000
2932.6 133809000 133474516 133578088 134004951 133891758 133563140 133445421 133294873 133276451 133515354 133813806
2953 133813806 133834099 133411521 132908905 132486690 131975375 131137297 129990755 129493615 129775247 129514150
2973.4 129514150 128809595 128590679 128519749 128188608 127736451 127182789 126749398 126608135 126642250 126952492
2993.8 126952492 127318464 127407759 127304867 127239563 127267288 127238762 127254752 127469869 127844950 128245130
3014.2 128245130 128365904 128112622 127975587 128196869 128509616 128772799 129049588 129424538 129719777 129834991
3034.6 129834991 129750175 129491212 129415207 129635492 129912337 130337784 130907055 131310709 131487343 131554846
3055 131554846 131714139 131762438 131428912 131219197 131529495 131926816 132257715 132829640 133302612 133366408
3075.4A33366408J03572N53392P32374M22438J86935L31961J92039j35685J1483N7957
3095.8A35822874o0359J99517M87463L73721L11770M48860J86768j26912J65925N55822
3116.2A38365449M89084M26043M29303L42717J15493j94087J67358Q25385P90237L38070
3136.5A42095052K6207Q2916K55713J05929J93137M28846q8559n78361k14791L90271
3156.9A42696360P61924R60893P41612J90576j17505P7896L26568K29944L52580N60917
3177.3A46781765M0699p28779l75323M45731L45372J94656K09920J17551O14049J016464
3197.7A48662105L57088m22187l85447q6240J98474M35812L43174K57455J44141j13063
3218.1A49391312J10921M12892J53808J51135M10285K21636N6550L4571K0908J54376
$$ plain form
3075.4 133366408 133469980 134023372 134755746 135178184 135365119 135697080 135889119 135753434 135764917 135822874
3095.8 135822874 135762515 135962032 136449495 136823216 137134986 137583846 137770614 137643702 137809627 138365449
3116.2 138365449 138854533 139280576 139709879 140052596 140168089 139974002 140141360 140966745 141756982 142095052
3136.5 142095052 142121259 142204175 142459888 142565817 142758954 143187800 143099241 142520880 142306089 142696360
3156.9 142696360 143458284 144419177 145160789 145351365 145233860 145311756 145638324 145868268 146220848 146781765
3177.3 146781765 146822464 146093685 145718362 146164093 146509465 146704121 146914041 147031592 147645641 148662105
3197.7 148662105 149019193 148597006 148211559 148125319 148323793 148759605 149102779 149360234 149504375 149391312
3218.1 149391312 149502233 149915125 150068933 150220068 150630353 150851989 150908539 150943110 150964018 151118394
3238.5A51118394O9691J65645N29680J21175m59738j14460L35341J77995K6272J86591
3258.9A52156586O2734j72919J0720M31910O17765K99271J21211M0764l82410n41899
3279.3A52643733j58455M39723Q11453O57914J08368l37427l39812J41068O05108M35375
3299.7A55007048j68737p30399p61115j071N77122N0152k94736J96845L57255J33570
3320.1A54365934O976j69780m62653m10844J4212K6282l33581k10488K26311L25265
3340.5A53377634L0845k26330k682J19870j38907k79676n33284r67738q45324j25412
3360.9A50408996J21659m06783o21639m73131o01113n95953j66576J82651q7042m40543
3381.3A47320526n46528p15657q10828o67767j20700M72106N94473j76132j285430
$$ plain form
3238.5 151118394 151188085 151353730 151883410 152004585 151544847 151430387 151765728 151943723 151969995 152156586
3258.9 152156586 152219320 152046401 152057121 152489031 153106796 153406067 153527278 153568042 153185632 152643733
3279.3 152643733 152485278 152925001 153736454 154394368 154502736 154165309 153825497 153966565 154571673 155007048
3299.7 155007048 154838311 154107912 153346797 153345726 153922848 153973000 153678264 153875109 154232364 154365934
3320.1 154365934 154372910 154203130 153740477 153329633 153343845 153370127 153036546 152826058 153052369 153377634
3340.5 153377634 153408479 153182149 153179467 153299337 153160430 152880754 152347470 151379732 150534408 150408996
3360.9 150408996 150530655 150123872 149502233 149029102 148427989 147832036 147665460 147848111 147761069 147320526
3381.3 147320526 146773998 146058341 145247513 144579746 144459046 144931152 145525625 145349493 144064063
3399.6A44064063j248661l86005K35931J08071n72968j005056r59113p81938l68068
3418A39086256L65926P7523q97534p51196k79229k88551o25151j370730j574521q24007
3438.4A32918786M6175K09790k19131l67248m41410r89391j358315o65933L82690J37622
3458.8A29653635p15247m92763L21307J97058p88718j096437o33802l01944l01386
3477.1A25841703o93034p34748q792J94199l54554l24166L46536K91160l57479l70508
3497.5A23830317n23339n48306L02503O9243r19187j080567o45174q5160J31205k31806
3517.9A20299729l60860N1893p3714n32176n10840k80393k64691k47909k08803n85122
3538.3A17287114o13229L986M58984J92281p35820q32192J95931L80473m49325p14576
$$ plain form
3399.6 144064063 142815402 142429397 142665328 142773399 142200431 141195375 140236262 139454324 139086256
3418 139086256 139452182 139529705 138632171 137880975 137601746 137313195 136688044 135317314 133742793 132918786
3438.4 132918786 132964961 133174751 132955620 132588372 132146962 131157571 129799256 129133323 129516013 129653635
3458.8 129653635 128938388 128445625 128766932 128963990 128175272 127078835 126445033 126143089 125841703
3477.1 125841703 125148669 124413921 124405129 124599328 124244774 123920608 124267144 124558304 124200825 123830317
3497.5 123830317 123306978 122758672 123061175 123130418 122211231 121130664 120485490 120400330 120531535 120299729
3517.9 120299729 119938869 119990762 119917048 119384872 118874032 118593639 118328948 118081039 117872236 117287114
3538.3 117287114 116673885 116677871 117136855 117329136 116593316 115761124 115957055 116337528 115888203 115173627
3558.7A15173627k75644j79680J85259J509478Q07056j135952j025349j56025l08854
3577A14593916q32081r54392j131352j28019J976471R45525j358688p95936N8711l70294
3597.4A12003861j50604l6126r33260j053587M46840J108413L02503k83913j123548
3615.8A10280579n41890Q12458O5854j539579j712041J728497L018352r86429k216408
3634.1A08909393j227455l8473M85358l28794j518950j085633K256166L328966r32775
3652.5A09847803k174620K19988L33050j113964j115548j117643r38130J346804J805145
3670.8A07092885r50806J077103K598884o58362j535872j659216j816601M66146L286442
3689.2A07900603J300517j358101j300108q75899m76605P57501J012851n55534j039505
$$ plain form
3558.7 115173627 114897983 114718303 114903562 116413040 117220096 116084144 115058795 114902770 114593916
3577 114593916 113761835 112807443 111676091 111548072 113524543 114470068 113111380 112315444 112374155 112003861
3597.4 112003861 111853257 111817131 110883871 109830284 110277124 111385537 111688040 111404127 110280579
3615.8 110280579 109738689 110551147 110617001 109077422 107365381 109093878 112112230 111125801 108909393
3634.1 108909393 107681938 107643465 108128823 107800029 106281079 105195446 107451612 110780578 109847803
3652.5 109847803 107673183 107893171 108226221 107112257 105996709 104879066 103940936 105287740 107092885
3670.8 107092885 106142079 107219182 109818066 109159704 107623832 105964616 104148015 104614161 107900603
3689.2 107900603 109201120 107843019 106542911 105667012 105190407 105947908 106960759 106405225 105365720
3707.6A05365720L65749J939330Q47364m61256m16097l82894K18115Q03806N77271
3725.9A08857108o59013j667924l90746K038498K203015m53219l182124k183942K365140
3744.3A06926793J182128j813518J082718K031913j220963j844857j7779N15459p65072
3762.6A06076822p80057k86690J95457J577735R50154j086788j292853J46404N25704
3781A06025888J69510O75954M38038m81289j120511j255712m43328o55893p69236K056193
3801.4A04639614J454186k95230J137248m17317k730004j416840J919801J316936P4003
3819.7A05682397J784871J86544j018579n67166q22227m81066J40816J004646K197092
3838.1A08107328J018402m92372j83405q61148k767015k962146K167728O035482j37258
$$ plain form
3707.6 105365720 105731469 107670799 108518163 108056907 107640810 107257916 107476031 108279837 108857108
3725.9 108857108 108198095 106530171 106139425 108177923 110380938 109927719 106745595 104561653 106926793
3744.3 106926793 108108921 106295403 107378121 109410034 108189071 106344214 106326435 106841894 106076822
3762.6 106076822 105296765 105010075 105205532 106783267 107733421 106646633 105353780 105500184 106025888
3781 106025888 106195398 106871352 107309390 106828101 105707590 104451878 104008550 103352657 102583421 104639614
3801.4 104639614 106093800 105798570 106935818 106518501 103788497 102371657 104291458 105608394 105682397
3819.7 105682397 107467268 107653812 106635233 106068067 105245840 104764774 104905590 105910236 108107328
3838.1 108107328 109125730 108633358 108449953 107588805 104821790 101859644 104027372 110062854 109925596
3856.4A09925596l551673k552029K02824J450264l73944r9447J457483P49491J46730
3874.8A07355295j182445j176567M28045J90437J329016J712935l11863j98772%j194608
3895.2A06951473r69087K67122O83125J127729R78038j057387j855120q45836n08121
3913.5A04771936K89055J704236J019147j48071K70400L76049p68518l66429J160428
3931.9A08308233M07137j174863r59924N64307J102835r98033k204077j21463J373635
3950.2A06297787N54193l92906o65803m63361P6648M76092m4554p15312k17995M03645
3970.6A05308434N09238O58380O3143n46462l99454n56950n24260K98852O67517J15903
3991A05594341J88052Q11452L94239
$$ plain form
3856.4 109925596 106373923 103821894 104024718 105474982 105101038 105001591 106459074 107208565 107355295
3874.8 107355295 106172850 104996283 105424328 105614765 106943781 108656716 108344853 108146081 108146081 106951473
3895.2 106951473 105982386 106249508 106932633 108060362 109038400 107981013 106125893 105280057 104771936
3913.5 104771936 105060991 106765227 107784374 107636303 107906703 108282752 107514234 107147805 108308233
3931.9 108308233 108715370 107540507 106580583 107144890 108247725 107249692 105045615 104924152 106297787
3950.2 106297787 106851980 106459074 105793271 105329910 105406558 105882650 105838096 105122784 104904789 105308434
3970.6 105308434 105817672 106476052 106539195 105992733 105593279 105036329 104512069 104810921 105478438 105594341
3991 105594341 105782393 106593845 106988084
3997.1A06988084
$$ plain form
3997.1 106988084
##END=$$ End of the data block
