##TITLE=Padrao $$ Begin of the data block
##JCAMP-DX=5.00 $$ ACD/SpecManager v 10.08
##SPECTROMETER/DATA SYSTEM=Alpha
##DATE=16 Dec 2014 10:37:32
##DATA TYPE=INFRARED SPECTRUM
##DATA CLASS=XYDATA
##ORIGIN=
##OWNER=
##NPOINTS=1765
##FIRSTX=399.76428223
##LASTX=3997.64306641
##MAXX=3997.64306641
##MINX=399.76428223
##MAXY=1.00000000
##MINY=0.17716925
##XFACTOR=1.0000000000
##YFACTOR=0.000000010000000
##FIRSTY=1.00000000
##DELTAX=2.03961372
##XUNITS=1/CM
##YUNITS=ARBITRARY UNITS
##XYDATA=(X++(Y..Y))
399.8A00000000j518518j513177j557827j603800j651692j725591j805400j851529
416.1H6772466j849085j807201j762879j747865j746547j733524j693433j636493j585615
434.4G1209824j573938j578480j530212j461584j414817j375419j324195j250356j148790
452.8E8552033j033533r16576p89410o43557m76844k99531j27023L4266J90515L48705
473.2E4839045M92984O07443O98954P78687Q62258R52751J034623J097483J150703
491.5F2514931J216197J300311J389653J458334J496965J527393J569027J609939J619136
509.9G5701886J589328J544357J507819J475471J424873J341754J240659J155191J093364
528.3H8074702J030421R38320Q27063P35724O81179O36947N70977M90326M27341L98910
$$ plain form
399.8 100000000 98481482 96968305 95410478 93806678 92154986 90429395 88623995 86772466
416.1 86772466 84923381 83116180 81353301 79605436 77858889 76125365 74431932 72795439 71209824
434.4 71209824 69635886 68057406 66527194 65065610 63650793 62275374 60951179 59700823 58552033
452.8 58552033 57518500 56601924 55812514 55168957 54692113 54392582 54265559 54299825 54490340 54839045
473.2 54839045 55332029 55939472 56638426 57417113 58279371 59232122 60266745 61364228 62514931
491.5 62514931 63731128 65031439 66421092 67879426 69376391 70903784 72472811 74082750 75701886
509.9 75701886 77291214 78835571 80343390 81818861 83243734 84585488 85826147 86981338 88074702
528.3 88074702 89105123 90043443 90870506 91606230 92287409 92924356 93495333 93985659 94413000 94811910
548.7I4811910L86781L57294L05837K62881K52729K65605K68238K43020K10131K00098
569.1I7564524K15465K27189K10816J78415J63006J73474J85018J72306J39904J15180
589.4I9345297J15025J26493J20705Q8507N2941M0167M6760M5139o890J8966q375N132
613.9I9989867%sk0951J0133p9072j62619k54667l35812m12041n05728o05690o98781
652.7I6924639q10391r04000r65130j006687j022613r92352r03397p67237o08623m44782
673.1H8499427k77716j10757L9815J57571K43843K82288K63935K45780K26163J89788
693.5H9760137J47539J18417J15782J35970J62524J84041K00635K15000K25031K24001
713.9I1489077K07305J78122J44678J12212P6264K8420l0822r0348j38993j77812k17921
$$ plain form
548.7 94811910 95198691 95555985 95861822 96124703 96377432 96643037 96911275 97154295 97364426 97564524
569.1 97564524 97779989 98007178 98217994 98396409 98559415 98732889 98917907 99090213 99230117 99345297
589.4 99345297 99460322 99586815 99707520 99796027 99848968 99889135 99935895 99981034 99974144 99993110 99984735 99989867
613.9 99989867 99989867 99989867 99989867 99989867 99989867 99989867 99989867 99989867 99989867 99968916 99979049 99899977 99737358 99482691 99146879 98734838 98229110 97623420 96924639
652.7 96924639 96114248 95210248 94245118 93238431 92215818 91223466 90320069 89552832 88944209 88499427
673.1 88499427 88221711 88110954 88150769 88308340 88552183 88834471 89098406 89344186 89570349 89760137
693.5 89760137 89907676 90026093 90141875 90277845 90440369 90624410 90825045 91040045 91265076 91489077
713.9 91489077 91696382 91874504 92019182 92131394 92207658 92236078 92205256 92114908 91975915 91798103 91580182
736.3I1580182k65866l16352l60018l95131m28444m66061n06490n42826n73462o07574
756.7H7117958o55675p20346p95966q72177r41128j001447j051498j083493j090204
775.1G8906024j070887j030922r76670r09048q24345p21418o06513m89611l76552k64329
795.4G1635729j47277k6631Q9985J97136K95234L84962M64458N29217N76926O12002
815.8G4611741O42944O74122P01601P20262P30646P34806P28130P01416O49482N72484
836.2H1467634M72659L51286K08825M7958j23852k95491m56893o04302p37112q50511
856.6G9480201r37635r97489j034719j054031j058179j049006j029080j003814r79006
875G0337242r55743r30923r01854q69876q39669q13305p86006p52277p11739o67077
$$ plain form
736.3 91580182 91314316 90997964 90637946 90242815 89814371 89348310 88841820 88298994 87725532 87117958
756.7 87117958 86462283 85741937 84945971 84073794 83132666 82131219 81079721 79996228 78906024
775.1 78906024 77835137 76804215 75827545 74918497 74094152 73372734 72766221 72276610 71900058 71635729
795.4 71635729 71488452 71461821 71551806 71748942 72044176 72429138 72893596 73422813 73999739 74611741
815.8 74611741 75254685 75928807 76630408 77350670 78081316 78816122 79544252 80245668 80895150 81467634
836.2 81467634 81940293 82291579 82500404 82548362 82424510 82129019 81672126 81067824 80330712 79480201
856.6 79480201 78542566 77545077 76510358 75456327 74398148 73349142 72320062 71316248 70337242
875 70337242 69381499 68450576 67548722 66678846 65839177 65025872 64239866 63487589 62775850 62108773
895.4F2108773o20168n70167n14292m52215l89582l32421k82019k36499j94306j57952
915.8E8359152j31911j16467j07158j00439r6769r9259j09494j24091j38444j53350
936.2E7181770j74863k07352k49517k96676l46732m02081m65042n33420o00868o61415
956.6E3243804p13974p61289q04066q38352q60592q72460q79127q83311q82968q75572
977D4872093q62655q48114q34155q20384q04698p86019p66197p48068p32320p17735
997.4C6951748p02426o86825o73005o61409o50751o39707o28325o17832o09055o01185
1017.8C0481228n93033n83843n73834n63446n52949n41875n29033n14925n00828m87187
1038.2B5040275m73681m59840m45473m31302m17535m03620l89514l75297l60738l45752
$$ plain form
895.4 62108773 61488605 60918438 60404146 59951931 59562349 59229928 58947909 58711410 58517104 58359152
915.8 58359152 58227241 58110774 58003616 57903177 57806408 57707149 57597655 57473564 57335120 57181770
936.2 57181770 57006907 56799555 56550038 56253362 55906630 55504549 55039507 54506087 53905219 53243804
956.6 53243804 52529830 51768541 50964475 50126123 49265531 48393071 47513944 46630633 45747665 44872093
977 44872093 44009438 43161324 42327169 41506785 40702087 39916068 39149871 38401803 37669483 36951748
997.4 36951748 36249322 35562497 34889492 34228083 33577332 32937625 32309300 31691468 31082413 30481228
1017.8 30481228 29888195 29304352 28730518 28167072 27614123 27072248 26543215 26028290 25527462 25040275
1038.2 25040275 24566594 24106754 23661281 23229979 22812444 22408824 22019310 21644013 21283275 20937523
1058.6B0937523l31269l17761l04996k92337k78738k63983k48611k31787k12272j90453
1079A8265316j66266j39686j10723p9094m4747p875L1316P2676J15293J58839K02835
1101.4A8297884K45687K85535L21224L50841L73102L88630L97532L99927L96704L89444
1121.8B1846510L80350L71524L63340L55401L48561L44317L43558L45725L49339L53811
1142.2B5402436L60134L68154L75986L82146L86438L89758L93131L96991M00633M02915
1162.6B9258722M03676M04682M07565M11904M16422M20966M25619M30304M35087M39099
1183C3454046M41715M43399M45550M49154M53660M57141M59465M62899M68805M76563
1203.4C8012397M84523M91769M98518N06747N17982N30666N42447N53206N64882N79485
$$ plain form
1058.6 20937523 20606254 20288493 19983497 19691160 19412422 19148439 18899828 18668041 18455769 18265316
1079 18265316 18099050 17959364 17848641 17769547 17724800 17716925 17748241 17820917 17936210 18095049 18297884
1101.4 18297884 18543571 18829106 19150330 19501171 19874273 20262903 20660435 21060362 21457066 21846510
1121.8 21846510 22226860 22598384 22961724 23317125 23665686 24010003 24353561 24699286 25048625 25402436
1142.2 25402436 25762570 26130724 26506710 26888856 27275294 27665052 28058183 28455174 28855807 29258722
1162.6 29258722 29662398 30067080 30474645 30886549 31302971 31723937 32149556 32579860 33014947 33454046
1183 33454046 33895761 34339160 34784710 35233864 35687524 36144665 36604130 37067029 37535834 38012397
1203.4 38012397 38496920 38988689 39487207 39993954 40511936 41042602 41585049 42138255 42703137 43282622
1223.8D3282622N96589O13922O30626O48156O68674O92580P17085P38612P55811P70128
1244.2E0114805P83056P91943P91752P80451P60126P34395P04318O67221O21748N71841
1264.6E7321656N23668M80026M38679L95810L51787L11708K79284K51746K23291J92004
1285F0769659J61445J36435J16855R6900P3266M8548K7531J2016k288k0659m1128n7864
1309.4F1320716o8807p6873q6838j00028j12397j19715j25802j37609j53864j69909
1329.8F0168874j82771j91737k00706k12962k27594k41238k49827k55263k66278k81757
1350.2E7858741k93475l01004l05950l09783l14504l16888l13145l04503k95227k87837
1370.6E4816425k82675k73621k54411k32255k17724k05147j89597j70773j47754j26046
$$ plain form
1223.8 43282622 43879211 44493133 45123759 45771915 46440589 47133169 47850254 48588866 49344677 50114805
1244.2 50114805 50897861 51689804 52481556 53262007 54022133 54756528 55460846 56128067 56749815 57321656
1264.6 57321656 57845324 58325350 58764029 59159839 59511626 59823334 60102618 60354364 60577655 60769659
1285 60769659 60931104 61067539 61184394 61281294 61354560 61403108 61430639 61442655 61440367 61419708 61378580 61320716
1309.4 61320716 61251909 61175036 61088198 60988170 60875773 60756058 60630256 60492647 60338783 60168874
1329.8 60168874 59986103 59794366 59593660 59380698 59153104 58911866 58662039 58406776 58140498 57858741
1350.2 57858741 57565266 57264262 56958312 56648529 56334025 56017137 55703992 55399489 55104262 54816425
1370.6 54816425 54533750 54260129 54005718 53773463 53555739 53350592 53160995 52990222 52842468 52716422
1391E2716422j07616q7732o6507m5508k4349p540M667K1172M2862O4790Q2803R7787
1415.5E2691251J13291J29920J42783J57374J76328J94532K10196K23768K35247K43449
1435.9E4518139K51592K58261K52729K49702K57295K64407K66641K69037K76387K88582
1456.3E7152772K96938L02440L08752L17622L31330L50100L65233L63243L44217L40396
1476.7F0473043L53330L59231L53742L50457L54040L56960L47531L27784L17305L18730
1497.1F3912153L28374L38847L43209L35097L20864L21984L30949L37422L43269L48628
1517.5F7260796L55714L64739L58117L31562L12990L05254L06636L08984L07399K99985
1537.9G0512176K93153K90638K72149K58321K56687K54375K54905K54673K41977K22921
$$ plain form
1391 52716422 52608806 52521074 52454567 52409059 52384710 52377170 52381837 52403009 52445871 52510661 52593464 52691251
1415.5 52691251 52804542 52934462 53077245 53234619 53410947 53605479 53815675 54039443 54274690 54518139
1435.9 54518139 54769731 55027992 55280721 55530423 55787718 56052125 56318766 56587803 56864190 57152772
1456.3 57152772 57449710 57752150 58060902 58378524 58709854 59059954 59425187 59788430 60132647 60473043
1476.7 60473043 60826373 61185604 61539346 61889803 62243843 62600803 62948334 63276118 63593423 63912153
1497.1 63912153 64240527 64579374 64922583 65257680 65578544 65900528 66231477 66568899 66912168 67260796
1517.5 67260796 67616510 67981249 68339366 68670928 68983918 69289172 69595808 69904792 70212191 70512176
1537.9 70512176 70805329 71095967 71368116 71626437 71883124 72137499 72392404 72647077 72889054 73111975
1558.3G3111975K09671J98806J96725K00188K02018J99092J88785J67215J37603J26064
1578.7G4938142J22404J10954R4432P5376O0362M8053K5612k944j9044k2703k9713
1601.1G5400931n1022p0697q1640q8543q9795q8167q4477p2617n7930m8476l2413o247
1625.6G4628907K8289O7496R8586J23841J51223J72770J89483K16931K53785K86078
1646G6217389L05647L20345L27039L20708L18432L20107L12913K96151K78616K73389
1666.4G9290736K57289K12395J84632J83135J87749J93274J91277J82992J65755J43736
1686.8H1192970J34468J31715J26332J28746J40619J50377J39349J11872J02395J08802
1707.2H2467645J22047J34885J36119J27507J15257J00458R5093R5069R4951R7203
$$ plain form
1558.3 73111975 73321646 73520452 73717177 73917365 74119383 74318475 74507260 74674475 74812078 74938142
1578.7 74938142 75060546 75171500 75265932 75341308 75401670 75449723 75475335 75472391 75453347 75430644 75400931
1601.1 75400931 75349909 75279212 75197572 75109029 75019234 74931067 74846590 74773973 74716043 74667567 74635154 74628907
1625.6 74628907 74657196 74724692 74823278 74947119 75098342 75271112 75460595 75677526 75931311 76217389
1646 76217389 76523036 76843381 77170420 77491128 77809560 78129667 78442580 78738731 79017347 79290736
1666.4 79290736 79548025 79760420 79945052 80128187 80315936 80509210 80700487 80883479 81049234 81192970
1686.8 81192970 81327438 81459153 81585485 81714231 81854850 82005227 82144576 82256448 82358843 82467645
1707.2 82467645 82589692 82724577 82860696 82988203 83103460 83203918 83299011 83394080 83489031 83586234
1727.6H3586234J02103J04057R2739P0912O4659P4780Q6510R7776J05661J05309J01322
1750H4592062R7287J04076J10942J03307R5140R6518R9623R6477R0444R0122R5242
1772.4H5671240J00869J00571R0927Q2558Q3220Q3214P5734O4850N6582N8192O3539
1794.9H6531496O4659O5130O8563P2086P6300P9966P4529O5345O2388N5868M4387L8272
1819.4H7298989L9870M4167M8309M8948M1890L5286L4964L7378M0334M2236M1628M0376
1843.8H7794375L8439L4070L4333L7777L4160K9134K9594K8247K0921J8918K5422L3074
1868.3H8158464L8636M2212M3672M5699N0658N4914N5522N1451M6038M8155N6344O1464
1892.8H8753229O1435O2114O7294P3337P3671O8689O2239N9068O0952O2978O3014O2490
$$ plain form
1727.6 83586234 83688337 83792394 83885133 83956045 84020704 84095484 84181994 84279770 84385431 84490740 84592062
1750 84592062 84689349 84793425 84904367 85007674 85102814 85199332 85298955 85395432 85485876 85575998 85671240
1772.4 85671240 85772109 85872680 85963607 86046165 86129385 86212599 86288333 86353183 86409765 86467957 86531496
1794.9 86531496 86596155 86661285 86729848 86801934 86878234 86958200 87032729 87098074 87160462 87216330 87260717 87298989
1819.4 87298989 87338859 87383026 87431335 87480283 87522173 87557459 87592423 87629801 87670135 87712371 87753999 87794375
1843.8 87794375 87832814 87866884 87901217 87938994 87973154 88002288 88031882 88060129 88081050 88099968 88125390 88158464
1868.3 88158464 88197100 88239312 88282984 88328683 88379341 88434255 88489777 88541228 88587266 88635421 88691765 88753229
1892.8 88753229 88814664 88876778 88944072 89017409 89091080 89159769 89222008 89281076 89342028 89405006 89468020 89530510
1917.3H9530510O3079O5738O9088O9124O3544N8502N8740N9396N5719N0682M6765M5389
1941.7I0236276M7982N0473M9526M6712M4268M4501M6969M6360M0335L5113L5506L9047
1966.2I0763068M1717M1569M0054M0555M2373M2468M0770L7849L5030L5947M0227M2933
1990.7I1244560M1849L9846M0900M5443M9668M9985M8143M7814M7940M5526M1897L9190
2015.2I1782761L8874M2462M8995N4628N6398N5885N7936O3997O9660P0870O9040O7169
2039.6I2478675O5672O3944O2585O1005N8341N7602O0213O2221O0081N5761N3870N5886
2064.1I3195856N8454N7834N4390N1808N2529N5314N6266N3561M9597M8614N1039N2887
2088.6I3838149N1338M7779M5735M7171N0038N0282M7350M4507M4709M7404M9168M7862
$$ plain form
1917.3 89530510 89593589 89659327 89728415 89797539 89861083 89919585 89978325 90037721 90093440 90144122 90190887 90236276
1941.7 90236276 90284258 90334731 90384257 90430969 90475237 90519738 90566707 90613067 90653402 90688515 90724021 90763068
1966.2 90763068 90804785 90846354 90886408 90926963 90969336 91011804 91052574 91090423 91125453 91161400 91201627 91244560
1990.7 91244560 91286409 91326255 91367155 91412598 91462266 91512251 91560394 91608208 91656148 91701674 91743571 91782761
2015.2 91782761 91821635 91864097 91913092 91967720 92024118 92080003 92137939 92201936 92271596 92342466 92411506 92478675
2039.6 92478675 92544347 92608291 92670876 92731881 92790222 92847824 92908037 92970258 93030339 93086100 93139970 93195856
2064.1 93195856 93254310 93312144 93366534 93418342 93470871 93526185 93582451 93636012 93685609 93734223 93785262 93838149
2088.6 93838149 93889487 93937266 93983001 94030172 94080210 94130492 94177842 94222349 94267058 94314462 94363630 94411492
2113.1I4411492M5121M4191M6092M8191M7552M4900M3214M4208M6748M7738M5836M3070
2137.5I4958353M2594M4763M6944M6903M5157M4328M5591M7195M6903M5079M3505M3524
2162I5500839M5365M6819M5580M2540M0996M2629M5473M6312M4209M1688M1431M2790
2186.5I6026671M3404M1950L8856L6788L7694L9738L9548L6657L4207L4911L7491L8540
2211I6486455L6746L4059L3378L5155L6955L6251L3242L1060L2055L4637L4767L1733
2235.4I6896493K8861K9182L1734L3164L1835K9260K8389L0488L3087L2782K9832K7651
2259.9I7262758K8503L0655L0756K8264K6018K6512K8789K9981K8479K5809K4313K5123
2284.4I7595960K6715K6947K5564K3908K3550K4640K5702K5153K4277K5070K6834K7042
$$ plain form
2113.1 94411492 94456613 94500804 94546896 94595087 94642639 94687539 94730753 94774961 94821709 94869447 94915283 94958353
2137.5 94958353 95000947 95045710 95092654 95139557 95184714 95229042 95274633 95321828 95368731 95413810 95457315 95500839
2162 95500839 95546204 95593023 95638603 95681143 95722139 95764768 95810241 95856553 95900762 95942450 95983881 96026671
2186.5 96026671 96070075 96112025 96150881 96187669 96225363 96265101 96304649 96341306 96375513 96410424 96447915 96486455
2211 96486455 96523201 96557260 96590638 96625793 96662748 96698999 96732241 96763301 96795356 96829993 96864760 96896493
2235.4 96896493 96925354 96954536 96986270 97019434 97051269 97080529 97108918 97139406 97172493 97205275 97235107 97262758
2259.9 97262758 97291261 97321916 97352672 97380936 97406954 97433466 97462255 97492236 97520715 97546524 97570837 97595960
2284.4 97595960 97622675 97649622 97675186 97699094 97722644 97747284 97772986 97798139 97822416 97847486 97874320 97901362
2308.9I7901362K4885K2757K2727K4432K6524K7585K6626K4342K3210K2936J9926J5175
2333.3I8182487J2881J3959J6177J8925K2781K6607K9439L1650L3855L5274L4374L0840
2357.8I8489249K5505J9049J2583R203R083J0241J2469J7047K2357K5052K5666K6614
2382.3I8704118K8282K9844K9975K7436K3258K0379J9711J9151J7112J4824J4115J5485
2406.8I8963690J7178J7005J4961J2994J3244J5336J6636J5670J3679J3363J5122J6248
2431.2I9145126J5241J3459J2612J3483J4901J4615J2165R788J0055J2070J2827J1390
2455.7I9297732R292R037J0716J2088J1576R429P772Q631J0520J0467Q380O795P397
2482.2I9419832R156R661P981N842N316O521P808P832O623N942P224R102R328Q100
$$ plain form
2308.9 97901362 97926247 97949004 97971731 97996163 98022687 98050272 98076898 98101240 98124450 98147386 98167312 98182487
2333.3 98182487 98195368 98209327 98225504 98244429 98267210 98293817 98323256 98354906 98388761 98424035 98458409 98489249
2357.8 98489249 98514754 98533803 98546386 98555589 98564672 98574913 98587382 98604429 98626786 98651838 98677504 98704118
2382.3 98704118 98732400 98762244 98792219 98819655 98842913 98863292 98883003 98902154 98919266 98934090 98948205 98963690
2406.8 98963690 98980868 98997873 99012834 99025828 99039072 99054408 99071044 99086714 99100393 99113756 99128878 99145126
2431.2 99145126 99160367 99173826 99186438 99199921 99214822 99229437 99241602 99251390 99261445 99273515 99286342 99297732
2455.7 99297732 99307024 99316061 99326777 99338865 99350441 99359870 99367642 99376273 99386793 99397260 99405640 99412435 99419832
2482.2 99419832 99428988 99438649 99446630 99452472 99457788 99464309 99472117 99479949 99486572 99492514 99499738 99508840 99518168 99526268
2510.8I9526268P159P736R138R572Q458P129P045Q285R585R870R269Q821R382J0157
2539.3I9647874R679Q393P295O986P576Q541Q917Q339P963R006J0491J0633R596Q911
2567.9I9770200R287R894R823Q762P462P326Q553R614R132P820P271P642P790O926
2596.4I9887502O050O104O616O944O747N954N263N299N776N859N537N293M983M691
2625I9968618M733M744M787M529L589K569K020J759J162N90L87%Un9N12n3Q9%To20
2667.8I9999356K4m53P2P1n36r96n54O20J323Q88k02J78q76j716k426k998l428l415
2704.5I9984932k772k515l541m494m387l582l046l337l881l922l659l398l272l356
2733.1I9935770l433l308l338m035m846m548l141j711j287j443j228n00j91m53m47
$$ plain form
2510.8 99526268 99533427 99541163 99550301 99559873 99568331 99575460 99582505 99590790 99600375 99610245 99619514 99628335 99637717 99647874
2539.3 99647874 99657553 99665946 99673241 99680227 99687803 99696344 99705261 99713600 99721563 99730569 99741060 99751693 99761289 99770200
2567.9 99770200 99779487 99789381 99799204 99807966 99815428 99822754 99831307 99840921 99850053 99857873 99865144 99872786 99880576 99887502
2596.4 99887502 99893552 99899656 99906272 99913216 99919963 99925917 99931180 99936479 99942255 99948114 99953651 99958944 99963927 99968618
2625 99968618 99973351 99978095 99982882 99987411 99991000 99993569 99995589 99997348 99998510 99999100 99999487 99999487 99999487 99999487 99999428 99999940 99999887 99999976 99999976 99999976 99999356
2667.8 99999356 99999380 99998927 99998999 99999070 99998534 99997538 99996984 99997604 99998927 99999815 99999613 99999791 99998915 99997199 99994773 99991775 99988347 99984932
2704.5 99984932 99982160 99979645 99976104 99971610 99967223 99963641 99960595 99957258 99953377 99949455 99945796 99942398 99939126 99935770
2733.1 99935770 99932337 99929029 99925691 99921656 99916810 99912262 99909121 99907410 99906123 99904680 99903452 99902952 99902761 99902308 99901861
2763.7I9901861J2O02J174J395J079O55Q05J544J561N96o5j8M59Q17P09N96Q46J443
2800.4I9916071J865J377m2j019o79K20M18Q3k27l04j66q17k944n180o902r120j2582
2835.1I9880052j7214k2245k6446k8968k9785k9122k6971k3079j7471j0812n179j473
2859.5I9641287J711M888P081P999P575N758L874L010K748K134J001j01n78j240l230
2890.1I9683917o015p796q631r101r561j1366j4800j8645k1654k3931k6447k9075k9647
2916.6I9467248k6793k1219j3697n090K903J0407J8811K6750L1358L2479L2133L1394
2941.1I9586684K9826K6494K1350J6255J2600J0824J0437R882Q709R030J1533J4174
2965.6I9767798J5605J6594J7970K0010K1815K1797J9908J7137J4907J3947J3143J1253
$$ plain form
2763.7 99901861 99901873 99902475 99903649 99905044 99906123 99906778 99907583 99909127 99910688 99911284 99911219 99911201 99911660 99912477 99913186 99913782 99914628 99916071
2800.4 99916071 99917936 99919313 99919271 99918252 99917573 99917793 99918211 99918294 99918067 99917763 99917597 99916780 99913836 99908656 99901754 99892634 99880052
2835.1 99880052 99862838 99840593 99814147 99785179 99755394 99726272 99699301 99676222 99658751 99647939 99642760 99641287
2859.5 99641287 99642998 99647886 99654967 99662966 99670541 99676299 99680173 99683183 99685931 99688065 99689066 99688965 99688387 99687147 99683917
2890.1 99683917 99677902 99670106 99661475 99652374 99642813 99631447 99616647 99598002 99576348 99552417 99525970 99496895 99467248
2916.6 99467248 99440455 99419236 99405539 99400449 99403352 99413759 99432570 99459320 99490678 99523157 99555290 99586684
2941.1 99586684 99616510 99643004 99664354 99680609 99693209 99704033 99714470 99724352 99733061 99742091 99753624 99767798
2965.6 99767798 99783403 99799997 99817967 99837977 99859792 99881589 99901497 99918634 99933541 99947488 99960631 99971884
2990.1I9971884Q798O598M930L749K765%Un18J275j531l028m405m935n287o080p260
3024.7I9966955q565r239q613q010r180j0913j1587j1534j1444j1593j2302j3256j3978
3051.3I9826741j4341j4436j4400j4943j5486j5097j4651j5509j7113j8418j8906j7935
3075.7I9635506j6356j6421j8012j9247j9425j9062j9341k1190k2912k2882k2328k3079
3100.2I9395251k4765k6173k6029k4468k3734k5398k7430k8038k8139k8766l0106l1745
3124.7I9070460l2825l3223l3623l4291l5423l6740l7080l6550l6704l8517m1169m3458
3149.2I8630857m5353m6700m7731m9276n1569n3686n4956n5873n7262n9170o0767o1524
3173.6I7986990o1875o2824o4671o6691o7896o8390o9410p1764p4661p6967p7927p8023
$$ plain form
2990.1 99971884 99980682 99987280 99992210 99995959 99998724 99998724 99998724 99998724 99998206 99999481 99997950 99994922 99990517 99985582 99980295 99974215 99966955
3024.7 99966955 99958390 99949151 99940538 99932528 99923348 99912435 99900848 99889314 99877870 99866277 99853975 99840719 99826741
3051.3 99826741 99812400 99797964 99783564 99768621 99753135 99738038 99723387 99707878 99690765 99672347 99653441 99635506
3075.7 99635506 99619150 99602729 99584717 99565470 99546045 99526983 99507642 99486452 99463540 99440658 99418330 99395251
3100.2 99395251 99370486 99344313 99318284 99293816 99270082 99244684 99217254 99189216 99161077 99132311 99102205 99070460
3124.7 99070460 99037635 99004412 98970789 98936498 98901075 98864335 98827255 98790705 98754001 98715484 98674315 98630857
3149.2 98630857 98585504 98538804 98491073 98441797 98390228 98336542 98281586 98225713 98168451 98109281 98048514 97986990
3173.6 97986990 97925115 97862291 97797620 97730929 97663033 97594643 97525233 97453469 97378808 97301841 97223914 97145891
3198.1I7145891p8976q1062q2708q2731q1336q0473q1998q4746q5926q4960q3912q4459
3222.6I6152604q6159q7541q7714q7053q6552q6969q7923q7827q6207q4519q4007q3333
3247.1I5116800q0621p6449p3284p1365o9528o7813o6161o3973o2222o2823o4790o5911
3271.5I4291860o6322o7455p0309p3582p5692p7445q0275q3959q7601r0444r2697r5624
3296I3330455j00345j06847j14071j20574j26410j32549j38533j44070j50055j56498
3316.4I2040503j63019j69563j74940j78331j81991j87218j93333j99897k06071k10589
3336.8I0175551k14743k20263k26301k32888k40272k47800k54441k59101k61295k62731
3357.2H7755716k65742k69246k71225k71070k69115k66742k64657k61241k54196k44206
$$ plain form
3198.1 97145891 97066915 96985853 96903145 96820414 96739078 96658605 96576607 96491861 96405935 96320975 96237063 96152604
3222.6 96152604 96066445 95978904 95891190 95804137 95717585 95630616 95542693 95454866 95368659 95284140 95200133 95116800
3247.1 95116800 95036179 94959730 94886446 94815081 94745553 94677740 94611579 94547606 94485384 94422561 94357771 94291860
3271.5 94291860 94225538 94158083 94087774 94014192 93938500 93861055 93780780 93696821 93609220 93518776 93426079 93330455
3296 93330455 93230110 93123263 93009192 92888618 92762208 92629659 92491126 92347056 92197001 92040503
3316.4 92040503 91877484 91707921 91532981 91354650 91172659 90985441 90792108 90592211 90386140 90175551
3336.8 90175551 89960808 89740545 89514244 89281356 89041084 88793284 88538843 88279742 88018447 87755716
3357.2 87755716 87489974 87220728 86949503 86678433 86409318 86142576 85877919 85616678 85362482 85118276
3377.6H5118276k34771k27004k17533k03914j89811j80822j76174j71482j65433j59782
3398H3191550j56677j55568j53726j49620j43856j38706j35416j30361j20455j07056
3418.4H1800109r3812q2159p1013o0200m9222l8558k9701k1446j1760j859O914J5968
3442.9H1363261K7090L8987M9359N9021P0512Q2999R2155R7078J00869J05113J08921
3465.3H2195365J11247J12140J12772J13916J15484J16694J16104J15633J18792J24824
3485.7H3352971J29223J30176J30362J30945J31440J31864J32268J33574J36537J39212
3506.1H4678572J40679J42432J43557J43755J45942J49530J51318J52588J55223J58214
3526.5H6161810J60915J63173J65058J67006J67954J67274J67323J68341J68383J70231
$$ plain form
3377.6 85118276 84883505 84656501 84438968 84235054 84045243 83864421 83688247 83516765 83351332 83191550
3398 83191550 83034873 82879305 82725579 82575959 82432103 82293397 82157981 82027620 81907165 81800109
3418.4 81800109 81706297 81624138 81553125 81492925 81443703 81405145 81375444 81353998 81342238 81340379 81347293 81363261
3442.9 81363261 81390351 81429338 81478697 81537718 81608230 81691229 81783384 81880462 81981331 82086444 82195365
3465.3 82195365 82306612 82418752 82531524 82645440 82760924 82877618 82993722 83109355 83228147 83352971
3485.7 83352971 83482194 83612370 83742732 83873677 84005117 84136981 84269249 84402823 84539360 84678572
3506.1 84678572 84819251 84961683 85105240 85248995 85394937 85544467 85695785 85848373 86003596 86161810
3526.5 86161810 86322725 86485898 86650956 86817962 86985916 87153190 87320513 87488854 87657237 87827468
3546.9H7827468J76310J76281J66255J61565J67322J75989J82676J87486J92774K01755
3567.3H9615881K13027K18446K17109K20192K28584K34401K33263K24882K17593K23452
3587.7I1846830K37083K45351K45666K44212K42502K42686K41011K25473K08336K09278
3608.1I4188428K19363K20644K05517J93042J91450J96046K02202K02287J97923J97774
3628.5I6214676J99759J91420J62262J31702J22327J25104J23161J13553J00625J02096
3648.8I7586685J15312J25253J22356J17487J15675J01906P9095N1791K8598K9903
3669.2I8474061M6009N2685M7469M8745N9503P3934Q8447R2906Q2874P6723P3510O1512
3693.7I9278378M8495L8040L6561M3762M8762M1992K8199K0802K0301K6012L5786L6979
$$ plain form
3546.9 87827468 88003778 88180059 88346314 88507879 88675201 88851190 89033866 89221352 89414126 89615881
3567.3 89615881 89828908 90047354 90264463 90484655 90713239 90947640 91180903 91405785 91623378 91846830
3587.7 91846830 92083913 92329264 92574930 92819142 93061644 93304330 93545341 93770814 93979150 94188428
3608.1 94188428 94407791 94628435 94833952 95026994 95218444 95414490 95616692 95818979 96016902 96214676
3628.5 96214676 96414435 96605855 96768117 96899819 97022146 97147250 97270411 97383964 97484589 97586685
3648.8 97586685 97701997 97827250 97949606 98067093 98182768 98284674 98363769 98415560 98444158 98474061
3669.2 98474061 98520070 98572755 98620224 98668969 98728472 98802406 98890853 98983759 99066633 99143356 99216866 99278378
3693.7 99278378 99326873 99364913 99401474 99445236 99493998 99535990 99564189 99584991 99605292 99631304 99667090 99704069
3718.2I9704069K2644Q893P212J0669K861j3506j2642n806j4210k4074k2888j6874
3742.7I9646348j0294M113K0438K4092J8055J6969K6769M0215M3350L6448L2169K3049
3767.1I9921721P028J359M792O270P880J5068J8042J3906j3173L940k1249k1308k3514
3793.7I9920762k3157j5455n973m673n531r519j3548q130k122n60P09k444o223n370
3822.2I9818766j1951j7905j2559k366N305J2648J9050m65k3931k3294j1528J640P742
3848.7I9761152Q500R835O31j5395k2453j7208Q9J7363K5773J9896n466j5002j180
3875.2I9766535Q404J1539J4741J8894J6970K503j3775j9812j3674k384L255O896Q458
3901.8I9808550M947P385J1200R471J3000K0724J8513N526p218j2309p468P27N573
$$ plain form
3718.2 99704069 99726713 99735606 99742818 99753487 99756348 99742842 99730200 99724394 99710184 99686110 99663222 99646348
3742.7 99646348 99636054 99640167 99660605 99684697 99702752 99719721 99746490 99786705 99830055 99866503 99898672 99921721
3767.1 99921721 99928749 99930108 99934900 99941170 99949050 99964118 99982160 99996066 99982893 99986833 99965584 99944276 99920762
3793.7 99920762 99897605 99882150 99876177 99871504 99865973 99856454 99842906 99834776 99832654 99832094 99832803 99830359 99824136 99818766
3822.2 99818766 99806815 99788910 99776351 99773985 99779290 99791938 99810988 99810523 99786592 99763298 99751770 99753410 99761152
3848.7 99761152 99769652 99779487 99780118 99764723 99742270 99725062 99725151 99742514 99768287 99788183 99782717 99767715 99766535
3875.2 99766535 99774939 99786478 99801219 99820113 99837083 99839586 99825811 99805999 99792325 99789941 99793196 99800092 99808550
3901.8 99808550 99813497 99820882 99832082 99841553 99854553 99875277 99893790 99899316 99892098 99879789 99872321 99873048 99878621
3928.3I9878621R525J1420P188J956J299K175K075K873K795n9j151K349O896R209Q440
3958.9I9945611N734M786M148J884J299L106N007N859N227L421K450K289J979J842
3987.4I9994642K187K241%TR30
3997.6A00000000
$$ plain form
3928.3 99878621 99888146 99899566 99906754 99908710 99910009 99912184 99914259 99917132 99919927 99919868 99918717 99921066 99927962 99937171 99945611
3958.9 99945611 99951345 99956131 99960279 99962163 99963462 99966568 99971575 99977434 99982661 99986082 99988532 99990821 99992800 99994642
3987.4 99994642 99996829 99999070 99999070 99999070 100000000
3997.6 100000000
##END=$$ End of the data block
