##TITLE=PVP01 $$ Begin of the data block
##JCAMP-DX=5.00 $$ ACD/SpecManager v 10.08
##SPECTROMETER/DATA SYSTEM=Alpha
##DATE=22 Aug 2014 09:29:00
##DATA TYPE=INFRARED SPECTRUM
##DATA CLASS=XYDATA
##ORIGIN=
##OWNER=
##NPOINTS=1765
##FIRSTX=399.76428223
##LASTX=3997.64306641
##MAXX=3997.64306641
##MINX=399.76428223
##MAXY=0.85116303
##MINY=0.51311541
##XFACTOR=1.0000000000
##YFACTOR=1.000000000000000e-9
##FIRSTY=0.77758676
##DELTAX=2.03961372
##XUNITS=1/CM
##YUNITS=ARBITRARY UNITS
##XYDATA=(X++(Y..Y))
$$ plain form
399.8 777586758 774133027 774133086 774564266 773022234 771334112 771756828 773045421 773714423 773600996 772452295
420.2 772452295 771270037 769423664 766085088 763769448 763668835 763522208 761762738 759585619 758857489
438.5 758857489 759004354 757858694 755528271 754155576 753936827 753168702 751285613 750226080 750947952
456.9 750947952 750739098 748172522 745441616 744572043 744995058 744584978 743281186 742632508 743176579
475.2 743176579 743858337 743525624 743090928 743951321 745225310 745276630 744553626 744829953 746189773 746655583
495.6 746655583 745488107 744679987 745607436 746625721 745938957 744362831 744016826 745036423 745322406
514 745322406 744057238 742963672 743386149 743975222 743100286 741610765 741538346 742545843 742373526 740906477
534.4 740906477 740267694 740857601 740543067 738308847 736135423 735623300 735157371 732803643 729644299
$$ packed form
399.8G77586758l453731N9M31180j542032j688122M22716J288593O69002j13427j148701
420.2G72452295j182258j846373l338576k315640j00613j46627j759470k177119p28130
438.5G58857489J46865j145660k330423j372695k18749p68125j883089j059533P21872
456.9G50947952k08854k566576k730906q69573M23015m10080j303792o48678N44071
475.2G43176579O81758l32713m34696Q60393J273989N1320p23004K76327J359820M65810
495.6G46655583j167476q08120R27449J018285o86764j576126l46005J019597K85983
514G45322406j265168j093566M22477N89073q74936j489521p2419J007497j72317j467049
534.4G40906477o38783N89907l14534k234220k173424n12123m65929k353728l159344
$$ plain form
552.7 729644299 727785587 726915002 724830627 721032202 717560947 715701282 714103103 711385846 708804429
571.1 708804429 708453834 709913671 711171508 712235093 714833498 719277442 723663568 726527810 728895068
589.4 728895068 732104540 735287905 736881912 737256229 738132715 739836752 740906775 740581930 740006983
607.8 740006983 740471900 741370559 741034389 739409804 738629818 739527941 740083992 739040613 737409294
626.2 737409294 736342072 735413671 733416498 730177462 726745605 723714352 720242620 715766311 711366534
644.5 711366534 708516657 707536578 707741976 708642840 711035192 715463579 720587969 724933326 728553772
662.9 728553772 730016470 728106678 730271399 738162816 744050145 747982204 751140594 753035545
679.2 753035545 754701734 757932544 762290597 765685439 767794311 770512104 774643660 778433561
$$ packed form
552.7G29644299j858712q70585k084375l798425l471255j859665j598179k717257k581417
571.1G08804429l50595J459837J257837J063585K598405M443944M386126K864242K367258
589.4G28895068L209472L183365J594007L74317Q76486J704037J070023l24845n74947
607.8G40006983M64917Q98659l36170j624585p79986Q98123N56051j043379j631319
626.2G37409294j067222r28401j997173l239036l431857l031253l471732m476309m399777
644.5G11366534k849877r80079K05398R00864K392352M428387N124390M345357L620446
662.9G28553772J462698j909792K164721P891417N887329L932059L158390J894951
679.2G53035545J666189L230810M358053L394842K108872K717793M131556L789901
$$ plain form
695.5 778433561 780345738 781653523 784312725 787578404 789141476 789034724 789664209 791698754 792817593
713.9 792817593 791452944 789187372 788322330 788142085 785719216 780959368 776700318 774144650 771869540
732.2 771869540 769316196 768537939 770954847 774560690 776700139 777962744 780819774 785366535 789140701
750.6 789140701 791240513 793881953 798675001 803800941 806971729 809245467 813114285 818162143
766.9 818162143 821584225 822756827 824240744 827454329 830311060 830817580 830510974 831965506 834602594
785.3 834602594 835762024 835262537 835699022 838021159 839898765 839608073 838854671 839915693 841856599
803.6 841856599 842041016 840478778 839722395 840556562 840688944 838635206 836135268 835082591 834265590
822 834265590 831276715 826423049 822215736 819367290 815896511 810642779 805331230 801935256 799784422
$$ packed form
695.5G78433561J912177J307785K659202L265679J563072j06752O29485K034545J118839
713.9G92817593j364649k265572q65042j80245k422869m759848m259050k555668k275110
732.2G71869540k553344p78257K416908L605843K139449J262605K857030M546761L774166
750.6G89140701K099812K641440M793048N125940L170788K273738L868818N047858
766.9H18162143L422082J172602J483917L213585K856731N06520l06606J454532K637088
785.3H34602594J159430m99487M36485K322137J877606k90692p53402J061022J940906
803.6H41856599J84417j562238p56383Q34167J32382k053738k499938j052677q17001
822H34265590k988875m853666m207313k848446l470779n253732n311549l395974k150834
$$ plain form
840.3 799784422 797150373 794644713 794777870 798275948 803044260 807415724 812387526 819174051 826313972
858.7 826313972 831337869 834340751 837571979 841646910 844571650 845116556 845019221 846269786 847877920
877 847877920 847586930 845636666 844265401 843896925 842470169 839024127 835678875 834728360 835537374
895.4 835537374 836250186 837127030 839814544 843933821 846901357 847520888 847493231 848398447 849140227
913.7 849140227 847912908 845369577 843712807 843140006 841662586 838462651 834878445 832120061 830422521
932.1 830422521 830257356 832686901 837957144 844016016 847843170 848800063 849092364 850292385 851163030
950.5 851163030 850131094 848165989 847305834 847432315 846612811 844372749 842485070 841973543 841431081
968.8 841431081 839435279 836887658 835434735 834692836 832918465 829935968 827398300 826017976 824367881
$$ packed form
840.3G99784422k634049k505660J33157L498078M768312M371464M971802O786525P139921
858.7H26313972N023897L002882L231228M074931K924740N44906r7335J250565J608134
877H47877920k90990j950264j371265l68476j426756l446042l345252r50515Q09014
895.4H35537374P12812Q76844K687514M119277K967536O19531k7657R05216P41780
913.7H49140227j227319k543331j656770n72801j477420l199935l584206k758384j697540
932.1H30422521j65165K429545N270243O058872L827154R56893K92301J200021Q70645
950.5H51163030j031936j965105q60155J26481q19504k240062j887679n11527n42462
968.8H41431081j995802k547621j452923p41899j774371k982497k537668j380324j650095
$$ plain form
987.2 824367881 821151912 817167878 813818753 810860634 807233274 803602517 802368045 804444730
1003.5 804444730 807347000 807801783 805080414 800551653 795530856 791093946 788814604 789912522
1019.8 789912522 793720543 798030257 801166415 803225040 805026352 806532800 807134032 806964099 806873858
1038.2 806873858 807142377 807072580 806145132 804890215 804051697 803462088 802437305 800876379 799325526
1056.5 799325526 798076868 796797872 795106113 793160260 791398168 789880633 788398147 787166476
1072.8 787166476 786938727 788169146 790286660 792178333 793304086 793957293 794502020 794807196 794650614
1091.2 794650614 794319749 794336617 794711113 794918954 794690013 794450402 794658840 795024991 794978917 794657707
1111.6 794657707 794806838 795640945 796484292 796925545 797508478 798774600 800240040 801138461 801682949
$$ packed form
987.2H24367881l215969l984034l349125k958119l627360l630757j234472K076685
1003.5H04444730K902270M54783k721369m528761n020797m436910k279342J097918
1019.8G89912522L808021M309714L136158K058625J801312J506448O01232j69933r0241
1038.2H06873858K68519o9797r27448j254917q38518n89609j024783j560926j550853
1056.5G99325526j248658j278996j691759j945853j762092j517535j482486j231671
1072.8G87166476k27749J230419K117514J891673J125753O53207N44727L05176j56582
1091.2G94650614l30865J6868L74496K07841k28941k39611K08438L66151m6074l21210
1111.6G94657707J49131Q34107Q43347M41253N82933J266122J465440Q98421N44488
$$ plain form
1129.9 801682949 802417696 802899420 802042246 799511671 796286345 793422282 790699840 787373126 783628702
1148.3 783628702 780286670 777320147 773718894 769044876 764147222 759891331 756098628 752433538
1164.6 752433538 749678671 749161363 750987053 753830731 756625831 759452999 762411535 764640749
1180.9 764640749 765335977 764970243 764538825 764016449 762521625 759879708 757016003 754484713 751609564
1199.3 751609564 747771204 743526876 739673018 735963106 731626093 726799905 722566366 719546378
1215.6 719546378 717263699 715164363 713435650 712411880 711798966 711215198 711157560 712526679 715261281
1234 715261281 718178093 720271885 721470475 721868336 720907688 717976511 713320971 707622468 700998724
1252.3 700998724 693048954 683814824 673988402 664093435 654191971 644500256 635794818 629022300
$$ packed form
1129.9H01682949P34747M81724q57174k530575l225326k864063k722442l326714l744424
1148.3G83628702l342032k966523l601253m674018m897654m255891l792703l665090
1164.6G52433538k754867n17308J825690K843678K795100K827168K958536K229214
1180.9G64640749O95228l65734m31418n22376j494824k641917k863705k531290k875149
1199.3G51609564l838360m244328l853858l709912m337013m826188m233539l019988
1215.6G19546378k282679k099336j728713j023770o12914n83768n7638J369119K734602
1234G15261281K916812K093792J198590L97861r60648k931177m655540n698503o623744
1252.3G00998724p949770r234130r826422r894967r901464r691715q705438o772518
$$ plain form
1268.6 629022300 624573588 622237802 621560395 621538401 620403826 616635263 610376477 603452027 597953439
1287 597953439 595227897 596179664 601821780 612956762 629189909 648460388 667937875 685167372
1303.3 685167372 698501945 707016647 710618436 710251868 707608521 704757810 703606486 705330491
1319.6 705330491 710274994 718098581 727869809 738547027 749246418 759173572 767891645 775544047
1336 775544047 782176137 787009001 789573312 790739655 791388035 791467011 790577471 788652897 786049128
1354.3 786049128 782821119 778736353 773396790 766057968 757409394 749627948 743498266 739278376
1370.6 739278376 737801850 738788903 741308749 745191634 750296175 756519437 764063895 771784782
1386.9 771784782 776989222 779778242 781631589 781267166 777223706 770116925 761219382 751187027
$$ packed form
1268.6F29022300m448712k335786o77407k1994j134575l768563o258786o924450n498588
1287E97953439k725542R51767N642116J1134982J6233147J9270479J9477487J7229497
1303.3F85167372J3334573Q514702L601789l66568k643347k850711j151324J724005
1319.6G05330491M944503P823587R771228J0677218J0699391R927154Q718073P652402
1336G75544047O632090M832864K564311J166343O48380P8976q89540j924574k603769
1354.3G86049128l228009m084766n339563p338822q648574p781446o129682m219890
1370.6G39278376j476526R87053K519846L882885N104541O223262P544458P720887
1386.9G71784782N204440K789020J853347l64423m043460p106781q897543j0032355
$$ plain form
1403.3 751187027 738527834 723098934 706432760 688762665 670706689 654175162 639860153
1417.5 639860153 627397299 619594812 617953479 621000051 626713693 632116139 634124219 633553207
1433.9 633553207 632436872 631221354 631710470 635983646 644522905 656986058 671015680 681423843
1450.2 681423843 685629308 684527338 676821768 661540985 648100972 642230868 644653857 654161751
1466.5 654161751 668329060 687683582 711667657 732362986 745818436 754108906 758040130 757592857
1482.8 757592857 753332138 746235013 736456990 725632370 718504310 717680633 722380340 730322778
1499.1 730322778 740508378 753483236 771240950 789805949 798879266 803607047 809106588 815232456
1515.4 815232456 820810139 825380802 828773379 829520762 829064250 828616202 828476727 829675853 830673873
$$ packed form
1403.3G51187027j2659193j5428900j6666174j7670095j8055976j6531527j4315009
1417.5F39860153j2462854p802487j641333L046572N713642N402446K008080n71012
1433.9F33553207j116335j215518M89116M273176Q539259J2463153J4029622J0408163
1450.2F81423843M205465j101970p705570j5280783j3440013n870104K422989R507894
1466.5F54161751J4167309J9354522K3984075K0695329J3455450Q290470L931224m47273
1482.8G57592857m260719p097125r778023j0824620p128060q23677M699707P942438
1499.1G30322778J0185600J2974858J7757714J8564999R073317M727781N499541O125868
1515.4H15232456N577683M570663L392577P47383m56512m48048j39475J199126R98020
$$ plain form
1533.8 830673873 830706835 832979202 836776733 835693836 831190407 827080250 824564338 823332787 822658837
1552.2 822658837 822946727 825051546 827069581 821991205 814505458 809909999 807191432 804984450
1568.5 804984450 801305890 796952069 793759942 789240718 782516897 776213944 770366192 764378607
1584.8 764378607 758267879 752038777 745353580 738147438 730513334 722631872 714563668 706071913
1601.1 706071913 697126925 688104570 679045558 669306755 659196556 650163710 641433597 630104959
1617.4 630104959 618540347 608624697 598051846 586657524 575171769 563799798 554688573 548228204
1633.7 548228204 541007996 532312453 525316179 520913124 518931091 518105745 516419947 515357614
1650.1 515357614 516650915 516725957 514215052 513115406 514316976 516506851 518110931 519805491 522947073
$$ packed form
1533.8H30673873L2962K272367L797531j082897m503429m110157k515912j231551o73950
1552.2H22658837K87890K104819K018035n078376p485747m595459k718567k206982
1568.5H04984450l678560m353821l192127m519224o723821o302953n847752n987585
1584.8G64378607o110728o229102o685197p206142p634104p881462q068204q491755
1601.1G06071913q944988r022355r059012r738803j0110199r032846q730113j1328638
1617.4F30104959j1564612r915650j0572851j1394322j1485755j1371971r111225o460369
1633.7E48228204p220208q695543o996274m403055j982033q25346j685798j062333
1650.1E15357614J293301P5042k510905j099646J201570K189875J604080J694560L141582
$$ plain form
1668.4 522947073 526198149 528403223 530736744 533018768 535377979 539091706 544371903 548963547
1684.7 548963547 550995946 553173304 556575060 560836554 566903591 573792934 580145776 585553706
1701.1 585553706 589157343 593345463 598412633 603127122 608230472 614482522 621961772 629129887
1717.4 629129887 633193970 635743380 639531851 644427836 649652421 655150831 661127150 667600751
1733.7 667600751 671942234 674656570 678230405 682114124 685911655 690118790 694539011 698535264
1750 698535264 701396048 703797221 706711829 709733844 712841034 715984583 718306184 720724881 724143267
1768.4 724143267 728162229 731492519 732724547 733375728 735252500 737919390 740236700 742047369
1784.7 742047369 743776083 746296763 749831796 752405643 753077924 753989458 756031811 757919133 758764327
$$ packed form
1668.4E22947073L251076K205074K333521K282024K359211L713727N280197M591644
1684.7E48963547K032399K177358L401756M261494O067037O889343O352842N407930
1701.1E85553706L603637M188120N067170M714489N103350O252050P479250P168115
1717.4F29129887M064083K549410L788471M895985N224585N498410N976319O473601
1733.7F67600751M341483K714336L573835L883719L797531M207135M420221L996253
1750F98535264K860784K401173K914608L022015L107190L143549K321601K418697L418386
1768.4G24143267M018962L330290J232028O51181J876772K666890K317310J810669
1784.7G42047369J728714K520680L535033K573847O72281R11534K042353J887322Q45194
$$ plain form
1803 758764327 759454846 760942876 762923956 764359534 765023410 765865207 767203569 768475354 769682109
1821.4 769682109 771316946 773135066 774737835 775920331 776002586 775835156 776540995 777554512 778512836
1839.8 778512836 780176461 782314241 783141494 782824278 782732189 783209145 784080148 785006464 785792947
1858.1 785792947 786509991 787349463 788551629 790260792 791762352 791948557 791500866 791593254 792083740
1876.5 792083740 792621017 793272913 794025898 794733822 795486867 796377897 796952903 797232747 797598958 797850847
1896.9 797850847 798038125 798458993 798983455 799418271 799880445 800397158 800745785 800971985 801508665 802350819
1917.3 802350819 802878618 803097904 803200424 803036094 803019166 803428352 803906798 804177105 804371417 804798663
1937.7 804798663 805556178 806295633 806452632 806271732 806344748 806562901 806667864 806762397 807022750 807349861
$$ packed form
1803G58764327O90519J488030J981080J435578O63876Q41797J338362J271785J206755
1821.4G69682109J634837J818120J602769J182496Q2255j67430P05839J013517R58324
1839.8G78512836J663625K137780Q27253l17216r2089M76956Q71003R26316P86483
1858.1G85792947P17044Q39472J202166J709163J501560J86205m47691R2388M90486
1876.5G92083740N37277O51896P52985P07924P53045Q91030N75006K79844L66211K51889
1896.9G97850847J87278M20868N24462M34816M62174N16713L48627K26200N36680Q42154
1917.3H02350819N27799K19286J02520j64330j6928M09186M78446K70307J94312M27246
1937.7H04798663P57515P39455J56999j80900P3016K18153J04963R4533K60353L27111
$$ plain form
1958.1 807349861 807518423 807569444 807882667 808486342 808780372 808585227 808460474 808731914 809114456 809234321
1978.5 809234321 809174538 809324861 809725285 810037613 810136735 810297787 810532868 810522616 810271561 810060382
1998.8 810060382 810137212 810398161 810447991 810199618 810031474 810162842 810329258 810275316 810084581 809995174
2019.2 809995174 810046017 809991241 809772253 809713364 809916794 810059369 809954405 809871316 810078859 810382664
2039.6 810382664 810393631 810137987 810037374 810189128 810260177 810103416 809987724 810113251 810266197 810177743
2060 810177743 809985220 809999049 810117543 810019314 809741259 809622586 809757710 809846938 809693158 809492946
2080.4 809492946 809476495 809548855 809482455 809290528 809185743 809200704 809123576 808846951 808567047 808487296 808483779
2102.9 808483779 808337927 808113813 808034539 808085859 808027983 807800353 807623982 807619095 807599962 807418287 807247639
$$ packed form
1958.1H07349861J68562N1021L13223O03675K94030j95145j24753K71440L82542J19865
1978.5H09234321n9783J50323M00424L12328R9122J61052K35081j0252k51055k11179
1998.8H10060382P6830K60949M9830k48373j68144J31368J66416n3942j90735q9407
2019.2H09995174N0843n4776k18988n8889K03430J42575j04964q3089K07543L03805
2039.6H10382664J0967k55644j00613J51754P1049j56761j15692J25527J52946q8454
2060H10177743j92523J3829J18494r8229k78055j18673J35124Q9228j53780k00212
2080.4H09492946j6451P2360o6400j91927j04785J4961p7128k76625k79904p9751l517
2102.9H08483779j45852k24114p9274N1320n7876k27630j76371m887j9133j81675j70648
$$ plain form
2125.3 807247639 807280064 807381988 807349682 807265460 807336211 807538331 807654440 807646751 807730913 807975113 808155656
2147.7 808155656 808149338 808136821 808272362 808430612 808439791 808377624 808459640 808690727 808831096 808781683 808764160
2170.2 808764160 808943987 809154570 809207797 809220612 809413195 809703171 809831560 809792757 809824526 810021996
2190.6 810021996 810178280 810152113 810133934 810309350 810542762 810622275 810595632 810690105 810949087 811138690
2211 811138690 811165094 811254144 811556041 811872244 811979592 811991274 812150657 812426507 812583923 812579572 812623441
2233.4 812623441 812840760 813032091 812990963 812860250 812897265 813061059 813069224 812878430 812762678 812829852
2253.8 812829852 812846541 812638998 812372804 812285185 812303066 812187672 811976671 811932862 812086761 812221706
2274.2 812221706 812261820 812371135 812645674 812831759 812583685 811959565 811308920 810717046 809974015 808996856
$$ packed form
2125.3H07247639L2425J01924l2306q4222P0751K02120J16109p689Q4162K44200J80543
2147.7H08155656o318j2517J35541J58250R179o2167Q2016K31087J40369m9413j7523
2170.2H08764160J79827K10583N3227J2815J92583K89976J28389l8803L1769J97470
2190.6H10021996J56284k6167j8179J75416K33412P9513k6643R4473K58982J89603
2211H11138690K6404Q9050L01897L16203J07348J1682J59383K75850J57416m351M3869
2233.4H12623441K17319J91331m1128j30713L7015J63794Q165j90794j15752O7174
2253.8H12829852J6689k07543k66194q7619J7881j15394k11001m3809J53899J34945
2274.2H12221706M0114J09315K74539J86085k48074o24120o50645n91874p43031r77159
$$ plain form
2294.6 808996856 807938874 806899011 805750012 804288268 802428067 800317407 798139095 795966089
2310.9 795966089 793955982 792036057 789576530 786289334 782934487 780474007 778762519 776823342
2327.2 776823342 774568081 772967577 772268116 771624029 770658553 769728959 769475698 771297276 776457667
2345.6 776457667 781428039 781011105 774985909 767114460 760760963 756765783 755254924 755995214 758592963
2363.9 758592963 762750864 768044949 773971498 780094922 786126912 792004943 797644496 802741945
2380.2 802741945 806847870 809659243 811204910 811818123 811949432 811950862 811944425 811883986 811767340 811702371
2400.6 811702371 811736524 811768234 811752677 811768234 811891913 812056303 812121630 812096059 812109709 812231600 812366664
2423.1 812366664 812412739 812436998 812573433 812773347 812862992 812847555 812888026 813028395 813129842 813122153 813169956
$$ packed form
2294.6H08996856j057982j039863j148999j461744j860201k110660k178312k173006
2310.9G95966089k010107j919925k459527l287196l354847k460480j711488j939177
2327.2G76823342k255261j600504o99461o44087r65476r29594k53261J821578N160391
2345.6G76457667M970372m16934o025196p871449o353497l995180j510859P40290K597749
2363.9G58592963M157901N294085N926549O123424O031990N878031N639553N097449
2380.2H02741945M105925K811373J545667O13213J31309J430o437o0439j16646o4969
2400.6H11702371L4153L1710j5557J5557J23679J64390O5327k5571J3650J21891J35064
2423.1H12366664M6075K4259J36435J99914Q9645j5437M0471J40369J01447p689M7803
$$ plain form
2445.5 813169956 813402116 813636899 813641548 813528538 813582540 813785672 813864648 813745379 813655853 813745320 813839376
2467.9 813839376 813733101 813528180 813462794 813516319 813450575 813201010 813001990 813003719 812980294 812734544 812447250
2490.4 812447250 812357903 812394559 812324226 812153757 812123120 812284172 812378943 812243640 812079847 812123656 812247396
2512.8 812247396 812189698 812007427 811957002 812056959 812047482 811827540 811641932 811645806 811661959 811511815 811288059
2535.3 811288059 811213672 811275661 811219335 810992897 810834587 810842395 810801208 810582638 810373664 810332656 810330451
2557.7 810330451 810172737 809912324 809763610 809742689 809669733 809494913 809364021 809371769 809402168 809303343 809149384
2580.1 809149384 809112906 809160054 809127271 808994889 808906019 808918238 808913648 808814049 808704078 808696747 808739126
2602.6 808739126 808676898 808522880 808436930 808427632 808351099 808188021 808051229 807983696 807897985 807723641 807542920
$$ packed form
2445.5H13169956K32160K34783M649j13010N4002K03132P8976j19269q9526Q9467R4056
2467.9H13839376j06275k04921o5386N3525o5744k49565j99020J729k3425k45750k87294
2490.4H12447250q9347L6656p0333j70469l0637J61052R4771j35303j63793M3809J23740
2512.8H12247396n7698j82271n0425R9957r477k19942j85608L874J6153j50144k23756
2535.3H11288059p4387O1989n6326k26438j58310P808m1187k18570k08974m1008k205
2557.7H10330451j57714k60413j48714k0921p2956j74820j30892P748L0399r8825j53959
2580.1H09149384l6478M7148l2783j32382q8870J2219m590r9599j09971p331M2379
2602.6H08739126o2228j54018q5950r298p6533j63078j36792o7533q5711j74344j80721
$$ plain form
2625 807542920 807456791 807401538 807270944 807099819 806984961 806925893 806809962 806565166 806298435 806147158
2645.4 806147158 806052208 805862427 805588484 805347145 805164456 804995835 804829121 804722130 804697692 804673016
2665.8 804673016 804597735 804517686 804457009 804367006 804234564 804086626 803923130 803738356 803527296 803306162
2686.2 803306162 803092837 802879512 802656949 802408278 802140892 801907003 801697850 801441789 801134706 800834179
2706.6 800834179 800546288 800233126 799903035 799614012 799375653 799144328 798910737 798701286 798555374 798426330
2727 798426330 798223257 797992408 797802925 797654033 797523499 797373354 797224164 797130764 797076046 797006905
2747.4 797006905 796904325 796789944 796676457 796538591 796370208 796181917 795942426 795610607 795194328 794753075
2767.8 794753075 794288635 793757737 793203712 792651474 792050898 791419685 790814042 790250719 789743543 789255202
$$ packed form
2625H07542920q6129n5253j30594j71125j14858n9068j15931k44796k66731j51277
2645.4H06147158r4950j89781k73943k41339j82689j68621j66714j06991k4438k4676
2665.8H04673016p5281q0049o0677r0003j32442j47938j63496j84774k11060k21134
2686.2H03306162k13325Tk22563k48671k67386k33889k09153k56061l07083l00527
2706.6H00834179k87891l13162l30091k89023k38359k31325k33591k09451j45912j29044
2727G98426330k03073k30849j89483j48892j30534j50145j49190r3400n4718o9141
2747.4G97006905j02580j14381j13487j37866j68383j88291k39491l31819m16279m41253
2767.8G94753075m64440n30898n54025n52238o00576o31213o05643n63323n07176m88341
$$ plain form
2788.2 789255202 788690567 788049519 787416697 786806345 786140680 785366535 784541905 783723176 782849610 781845331
2808.6 781845331 780690789 779369473 777837276 776027501 773905456 771517754 768872678 765907586
2824.9 765907586 762659252 759309649 756049573 752936363 749923408 746991098 744044006 740793288
2841.2 740793288 737021327 732766569 728199422 723530650 718932509 714556277 710641861 707378983
2857.5 707378983 704681873 702299297 700118423 698191762 696464777 694748223 693003654 691344976
2873.8 691344976 689836442 688517928 687425196 686557889 685918093 685439944 684982777 684529781 684263945
2892.2 684263945 684309304 684515953 684671462 684694469 684470177 683718503 682207704 680010438 677442908
2910.5 677442908 674756169 672013700 669387281 667248249 665849030 665158629 664939106 665019453 665363014
$$ packed form
2788.2G89255202n64635o41048o32822o10352o65665p74145q24630q18729q73566j004279
2808.6G81845331j154542j321316j532197j809775k122045k387702k645076k965092
2824.9G65907586l248334l349603l260076l113210l012955k932310k947092l250718
2841.2G40793288l771961m254758m567147m668772m598141m376232l914416l262878
2857.5G07378983k697110k382576k180874j926661j726985j716554j744569j658678
2873.8F91344976j508534j318514j092732q67307o39796m78149m57167m52996k65836
2892.2F84263945M5359K06649J55509K3007k24292p51674j510799k197266k567530
2910.5F77442908k686739k742469k626419k139032j399219o90401k19523Q0347L43561
$$ plain form
2928.9 665363014 665764689 665885031 665527999 664687693 663443923 661852121 659923077 657797337 655778050
2947.2 655778050 654099345 652840436 651979983 651569486 651738942 652435303 653476179 654810190 656467736
2965.6 656467736 658325493 660139441 661843479 663521349 665158570 666738153 668319821 670009315
2981.9 670009315 672033131 674583018 677632987 681169987 685269475 689836383 694671392 699613273
2998.2 699613273 704599559 709646404 714581668 719142139 723364413 727413714 731121898 734180570
3014.5 734180570 736611247 738695800 740611196 742327392 743736446 744831204 745827198 746862352
3030.9 746862352 747768223 748337686 748653114 749041736 749548256 749874532 749929547 749938905 750055194 750131726
3051.3 750131726 750079811 750048578 750022709 749866843 749669671 749596536 749622524 749507010 749122083 748676181
$$ packed form
2928.9F65363014M01675J20342l57032q40306j243770j591802j929044k125740k019287
2947.2F55778050j678705j258909q60453m10497J69456O96361J040876J334011J657546
2965.6F56467736J857757J813948J704038J677870J637221J579583J581668J689494
2981.9F70009315K023816K549887L049969L537000M099488M566908M835009M941881
2998.2F99613273M986286N046845M935264M560471M222274M049301L708184L058672
3014.5G34180570K430677K084553J915396J716196J409054J094758R95994J035154
3030.9G46862352R05871N69463L15428L88622N06520L26276N5015R358J16289P6532
3051.3G50131726n1915l1233k5869j55866j97172p3135K5988j15514l84927m45902
$$ plain form
3071.7 748676181 748383880 748290420 748258412 747977495 747433007 746871889 746262908 745552897 744871914 744211912
3092.1 744211912 743539929 742909074 742319822 741706729 740982294 740204096 739572227 739069760 738465309 737825513
3112.4 737825513 737380624 737013221 736496091 735736609 734754324 733774304 733012974 732405722 731752157 730959177
3132.8 730959177 730113208 729392409 728730559 727853894 726813674 725843966 724947572 724078000 723217428
3151.2 723217428 722223401 721054435 719859660 718676984 717485487 716345429 715236783 714038968
3167.5 714038968 712736964 711449802 710229516 709018052 707745433 706384957 705000222 703635097
3183.8 703635097 702227592 700742185 699230373 697737634 696254253 694753945 693215549 691656291
3200.1 691656291 690106392 688519597 686877787 685263932 683717191 682175696 680580258 678973377
$$ packed form
3071.7G48676181k92301r3460l2008k80917n44488n61118o08981p10011o80983o60002
3092.1G44211912o71983o30855n89252o13093p24435p78198o31869n02467o04451o39796
3112.4G37825513m44889l67403n17130p59482r82285r80020p61330o07252o53565p92980
3132.8G30959177q45969p20799o61850q76665j040220r69708q96394q69572q60572
3151.2G23217428r94027j168966j194775j182676j191497j140058j108646j197815
3167.5G14038968j302004j287162j220286j211464j272619j360476j384735j365125
3183.8G03635097j407505j485407j511812j492739j483381j500308j538396j559258
3200.1F91656291j549899j586795j641810j613855j546741j541495j595438j606881
$$ plain form
3216.5 678973377 677427053 675870597 674210727 672547638 671002448 669552445 668144941 666749358
3232.8 666749358 665301085 663774967 662231863 660721183 659288287 657941520 656571090 655129910
3249.1 655129910 653750896 652503669 651273131 649991810 648708999 647437155 646198809 645017982
3265.4 645017982 643855095 642739177 641701996 640668094 639576495 638449013 637355328 636308372
3281.7 636308372 635258615 634228468 633265734 632356584 631457448 630528331 629567266 628567040 627541721
3300.1 627541721 626579821 625693202 624774098 623752058 622652650 621530831 620404720 619243264 618033350
3318.4 618033350 616802156 615579605 614361107 613068342 611667335 610232115 608792782 607344925
3334.8 607344925 605897546 604391456 602835536 601305544 599745154 598125935 596525073 594916523
$$ packed form
3216.5F78973377j546324j556456j659870j663089j545190j450003j407504j395583
3232.8F66749358j448273j526118j543104j510680j432896j346767j370430j441180
3249.1F55129910j379014j247227j230538j281321j282811j271844j238346j180827
3265.4F45017982j162887j115918j037181j033902j091599j127482j093685j046956
3281.7F36308372j049757j030147r62734r09150q99136r29117r61065j000226j025319
3300.1F27541721r61900q86619r19104j022040j099408j121819j126111j161456j209914
3318.4F18033350j231194j222551j218498j292765j401007j435220j439333j447857
3334.8F07344925j447379j506090j555920j529992j560390j619219j600862j608550
$$ plain form
3351.1 594916523 593211532 591450095 589723885 588066220 586408138 584662497 582900643 581186652
3367.4 581186652 579419255 577518404 575619042 573902488 572302878 570639312 568931520 567319036
3383.7 567319036 565788567 564278305 562851310 561488450 560059369 558632135 557340264 556127310
3400 556127310 554872453 553543389 552246213 551072180 550000846 548985660 547990441 546994448 546070397
3418.4 546070397 545263946 544464409 543640792 542889059 542252362 541687250 541164994 540690184 540196061 539654255
3438.8 539654255 539206743 538890600 538655281 538509846 538304567 537998259 537764072 537655771 537672698 537815213
3459.2 537815213 537961364 538037956 538198888 538540542 538814962 538831770 538828313 539027631 539411545 539881587
3479.6 539881587 540249348 540478766 540809691 541240633 541530371 541749954 542167604 542763472 543269038 543748915
$$ packed form
3351.1E94916523j704991j761437j726210j657665j658082j745641j761854j713991
3367.4E81186652j767397j900851j899362j716554j599610j663566j707792j612484
3383.7E67319036j530469j510262j426995j362860j429081j427234j291871j212954
3400E56127310j254857j329064j297176j174033j071334j015186r95219r95993r24051
3418.4E46070397q06451p99537q23617p51733o36697n65112n22256m74810m94123n41806
3438.8E39654255m47512l16143k35319j45435k05279l06308k34187j08301J6927J42515
3459.2E37815213J46151P6592J60932L41654K74420J6808l457J99318L83914M70042
3479.6E39881587L67761K29418L30925M30942K89738K19583M17650N95868N05566M79877
$$ plain form
3500 543748915 544484615 545164585 545441449 545733094 546274185 546852112 547415137 547981322 548579454 549346566
3520.4 549346566 550396800 551452816 552241743 552925289 553563178 554208636 555117428 556169331 557092428
3538.7 557092428 558166146 559726119 561554313 562987447 563846469 564890206 566338778 567636251
3555 567636251 568911791 570600986 572533190 574538708 577200711 580359757 582228899 582903385 584092796
3573.4 584092796 586138546 588469326 590827286 593147695 595633864 598946929 602718472 605056584
3589.7 605056584 606361151 608576238 611534297 614251137 616891026 619508564 621948004 624981105
3606 624981105 629089952 633042157 636148334 638707697 640925825 643937826 647038102 648358166 649141610
3624.4 649141610 651828766 657615364 662239015 663240969 664246321 666240573 668502212 670983255
$$ packed form
3500E43748915P35700O79970K76864K91645N41091N77927N63025N66185N98132P67112
3520.4E49346566J050234J056016P88927O83546O37889O45458R08792J051903R23097
3538.7E57092428J073718J559973J828194J433134Q59022J043737J448572J297473
3555E67636251J275540J689195J932204K005518K662003L159046J869142O74486J189411
3573.4E84092796K045750K330780K357960K320409K486169L313065L771543K338112
3589.7F05056584J304567K215087K958059K716840K639889K617538K439440L033101
3606F24981105M108847L952205L106177K559363K218128L012001L100276J320064P83444
3624.4F49141610K687156N786598M623651J001954J005352J994252K261639K481043
$$ plain form
3640.7 670983255 673390090 676014006 680360079 686501026 689935863 689168811 688977003 691055357 692433774
3659 692433774 692960620 693925619 695083201 697006822 700830817 703930378 705066144 707645059 709087431
3677.4 709087431 707485557 706257343 706174016 707237720 710846901 715334296 716227889 714615166 713530540
3695.8 713530540 713536024 714577317 716259420 716845334 716486096 717403412 720350504 723235846 722930908
3714.1 722930908 720756054 719561338 719710827 720244944 720583856 720655143 720173836 720320880 722744048
3732.5 722744048 726246059 727957249 726645350 724098742 724477530 728460610 729535162 728788078 730592668
3750.8 730592668 730971098 728352368 726483166 726572931 726439536 725463808 725296378 725782394 726472259
3769.2 726472259 726686418 725519598 724383175 724735260 725978255 726158500 725465655 725210309 724981189
$$ packed form
3640.7F70983255K406835K623916M346073O140947L434837p67052j91808K078354J378417
3659F92433774N26846R64999J157582J923621L823995L099561J135766K578915J442372
3677.4G09087431j601874j228214q3327J063704L609181M487395Q93593j612723j084626
3695.8G13530540N484J041293J682103N85914l59238R17316K947092K885342l04938
3714.1G22930908k174854j194716J49489N34117L38912P1287m81307J47044K423168
3732.5G22744048L502011J711190j311899k546608L78788L983080J074552p47084J804590
3750.8G30592668L78430k618730j869202Q9765j33395r75728j67430M86016O89865
3769.2G26472259K14159j166820j136423L52085J242995J80245o92845k55346k29120
$$ plain form
3787.5 724981189 724610507 724398315 724595487 725561798 726226866 727089465 729044318 728783429 727678955
3805.9 727678955 727828503 726481795 724320114 724397898 726843536 728132427 728866756 729764104 728199124
3824.3 728199124 726284325 725454569 725214422 725672483 726265490 727650702 729650378 729701579 728227556
3842.6 728227556 726719260 724985242 723355055 723742425 728668749 732756078 730060458 726200640
3858.9 726200640 725054741 726077914 726910770 726430595 726887763 728000104 727434516 726042628 724702656
3877.3 724702656 724864662 725848496 725715697 725951910 725611925 724572420 724994659 724880874 723356903
3895.6 723356903 723157167 724825144 726489961 727153182 726222217 724025130 722325027 721702993 721686900
3914 721686900 722396255 723308563 723272622 722652674 722521663 722492874 722009838 721932709 722378552 722166002
$$ packed form
3787.5G24981189l70682k12192J97172R66311O65068Q62599J954853k60889j104474
3805.9G27678955J49548j346708k161681P7784K445638J288891P34329Q97348j564980
3824.3G28199124j914799q29756k40147M58061N93007J385212J999676N1201j474023
3842.6G28227556j508296j734018j630187L87370M926324M087329k695620l859818
3858.9G26200640j145899J023173Q32856m80175M57168J112341n65588j391888j339972
3877.3G24702656J62006R83834j32799K36213l39985j039505M22239j13785j523971
3895.6G23356903j99736J667977J664817O63221r30965k197087j700103o22034j6093
3914G21686900P09355R12308l5941o19948j31011k8789m83036p7129M45843k12550
$$ plain form
3934.4 722166002 721302629 720710456 720758796 721221328 721257985 720889509 720905185 720933318 720493793 719987512
3954.8 719987512 719735980 719671011 719691038 719609797 719318926 719084382 719043493 718989849 718835115 718678772
3975.2 718678772 718505204 718283057 718086183 717927992 717742324 717558861 717450678 717339277 717184663 717049718
3995.6 717049718 716873348
3997.6 716873348
$$ packed form
3934.4G22166002q63373n92173M8340M62532L6657l68476J5676K8133m39525n06281
3954.8G19987512k51532o4969K0027q1241k90871k34544m0889n3644j54734j56343
3975.2G18678772j73568k22147j96874j58191j85668j83463j08183j11401j54614j34945
3995.6G17049718j76370
3997.6G16873348
##END=$$ End of the data block
