##TITLE=$$ Begin of the data block
##JCAMP-DX=5.00 $$ ACD/SpecManager v 10.08
##SPECTROMETER/DATA SYSTEM=Varian
##DATE=07 Jan 2013 16:18:26
##DATA TYPE=INFRARED SPECTRUM
##DATA CLASS=XYDATA
##ORIGIN=
##OWNER=
##NPOINTS=3735
##FIRSTX=399.26403809
##LASTX=4000.35498047
##MAXX=4000.35498047
##MINX=399.26403809
##MAXY=66.67767334
##MINY=6.70781183
##XFACTOR=1.0000000000
##YFACTOR=0.000000100000000
##FIRSTY=66.67767334
##DELTAX=0.96440572
##XUNITS=1/CM
##YUNITS=TRANSMITTANCE
##XYDATA=(X++(Y..Y))
399.3F66776733r735336l7373047n798950k2892113n990333r253769l642655J0926285
$$ 666776733 657041397 619668350 613869400 590977287 584986954 575733185 572090530 583016815
407E83016815k105942q98819k578086J4921531l084068q422661p763290p778664O72188
$$ 583016815 580910873 580012054 577433968 592355499 589271431 580848770 573085480 565306816 565979004
415.7E65979004j0058403M788589N204659J4144668l90930l753204q556137k0250206
$$ 565979004 555920601 560709190 565913849 580058517 579667587 575914383 567358246 547108040
423.4E47108040J0812759K707558N418243K175064o52122J2493668O330833P96089
$$ 547108040 557920799 560628357 566046600 568221664 567569542 580063210 586394043 587190132
431.1E87190132r674034l547668r021798k902069P779198p96814R573212P823600j483421
$$ 587190132 577516098 573968430 564946632 562044563 569823761 569026947 578600159 586423759 584940338
439.8E84940338j2797813j3582878j1407090o054458Q118171N203743j555404J625099
$$ 584940338 572142525 558559647 547152557 541098099 549216270 554420013 552864609 554489708
447.5E54489708J6279869L649864j0922661r884033q470917K317963L955193K714576
$$ 554489708 570769577 574419441 563496780 553612747 545141830 547459793 551414986 554129562
455.2E54129562M23890Q940582K937736J490288M45404j1549148M15496j3689880k811737
$$ 554129562 554553452 563494034 566431770 567922058 568367462 556818314 557233810 543543930 540732193
463.9E40732193P425919l236733O571121Q236695M574546j4801445p514801K853928
$$ 540732193 548158112 544921379 551492500 559729195 564303741 549502296 541987495 544841423
471.6E44841423L10898P051048K449532N182762l306580n708313m716491j863709n052681
$$ 544841423 545152321 552203369 554652901 559835663 556529083 550820770 546104279 544240570 539187889
480.3E39187889q770103k438393k936172J0192680P745972M914741O430626J398697
$$ 539187889 530417786 527979393 525043221 535235901 542981873 547896614 554327240 555725937
488E55725937n679054j4898491k345505k783699j215859K104989J0040435J5871888
$$ 555725937 550046883 535148392 532802887 530019188 528803329 530908318 540948753 556820641
495.7E56820641k447739q426323j0885582p008438m738808K748184P987862L251991
$$ 556820641 554372902 545946579 535060997 528052559 523313751 526061935 534049797 537301788
503.4E37301788R427796q11577j140442o423607j2354126k637710K41966P087822M427566
$$ 537301788 546729584 545918007 544777565 538353958 525999832 523362122 523604088 530691910 535119476
512.1E35119476Q11043L287850M395065m983597q072662k968293q694038j988106K661705
$$ 535119476 535930519 539218369 543613434 538629837 530557175 527588882 518894844 516906738 519568443
520.8E19568443M851609O651878L747368k050705m034310o1798p718696j381111K050781
$$ 519568443 524420052 531071930 534819298 532768593 528734283 528672485 520953789 519572678 521623459
529.5E21623459l142243J250573O389427O070747l788070p597695n329056j658210
$$ 521623459 518481216 519731789 526121216 532191963 528403893 520806198 515477142 513818932
537.2E13818932n106545n474586J524658N260238R270707K340355L02009k114944j0344735
$$ 513818932 508712387 503237801 504762459 510022697 519293404 521633759 521935768 519820824 509476089
545.9E09476089q325042l195000K801361K508583N722847O511269K868843m37508o451225
$$ 509476089 501151047 497956047 500757408 503265991 508988838 515500107 518368950 517931442 511480217
554.5E11480217p234039p327919l337326N8860M643975P958831O779480L699761k126694
$$ 511480217 504246178 496918259 493580933 493639793 498283768 506242599 513022079 516721840 514595146
563.2E14595146k582664p157669q852349p084160P76902N834541L523903P803574L409576
$$ 514595146 512012482 504854813 496002464 488918304 489695206 495529747 499053650 506857224 510266800
571.9E10266800j844635o013222p833748n544815l544578J580238J324387Q264770
$$ 510266800 508422165 502408943 494575195 489030380 485485802 487066040 488390427 496655197
579.6D96655197O952973o50254l57361l420639m889984q187294l442154P91054K486000
$$ 496655197 503608170 502957916 502600555 499179916 494289932 486102638 482660484 483451538 485937538
588.3D85937538O564217P092018N498848l692894r021378p773285m674530k379722
$$ 485937538 492501755 499593773 505092621 501399727 492378349 484605064 479930534 477550812
596D77550812Q3313L096008O398125Q491974K057266q80127p669487r647446n428581
$$ 477550812 477634125 480730133 487128258 495620232 497677498 496797371 489127884 479480438 474051857
604.7D74051857n273895J825256M310112N875053N434227K788544P82280m266624q120003
$$ 474051857 468777962 470603218 474913330 480788383 486222610 489011154 489793434 485526810 477406807
613.4D77406807q932304j244851N7183J276245P137108P166633M751206j289788n201606
$$ 477406807 468474503 467229652 467286835 468563080 475700188 482866821 487618027 486328239 481126633
622D81126633q343125p138748l948593K915573Q259964N732727N416145J62163m762726
$$ 481126633 472783508 465644760 461696167 464611740 472871704 478604431 484020576 484182739 479420013
630.7D79420013o306839n353317m490394m038392J212426L679580P091942N361138
$$ 479420013 473113174 467759857 463269463 459231071 460443497 464123077 471215019 476576157
638.4D76576157J620330j477279n459442m705010o210556l510208j719818J640205
$$ 476576157 478196487 476719208 471259766 466554756 460344200 456833992 455114174 456754379
646.2D56754379P139397Q404007M884720l778878o087913p700806n701370k563934
$$ 456754379 463893776 472297783 477182503 473403625 467315712 459614906 453913536 451349602
653.9D51349602k81449N722084Q707695P090645l62053m658203n075569n278778n840912
$$ 451349602 451068153 456790237 465497932 472588577 472226524 467568321 462492752 457213974 451373062
662.5D51373062l638191K313805N121002P461090P496910O18668p089692l035125m774971
$$ 451373062 447734871 450048676 455169678 462630768 470127678 470746346 463656654 460621529 455846558
671.2D55846558o193848j664772j77689L423424N544624N553132L965644k312393l627586
$$ 455846558 449652710 447987938 447810249 451233673 456778297 462331429 466297073 463984680 460357094
679.9D60357094p449074o020241j067695J928711M543495M177627M499245J148682
$$ 460357094 452908020 446887779 445820084 447748795 452292290 456469917 460969162 462117844
687.6D62117844k411995p421837o469002k435493j880417J452293L952255O149979
$$ 462117844 459705849 452284012 445815010 443379517 441499100 442951393 446903648 453053627
695.3D53053627L977966J408272k540550m372406m571419q168907l989868o85959N358543
$$ 453053627 457031593 458439865 455899315 451526909 446955490 438786583 434796715 434110756 439469299
704D39469299Q303986L815002P06940m589348l997459m490166n016479k837029R35707
$$ 439469299 447773285 451588287 452295227 447705879 443708420 439218254 434201775 431364746 432300453
712.7D32300453N227204M079933M048423J764908o28051l607636n634842m442520k979965
$$ 432300453 437527657 441607590 445656013 447420921 446792870 443185234 437550392 433107872 430127907
721.4D30127907L72047M94309L830375O190377K694587j129760l118325l702240o310806
$$ 430127907 430499954 430994263 434824638 441015015 443709602 442579842 439461517 435759277 429448471
730.1D29448471l887825L9177L144951N919266M790001K329483R47876j788331p389106
$$ 429448471 425560646 425599823 428744774 434664040 439454041 441783524 442731400 440943069 433553963
738.7D33553963o459046k189827K005539L820648K670365L668442K368698L31955l006554
$$ 433553963 427094917 424905090 426910629 430731277 433401642 437070084 439438782 439770737 436764183
747.4D36764183m071350l881912m523125j616554J998863O343880N059166J946106
$$ 436764183 432692833 428810921 424287796 422671242 424670105 431013985 436073151 438019257
755.1D38019257Q89091j725578m983254p407531l624306O87408K686997M589615M724388
$$ 438019257 438908348 437182770 432199516 424791985 421167679 421855087 424542084 429131699 433856087
763.8D33856087J446533n11627k676125p071915n196876j777420J236267J002388J339340
$$ 433856087 435302620 434790993 432114868 425042953 419846077 418068657 419304924 420307312 421646652
772.5D21646652M121094K796249K109223j922913n053482n628090m128608J08757K718620
$$ 421646652 425767746 428563995 430673218 428750305 423696823 418068733 413940125 414048882 416767502
781.2D16767502M459648L071098L322144n455k983399k723999m537048l455391k139397
$$ 416767502 421227150 424298248 427620392 427614937 424631538 421907539 417370491 413915100 411775703
789.9D11775703K356148L295593L772049M930191j44615l872184n835610l982391l473473
$$ 411775703 414131851 417427444 421199493 426129684 425985069 422112885 416277275 412294884 408821411
798.5D08821411j298485K371331L140220L149529K228737K538871k133560l923797
$$ 408821411 407522926 409894257 413034477 416184006 418412743 420951614 418818054 414894257
806.2D14894257m262085m460030o87218J07003K938461M210739L191452n39818k737083
$$ 414894257 410632172 406172142 405484924 405591927 408530388 412741127 415932579 415392761 412655678
814.9D12655678k231903m498024m184380k412338J402130K199707K930565L735657
$$ 412655678 410423775 405925751 401741371 399329033 400731163 402930870 405861435 409597092
822.6D09597092J973114j56441n194550n429954m643631j448517J997261L075523M174386
$$ 409597092 411570206 411413765 406219215 400789261 396145630 394697113 396694374 399769897 403944283
831.3D03944283J797065J483269j931572l883209l544464l568344j821251r24073L565674
$$ 403944283 405741348 407224617 405293045 401409836 397865372 394297028 392475777 391551704 395117378
840C95117378M455605L891067J872788k083931l115692n180359m110909k089653K0294
$$ 395117378 399572983 403464050 405336838 403252907 400137215 394956856 390845947 388756294 388776588
848.7C88776588K510758N146065L996849j63002j57891j223526l246841m849434m088211
$$ 388776588 391287346 396433411 400430260 400267258 400109367 398885841 395639000 390789566 386701355
857.4C86701355p65457K724685M273606M292145L278465m21982l98369j914787l796883
$$ 386701355 385935898 388660583 392934189 397226334 400504799 400082817 399684448 397769661 393972778
866C93972778k410774j644211K312622N210572N831794M230194Q24814k800789l582038
$$ 393972778 391562004 389917793 392230415 397440987 403272781 407502975 408327789 405527000 401944962
874.7D01944962k089043l000794k226333k1324M256286M562187J966820N63164j860085
$$ 401944962 399855919 396855125 394628792 394607468 398863754 403425941 405392761 405955925 404095840
883.4D04095840k750511n240516m016076j121292J583786L222390K196502L030320
$$ 404095840 401345329 396104813 392088737 390967445 392551231 395773621 397970123 401000443
891.1D01000443J916046l19901n084038n707550k183609o23893O18858P53212L845711
$$ 401000443 402916489 402596588 397512550 391805000 389621391 388997498 389616356 390369568 394215279
899.8C94215279K995987J161689k97775l923569m556160m732093j329003J092339K137146
$$ 394215279 397211266 398372955 398075180 394151611 389595451 384863358 383534355 384626694 386763840
908.5C86763840K830581K504731J917419o24161k440796n089225m119454k551117q86574
$$ 386763840 389594421 392099152 394016571 393392410 390951614 385862389 381742935 379191818 378305244
917.2C78305244K031136L064384M390374J497764j597709k411728k423058l732414
$$ 378305244 380336380 383400764 387791138 389288902 387691193 385279465 382856407 379123993
924.9C79123993m579392o23779K754326M238281K972870J900749p18536l457756l120918
$$ 379123993 374544601 373920822 376675148 380913429 383886299 385787048 385068512 381610756 378489838
933.6C78489838l863259k311630m12521J906662K382507K579117L392715j61590l068657
$$ 378489838 374626579 372314949 371902428 373809090 376191597 378770714 382163429 382001839 378933182
942.2C78933182m538155l375053k777443j419869K230225M186096N173721J745835
$$ 378933182 374395027 371019974 368242531 366822662 369052887 373238983 378412704 380158539
949.9C80158539j511116k407875l106690l999786k798767N50957J447258L542747L906593
$$ 380158539 378647423 376239548 373132858 369133072 366334305 366885262 368332520 371875267 375781860
958.6C75781860J902008j53274j537933k613984n257530l437538l48206J071091K034531
$$ 375781860 377683868 377530594 375992661 373378677 368121147 364683609 364335403 365406494 367441025
967.3C67441025L280067L560066M16832k155799l387719l810310l950882j811218J032486
$$ 367441025 370721092 374281158 374697990 372542191 369154472 365344162 361393280 359582062 360614548
976C60614548K675171K845649J260643J206093n56679k467308l627395m173317k704926
$$ 360614548 363289719 366135368 367396011 368602104 368045425 365578117 361950722 357777405 355072479
984.7C55072479l86238L452912M003410K439613K53372j440200k777024m930649l881378
$$ 355072479 354686241 358139153 362142563 364582176 364835548 363395348 360618324 355687675 351806297
993.3C51806297k266006Q8997J898765K819634L013496J210938n60761l097687m645652
$$ 351806297 349540291 349629288 351528053 354347687 357361183 358572121 358011360 354913673 350268021
1002C50268021m653588k536583l57780K607384N154113L430367J613350q83064l137207
$$ 350268021 345614433 343077850 342720070 345327454 350481567 353911934 355525284 354642220 351505013
1010.7C51505013m521904m555817k939453j856194N39284L574982N217666L187256
$$ 351505013 346983109 342427292 339487839 337631645 338170929 341745911 346963577 350150833
1018.4C50150833n2833l617249m638634k725601k220535o87943L87497L841324M770203
$$ 350150833 350098000 346480751 341842117 339116516 336895981 336208038 336595535 340436859 345207062
1027.1C45207062J308822L84446q58994k422256n127030m764747n15252L452034M519539
$$ 345207062 346515884 346900330 346041336 343619080 338492050 333727303 333212051 336664085 341183624
1035.8C41183624K353783J242561J22261j023788k462845k359200k603607k436599
$$ 341183624 343537407 344779968 344902229 343878441 341415596 339056396 336452789 334016190
1043.5C34016190Q91037K984581N019340K473030o13823q45337k505111l569985m134941
$$ 334016190 334907227 337891808 342911148 345384178 344770355 343925018 341419907 337849922 333714981
1052.2C33714981j660347O99463K950516L927078K453423R49783p78275k091255n316048
$$ 333714981 332054634 332754097 335704613 339631691 342085114 343034897 342256622 340165367 334849319
1060.9C34849319l494339M93050j75323N79376M465332M542999N03426j76468k319832
$$ 334849319 331354980 331848030 331672707 332252083 336717415 341260414 341763840 341587372 339267540
1069.5C39267540l970032l146553k578850K58065K440529M214553L598977J671638
$$ 339267540 335297508 332150955 329572105 329830170 332270699 336485252 340084229 341755867
1077.2C41755867j325760l704071l582992l725892j175537N63507K260590M149361
$$ 341755867 340430107 336726036 333143044 329417152 328241615 328805122 331065712 335215073
1085C35215073L754921J093406j259651k595825n408173l386001j188164n46570J404076
$$ 335215073 338969994 340063400 338803749 336207924 330799751 327413750 326225586 325679016 327083092
1093.6C27083092L590851M151725K18773j393356k325020k983360k953911l029747
$$ 327083092 330673943 334825668 335044441 333651085 331326065 328342705 325388794 322359047
1101.4C22359047j62773J859321L490220L687133K660637J019936j739502m031487
$$ 322359047 322196274 324055595 327545815 331232948 333893585 334913521 333174019 329142532
1109.1C29142532m458274k848969j425400K497406M971123M268951K031708n2261j213379
$$ 329142532 324684258 321835289 320409889 322907295 327878418 332147369 334179077 334126816 332913437
1117.7C32913437m010010m694557l323212N02930K639427K698670L058471J931038
$$ 332913437 328903427 324208870 320885658 321388588 324028015 326726685 329785156 331716194
1125.5C31716194J955643j425896m434166m361763l217048m4365J727142K859650K654342
$$ 331716194 333671837 332245941 327811775 323450012 320232964 320188599 321915741 324775391 327429733
1134.1C27429733K723198J295853j871300l294411l515205k981243j920281J787758
$$ 327429733 330152931 331448784 329577484 326283073 322767868 319786625 317866344 319654102
1141.9C19654102L458653M189987L602142Q00400p29294l611259l807984k338867l94478
$$ 319654102 323112755 327302742 330904884 331705284 330975990 327364731 323556747 321217880 320823402
1150.5C20823402J964569M389077N369529K622834J778755m53262l146363l721733
$$ 320823402 322787971 327177048 332546577 335169411 336948166 336494904 333348541 329626808
1158.3C29626808l436355j119614J093216L423424K872123K238083J568032m53492
$$ 329626808 326190453 325070839 326164055 329587479 332459602 334697685 336265717 335812225
1166C35812225k185630m638558m067917k613106M71268L821182M776192L832588R17435
$$ 335812225 333626595 328988037 324920120 322307014 322778282 326599464 331375656 335208244 336125679
1174.6C36125679r04694l131294m379463l892136k102127P89032L462029M290199K438736
$$ 336125679 335220985 332089691 327710228 323818092 321715965 322504997 325967026 330257225 332695961
1183.3C32695961J268845m69628k446823l551407l285522j292458k43110J002006K644730
$$ 332695961 333964806 333495178 331048355 327496948 324211426 322918968 322675858 323677864 326322594
1192C26322594M040374K827988n38940l449021m589386l349304k047291J12229J330623
$$ 326322594 330362968 333190956 332652016 329202995 324613609 321264305 319217014 319329243 320659866
1200.7C20659866K742501L910293J381836j079292j937294l651695m676514k344513
$$ 320659866 323402367 327312660 328694496 327615204 325677910 322026215 317349701 315005188
1208.4C15005188o94809J393242L610401K757092J675758j84860k597809l931294k946682
$$ 315005188 314310379 315703621 319314022 322071114 323746872 323562012 320964203 317032909 314086227
1217.1C14086227j721897j189842R46693L008481L311348J594924K66495j860504l928928
$$ 314086227 312364330 311174488 312121181 315129662 318441010 320035934 320302429 318441925 314512997
1225.8C14512997l873577k839737j1673J250343K002449K718258K168770O52160j281318
$$ 314512997 310639420 307799683 307788010 309038353 311040802 313759060 315927830 316579990 315298672
1234.4C15298672k947998m532452k614174j87321J897469L634701K537117J256752
$$ 315298672 312350674 307818222 305204048 305016727 306914196 310548897 313086014 314342766
1242.2C14342766O26030j65043k653542m038219l315659j162738J972026L013840K693634
$$ 314342766 314968796 314803753 312150211 308111992 304796333 303633595 305605621 308619461 311313095
1250.8C11313095J572094J283741o3057k945290m045715l244572r14897N02910K423001
$$ 311313095 312885189 314168930 314105873 311160583 307114868 303870296 302955399 303458309 305881310
1259.5C05881310L287677K515774J193199j478729k977142l338395k423172j442508
$$ 305881310 309168987 311684761 312877960 311399231 308422089 305083694 302660522 301218014
1267.2C01218014O36043K291508K844830L632030R82781j387845j886520k544250k666436
$$ 301218014 301854057 304145565 306990395 310622425 311605206 310217361 308330841 305786591 303120155
1275.9C03120155j852817J93271J394654K629566K894001J827412L28121j479740k751217
$$ 303120155 301267338 301460609 302855263 305484829 308378830 310206242 310534363 309054623 306303406
1284.6C06303406k838555j278247L051J754074K847329K881546J764049k06222j721020
$$ 306303406 303464851 302186604 302189655 303943729 306791058 309672604 311436653 311230431 309509411
1293.3C09509411l246632k781162j679363l5286J519203K858849L349990J387539J92662
$$ 309509411 306262779 303481617 301802254 301766968 303286171 306145020 309495010 310882549 311075211
1301.9C11075211j445408k859001l618298k839432j5392J262894L195743L227005J407566
$$ 311075211 309629803 306770802 303152504 300313072 300297680 301560574 304756317 307983322 309390888
1310.6C09390888l56598j796875k305813l237304j931458n54867P68223K178421K568341
$$ 309390888 309034290 307237415 304931602 301694298 299762840 299207973 299976196 302154617 304722958
1319.3C04722958K061214N05619n65758j947307k697067k603493q70304P23858J232795
$$ 304722958 306784172 307289791 306724033 304776726 302079659 299476166 298605862 299329720 300562515
1328C00562515K704563K718983J136894j074848k206402k459621k701092j403618N77641
$$ 300562515 303267078 305986061 307122955 306048107 303841705 301382084 298680992 297277374 297855015
1336.7B97855015K601986K745132J356507p43237j046944j180133k188111j670437
$$ 297855015 300457001 303202133 304558640 303815403 302768459 301588326 299400215 297729778
1344.4B97729778j544628n63183J513634L413429K706948J50737m74510j410484k058144
$$ 297729778 296185150 295621967 297135601 300549030 303255978 303406715 302932205 301521721 299463577
1353.1B99463577k381496j935101l71608J140556J698456J591816K601528L05385k225227
$$ 299463577 297082081 295146980 294775372 295915928 297614384 299206200 301807728 302113113 299887886
1361.7B99887886j778526l817005j522866L99781J111965J944065J584434l3607n0011
$$ 299887886 298109360 294292355 292769489 293169270 294281235 296225300 297809734 297776127 297726116
1370.4B97726116r14039k394448k448005l082180l85228K149086K815132K375107J382714
$$ 297726116 296812077 294417629 291969624 288887444 288502216 290651302 293466434 295841541 297224255
1379.1B97224255L74717j323108j348095k726422k433643n9280K230033L491211K97757
$$ 297224255 297598972 296275864 294927769 292201347 289767704 289708424 291938457 295429668 295727425
1387.8B95727425M73594J207753j29185j750317k630005o41994j824894j942158K131958
$$ 295727425 296201019 297408772 297279587 295529270 292899265 292257271 290432377 288490219 290622177
1396.4B90622177L524704L015556l41968k113724j718063k482739j783466k78778j889458
$$ 290622177 294146881 297162437 296820469 294706745 292988682 290505943 288722477 288443699 286554241
1405.1B86554241R4433K977810K500038J754551m59137j762867k616997k496681n68142
$$ 286554241 286648674 289626484 292126522 293881073 293421936 291659069 289042072 286545391 285977249
1413.8B85977249n78365J354198J971741K459087M459896k900810n788231j218834
$$ 285977249 285398884 286753082 288724823 291183910 295643806 292742996 286954765 285735931
1421.5B85735931j201343j354752k327785J652832L573265J643333J806088J873379
$$ 285735931 284534588 283179836 280852051 282504883 286078148 287721481 289527569 291400948
1429.2B91400948k539463m041996k141896j137695l83167K699680M203224l607445
$$ 291400948 288861485 284819489 282677593 281539898 281156731 283856411 288059635 284452190
1437B84452190j154174K927150l95050k303600k067013j989746k01034J220912K035275
$$ 284452190 283298016 286225166 285830116 283526516 281459503 279469757 279268723 280489635 282524910
1445.6B82524910L553390K548447j926765j634484n99956j978951l002853r37386K547436
$$ 282524910 286078300 288626747 286699982 285065498 284465542 282486591 279483738 278546352 281093788
1454.3B81093788N072060N377903j442528n232677j510792k249966l60546j246452
$$ 281093788 286165848 291543751 290101223 284868546 283357754 281107788 280747242 279500790
1462B79500790k41490L470726j056041j894017L480244K015800r8037k82345Q9416
$$ 279500790 279259300 282730026 281673985 279779968 283260212 285276012 285177975 284895630 284985046
1470.7B84985046j933479l009014l023472L065338O150265Q04119m87347J829281p29503
$$ 284985046 283051567 280042553 277019081 280084419 286234684 287038803 286551456 288380737 287651234
1479.4B87651234j375580j975250k227250J16330J853351K413998L753204K407284
$$ 287651234 286275654 284300404 282073154 282189484 284042835 286456833 290210037 292617321
1487.1B92617321k090034O72874O6128n727005j428490J256046J287022L055668L942623
$$ 292617321 290527287 291200161 291266289 285539284 284110794 285366840 286653862 289709530 293652153
1495.8B93652153k443504J640777J754608n257167j219979j108684r67961J127301
$$ 293652153 291208649 292849426 294604034 289346867 288126888 287018204 286050243 287177544
1503.5B87177544L141002M939823K697773n646781j550999Q98742k432994j288548
$$ 287177544 290318546 295258369 297956142 292309361 290758362 291657104 289224110 287935562
1511.2B87935562j161442q44555L619576K404423J569538K266311o468200m08001J374378
$$ 287935562 286774120 285929565 289549141 291953564 293523102 295789413 289321213 288913212 290287590
1519.9B90287590k680130m690933n99537M670429M732323J8329n51185J054230l134900
$$ 290287590 287607460 282916527 282316990 286987419 291719742 291738071 291186886 292241116 289106216
1528.6B89106216k751407m80213m53701J544895K67525l893662K597389K254429J295567
$$ 289106216 286354809 285874596 285420895 286965790 287233315 283339653 285937042 288191471 289487038
1537.2B89487038J557464n085716j0212994M576035J697121K90012M303379J530781
$$ 289487038 291044502 285958786 275745792 280321827 282018948 282308960 286612339 288143120
1545B88143120m234352K64873R2316k63519k846890m458923J250877K540016L635121
$$ 288143120 283908768 284173641 284265957 284002438 281155548 276696625 277947502 280487518 284122639
1553.6B84122639k414913j513005M464512K288036m436054m624882j1340618M453507
$$ 284122639 281707726 280194721 284659233 286947269 282511215 277886333 266545715 270999222
1561.4B70999222M872017L147392J992512j091824r12018O73848L1528q76770q401489
$$ 270999222 275871239 279018631 281011143 279919319 279007301 279681149 279712677 278835907 270434418
1570B70434418m10576K938747K638912L692742M550304L888359j0207939l100471j90811
$$ 270434418 270023842 272962589 275601501 279294243 283844547 287732906 277524967 274424496 274233685
1578.7B74233685j600686L49598O24905J270943J356468J160545P36160j52645q13045
$$ 274233685 272632999 272982597 273607502 274878445 276234913 277395458 278131618 277978973 277165928
1587.4B77165928k357769k018662j339912K10552J241951J985912K050591J86138k75993
$$ 277165928 274808159 272789497 271449585 271660137 272902088 274888000 276938591 277124729 276848736
1596.1B76848736j515026k666664k480107j130218j94264Q77724J534271J11141M12445
$$ 276848736 275333710 272667046 270186939 269056721 268862457 269740181 271274452 271385593 271798038
1604.7B71798038j49498o71119j628037k334022k147560j229172J240158O57730O59027
$$ 271798038 271648540 270977421 269349384 267015362 264867802 263638630 264878788 265536518 266195545
1613.4B66195545M42410K170925K640667j0934105j567059L6030q9321M57249J662311
$$ 266195545 266637955 268808880 271449547 260515442 258948383 258984413 258895092 259352341 261014652
1622.1B61014652Q98781m345760J891098J285801N93204k544117m172287N39875q29468
$$ 261014652 261913433 257567673 259458771 260744572 261337776 258793659 254621372 255161247 254331779
1630.8B54331779P74727Q50525K441960N578556p377072n605774J041470j447563Q86860
$$ 254331779 255106506 255957031 258398991 263977547 256600475 250994701 252036171 250588608 251475468
1639.5B51475468R01546L26386J514930J417447J767520K214985k890281n305481l576928
$$ 251475468 252377014 252703400 254218330 255635777 257403297 259618282 256728001 251422520 247845592
1648.1B47845592m86183L327084N152588P468815M546623k1052113K697144J958256
$$ 247845592 247359409 250686493 255839081 263307896 267854519 246802406 249499550 251457806
1655.9B51457806Q30249j676693j080036N30758J615658L369255P39384l619519K59934
$$ 251457806 252288055 250611362 249531326 250062084 251677742 255046997 255786381 252166862 252426796
1664.5B52426796J017437m97475n41515j08700l659973Q26302L155174l54309K143001
$$ 252426796 253444233 252946758 252405243 252296543 248636570 249462872 252618046 252263737 254406738
1673.2B54406738M486637L3627q994942j007232M6958O85921J111737l74089L446675
$$ 254406738 258893375 258927002 249932060 248924828 248971786 249657707 250769444 250395355 253842030
1681.9B53842030N330848M30851j7250042O66085M772300J042538k125416K36645R28135
$$ 253842030 259172878 259603729 242353687 243019772 247792072 248834610 246709194 246945839 247873974
1690.6B47873974J385460R51290l48282K328186J783371j4531269o65703N701714O645622
$$ 247873974 249259434 250210724 249862442 252190628 253973999 239442730 238777027 244478741 251124363
1699.3B51124363n294590j7350254J2275123N666142J095562k950554j589622l903504
$$ 251124363 245829773 228479519 240754642 246420784 247516346 244565792 242976170 239072666
1707B39072666k092914L429222J526527J06773J343155K017842K316761k561856l618698
$$ 239072666 236979752 240408974 241935501 242042274 243385429 245403271 247720032 245158176 241539478
1715.6B41539478J972142J311931j0786228J237736N101948K733764J474419j647206
$$ 241539478 243511620 244823551 234037323 235275059 240377007 243110771 244585190 242937984
1723.4B42937984l048610j609726j410046j001949K34947K238865m28963N3234M593239
$$ 242937984 239889374 238279648 236869602 235867653 236102600 238341465 237912502 237965736 242558975
1732B42558975N612793q73108j7452564R98783K839222J992054M329414K89135n235176
$$ 242558975 248171768 247298660 229846096 230844879 233684101 235676155 240005569 240294704 235059528
1740.7B35059528L446617L509293k578964l275204M43039J296845J925792R35288j99566
$$ 235059528 238506145 242015438 239436474 236161270 236604309 237901154 239826946 240762234 240562668
1749.4B40562668N307674O32820n906372K561417L75328K16637K116947j870480r38186
$$ 240562668 245870342 246503162 240596790 243158207 243533535 243750172 245867119 243996639 243058453
1758.1B43058453J322498K695503L558445n18532m503860o63281j078128j992569Q27045
$$ 243058453 244380951 247076454 250634899 250116367 245612507 244949226 243871098 241878529 242705574
1766.8B42705574J025047j572303K565250M800129L180008l342858p774791q90675
$$ 242705574 243730621 242158318 244723568 249523697 252703705 249360847 241586056 240695381
1774.5B40695381K18315j781215P6427J136818K372704J392631j741390o50978K05230
$$ 240695381 240913696 239132481 239208908 240345726 242718430 244111061 242369671 241718693 241923923
1783.2B41923923j26934k679939j851959J432648P79991J114254J974468J501350R00364
$$ 241923923 241796989 239117050 237265091 238697739 239477730 240591984 242566452 244067802 244968166
1791.8B44968166l844566m332428Q74577k20910k111358O79760K167892J077557o2027
$$ 244968166 241123600 236791172 237665749 237444839 235333481 236013241 238181133 239258690 239196663
1800.5B39196663L53527k095509k859134o27137p44037J3294P48043R35860K211971
$$ 239196663 239550190 237454681 234595547 233968410 233224373 233237667 233985710 234921570 237133541
1809.2B37133541J557312j952400j737995o56643j638737q79612k05250L27893M60624
$$ 237133541 238690853 236738453 235000458 234343815 232705078 231825466 231620216 231948109 232408733
1817.9B32408733R41925J394768K14462l41377j897259q74271J25065l682346J58214
$$ 232408733 233350658 234745426 234959888 234618511 232721252 231846981 231972046 228289700 228447914
1826.5B28447914K962818K867985J248322m136124j089172K30426j378917j055069
$$ 228447914 231410732 234278717 235527039 231390915 230301743 230532169 229153252 228098183
1834.3B28098183n6229P4329l63788O56929J094303K08321k63939p31278L22743p33338
$$ 228098183 228041954 228116283 227752495 228409424 229503727 229712048 229448109 228716831 229039574 228306236
1843.9B28306236n804958J078243K886925Q74634K68783K74544l7689r94988j898079
$$ 228306236 222501278 223579521 226466446 227341080 227609863 227884407 227846718 226851730 224953651
1852.6B24953651j862182l35655L26233K55870J187001P88879L40233k06719j034660
$$ 224953651 223091469 222755814 223082047 223337917 224524918 225313797 225654030 225447311 224412651
1861.3B24412651j616917j781311m11644N88475J018715P29675J167240p4253k891560
$$ 224412651 222795734 221014423 220602779 221191254 222209969 222939644 224106884 224032631 221141071
1869.9B21141071l25470l66020q34198k00252m97685R0218J025428J038456M36001
$$ 221141071 220815601 220449581 219615383 219415131 218917446 219007664 220033092 221071548 221507549
1878.6B21507549k73075j256809j000366j034775j144066k77920m9781N93357J102352
$$ 221507549 221234474 219977665 218977299 217942524 216798458 216520538 216470757 217064114 218166466
1887.3B18166466J780338o313k943726l45020k08130j052494j31359P00874M25148
$$ 218166466 219946804 219940491 216996765 216651745 216443615 215391121 215259762 215960636 216385784
1896B16385784L12691O26545m05197q41637p84283j026535j601524j050224L15590
$$ 216385784 216698475 217325020 216919823 216078186 215293903 214267368 212665844 211615620 211931210
1904.7B11931210Q36753J408234O87141k79998o01006j307316j109066o81076k56042
$$ 211931210 212767963 214176197 214863338 214583340 213982334 212675018 211565952 210884876 210628834
1913.3B10628834K80533k0523J212196K306270j708068k276078J96095n97382j41430
$$ 210628834 210909367 210888844 212101040 214407310 212699242 210423164 210619259 210021877 209880447
1922B09880447j830711q55007J856994J085511O34327J68152k47136j110210j504250
$$ 209880447 208049736 207194729 209051723 210137234 210771561 210939713 210692577 209582367 208078117
1930.7B08078117o73694k31819j62106J27716M58470M03938L38821l81985n78269m17309
$$ 208078117 207404423 207172604 207010498 207138214 207596684 208000622 208339443 207957458 207379189 206961880
1940.3B06961880j24798r28822j749820Q51307J027202Q01544K55394m33521m04243
$$ 206961880 206837082 205908260 204158440 205009747 206036949 206838493 207093887 206660366 206256123
1949B06256123j424790j063232r35078m91123L84159P80754Q29296j56135r0485m15993
$$ 206256123 204831333 203768101 202833023 202341900 202726059 203506813 204336109 204179974 204089489 203673496
1958.7B03673496j3504m28295j534767j79482K89822R9468L18375P87544j49269j175137
$$ 203673496 203659992 203231697 201696930 201517448 201807270 201906738 202225113 203012657 202863388 201688251
1968.3B01688251o49127q31147o27746o49014j63402P99789N86662m5375L15017J54076
$$ 201688251 201039124 200207977 199580231 198931217 198767815 199567604 200154266 200108891 200423908 200577984
1978B00577984j262055j310253q48312l47977Q0910P20558Q16383K91863L31936o68469
$$ 200577984 199315929 198005676 197157364 196809387 196890297 197610855 198427238 198719101 199051037 198382568
1987.6A98382568j034240j008091J5049N10273j074200K11029P83176M91581P06807
$$ 198382568 197348328 196340237 196355286 196865559 195791359 196002388 196785564 197277145 197983952
1996.3A97983952j66359j139279j328602q62980q72325m82159j41354M19731R91936
$$ 197983952 197817593 196678314 195349712 194486732 193614407 193132248 192990894 193410625 194402561
2005A94402561P03297J13926q06103o02016l42026n48954m69418J85414M64248J48125
$$ 194402561 195105858 195219784 194413681 193811665 193469639 192920685 192451267 192636681 193100929 193249054
2014.6A93249054O11153L39908m28219j408004j440277k18163J25027K35080J03951
$$ 193249054 193860207 194200115 193771896 192363892 190923615 190705452 190830479 191065559 191169510
2023.3A91169510P4749M73690O67286m0417o46095j010399r25407j79520l06263M38538
$$ 191169510 191244259 191717949 192385235 192344818 191698723 190688324 189762917 189583397 189277134 189715672
2032.9A89715672N42526K77614N43499k47440m84104j159096p99694N6877j09119L78303
$$ 189715672 190258198 190535812 191079311 190831871 190347767 189188671 188388977 188445854 188336735 188715038
2042.6A88715038M64630O5003j96095o7882m25263n92479o48156o97116q0529J93348
$$ 188715038 189179668 189244671 189048576 188980694 188555431 187962952 187314796 186617680 186537151 186730499
2052.2A86730499N75085O87580N93872j16329p90806p55901m81873j95312l98484K32888
$$ 186730499 187305584 187993164 188587036 188470707 187679901 186924000 186442127 186246815 185848331 186081219
2061.9A86081219J35917K21100O15635J4324l30867j022778m49123l20092l78227K58427
$$ 186081219 186217136 186438236 187053871 187068195 186737328 185714550 185265427 184945335 184567108 184825535
2071.5A84825535L5744J93271l8719R7847J42174k26403o53533j027833o10256m6272
$$ 184825535 184861279 185054550 185015831 185113678 185255852 185029449 184375916 183348083 182737827 182691555
2081.1A82691555P69997Q43429L58830j04294K04544k98481r72023k11735p42912j19820
$$ 182691555 183461552 184304981 184663811 184559517 184764061 184465580 183493557 183281822 182538910 182419090
2090.8A82419090N29881R9716J61648J1520J6880q47950o47278j39217k60506j83239
$$ 182419090 182948971 183048687 183210335 183221855 183238735 182390785 181743507 181604290 181343784 181160545
2100.4A81160545J15300P68585L42121Q3389k61707m21486l23448l87402o18248o31180
$$ 181160545 181275845 182044430 182386551 182469940 182208233 181786747 181463299 181075897 180457649 179826469
2110.1A79826469L96290K8973M32453P52811m18586l23677k70043m52232m83303M4403
$$ 179826469 180222759 180251732 180684185 181436996 181018410 180694733 180424690 179972458 179489155 179533558
2119.7A79533558L10173N17673L74394l32451j92051l68462l1375j73779o16798o26564
$$ 179533558 179843731 180361404 180735798 180403347 180211296 179842834 179811459 179637680 179020882 178394318
2129.4A78394318k49863J057491P15637j2054J2093J00116l20186p00970k18220j88141
$$ 178394318 178144455 179201946 179917583 179905529 179917622 180017738 179697552 178996582 178778362 178590221
2139A78590221J1998L93562N06687J36738j13812l67603l76663l32966j220474m65450
$$ 178590221 178602219 178995781 179502468 179639206 179525394 179157791 178781128 178448162 177227688 176762238
2148.6A76762238M52880L22342J79844J38340N03865L61156K5654o73504m37279j47114
$$ 176762238 177215118 177537460 177717304 177855644 178359509 178720665 178746319 178072815 177635536 177488422
2158.3A77488422l26576K48432K44561l4752m0379O53439J26819r47799r66111o14071
$$ 177488422 177161846 177410278 177654839 177620087 177579708 178233147 178359966 177412167 176446056 175831985
2167.9A75831985M36993K96040J55086L41301J8215R1172o0940l43361n78003o51646
$$ 175831985 176268978 176565018 176720104 177061405 177079620 177170792 177109852 176766491 176188488 175536842
2177.6A75536842m92553M55055J021862Q08449n7659q69198k21081j80912m64859o92234
$$ 175536842 175044289 175499344 176521206 177329655 177271996 176402798 176181717 176000805 175535946 174843712
2187.2A74843712k66991N56011O77224N69515j46771K11411Q5964n24177o84166q38490
$$ 174843712 174576721 175132732 175809956 176379471 176232700 176444111 176530075 176005898 175321732 174483242
2196.9A74483242J98498O60667M59843k84882j41105O72435K01397k53677p94792j052895
$$ 174483242 174681740 175342407 175802250 175517368 175376263 176048698 176250095 175996418 175201626 174148731
2206.5A74148731n38845K83375K54478M15497N01919k53277j182R3021O7387o12107
$$ 174148731 173609886 173893261 174147739 174563236 175065155 174811878 174810696 174903717 174971104 174358997
2216.1A74358997r15146j19514L54156O59028l4714J09711K11105l97129o53439n41286
$$ 174358997 173443851 173324337 173678493 174337521 174302807 174412518 174623623 174226494 173573055 173031769
2225.8A73031769K75535J47629Q0528J23806o1092p5073r3193k27013k66876J97887
$$ 173031769 173307304 173454933 173535461 173659267 173598175 173523102 173429909 173202896 172936020 173133907
2235.4A73133907m31556m54789M08116Q39252J22147o99787L34110P5569n43613n14412
$$ 173133907 172702351 172247562 172655678 173494930 173617077 172917290 173251400 173326969 172783356 172268944
2245.1A72268944l56255J97201J3981j51806N9662R69772O36292o0292l28521r18236
$$ 172268944 171912689 172109890 172123871 171972065 172031727 173001499 173637791 173577499 173248978 172330742
2254.7A72330742m33979m50630j08185L40042K99454M24862M5566L6125l66649q31814
$$ 172330742 171896763 171446133 171337948 171677990 171977444 172402306 172447872 172483997 172117348 171285534
2264.4A71285534l07026O10390L17783k86446q1882J41602P50198J29242m32549j13430
$$ 171285534 170978508 171588898 171906681 171620235 171538353 171679955 172430153 172559395 172126846 172013416
2274A72013416m83341m02641J58882N57842K36569k2412R2831j86348l02773j92489
$$ 172013416 171530075 171127434 171286316 171844158 172080727 172058315 172151146 171964798 171662025 171469536
2283.7A71469536k30999l63636k22569k8610K66152O37035K65922O1760p0114o75926
$$ 171469536 171238537 170874901 170652332 170623722 170889874 171526909 171792831 171854591 171784477 171108551
2293.3A71108551l70331q4495J43623J25542l59631P49779L47671k83680K19880n80502
$$ 171108551 170738220 170653725 170797348 170922890 170563259 171313038 171660709 171377029 171596909 171016407
2302.9A71016407l73230n77259o98395k75554K91290P77664l0003M16584L51220J38130
$$ 171016407 170643177 170065918 169367523 169091969 169383259 170160923 170130920 170547504 170898724 171036854
2312.6A71036854k58999j248283r77784l5858J403141J23749q59890J01528J488609
$$ 171036854 170777855 169529572 168551788 168515930 169919071 170042820 169182930 169284458 170773067
2321.3A70773067P37706j633606j144371r31454M74224o3496k73666M96616k93083
$$ 170773067 171510773 169877167 168732796 167801342 168275566 168212070 167938404 168435020 168141937
2329.9A68141937J536675n71976j123409n55096j80263J32312j817093O00396J29871
$$ 168141937 169678612 169106636 167983227 167428131 167247868 167380180 165563087 166163483 166293354
2338.6A66293354j75991R84898O32820n92385j031093M3812j956520J112098K889614
$$ 166293354 166117363 167102261 167735081 167142696 166111603 166155415 164198895 165310993 168200607
2347.3A68200607J855164J081867m93107j05018l29419L95031p33985m351273q44688
$$ 168200607 170055771 171137638 170644531 170539513 170210094 170605125 169871140 165519867 164675179
2356A64675179K201137L67374j041069o91852j927528j396389K33249J054058Q29029
$$ 164675179 166876316 167243690 166202621 165510769 163583241 162186852 162420101 163474159 164303188
2364.7A64303188J304531J528321r73320N45673J8177k93522J054592p2651n95359
$$ 164303188 165607719 167136040 166162720 166708393 166726570 166433048 167487640 167414989 166819630
2373.3A66819630r16691N33485N24330J60180Q77590P78045O36654k06432k42901k1572
$$ 166819630 165902939 166436424 166960754 167120934 167998524 168776569 169413223 169206791 168963890 168942318
2383A68942318O1455k40498l85628N67322P13673K97088R7847Q4458o26335q77514
$$ 168942318 169003773 168763275 168377647 168944969 169658642 169955730 170053577 170138035 169511700 168634186
2392.6A68634186k72370j2989L89328M66576N85995L61461Q4820j77479n41439n29728
$$ 168634186 168361816 168348827 168738155 169204731 169790726 170152187 170237007 170059528 169518089 168988361
2402.3A68988361m86145M7188P7362M4422M08287L62893m14525l44581L25889m17671
$$ 168988361 168502216 168549404 168626766 168671188 169079475 169442368 169027843 168683262 169009151 168591480
2411.9A68591480l30600k05517k64015J82533N40333O56013r5138P514k26726m42696
$$ 168591480 168260880 168055363 167791348 167973881 168514214 169170227 169075089 169082603 168855877 168413181
2421.6A68413181m18930j3771P89185r4471J1806m9743l46032j33743o10618k19231
$$ 168413181 167994251 167980480 168769665 168675194 168687000 168637257 168291225 168157482 167546864 167327633
2431.2A67327633k8324N9757J17531L72333O76003L10001k26307l73420K25906J40190
$$ 167327633 167299309 167359066 167476597 167848930 168524933 168834934 168608627 168235207 168461113 168601303
2440.8A68601303L6583l51124j045418m97245P62062P16419k76527M00466K68631p39231
$$ 168601303 168637886 168286762 167241344 166744099 167506161 168222580 167946053 168346519 168615150 167875919
2450.5A67875919o85329j53694k7733l48759O03867P28168N7011m2877j96286k14500
$$ 167875919 167190590 167036896 167009163 166660404 167264271 167992439 168049450 168006573 167810287 167595787
2460.1A67595787k20547l32985n87101J431K47745L10269P09514O65665o3763r72175
$$ 167595787 167375240 167042255 166455154 166456585 166704330 167014599 167724113 168389778 168326015 167353840
2469.8A67353840l93257l08914k84710M1961K07882N34935r193J7261k35195j37462
$$ 167353840 166960583 166651669 166366959 166408920 166616802 167151737 167142544 167159805 166924610 166787148
2479.4A66787148j61229m09145L05080j38092n4645M04606J55887j69334j30978o1817
$$ 166787148 166625919 166216774 166521854 166383762 166329117 166733723 166889610 166720276 166589298 166527481
2489.1A66527481k78416k85320m79755K62794J80702O8016P28035K26002J73874k6398
$$ 166527481 166249065 165963745 165483990 165746784 165927486 165995502 166723537 166949539 167123413 167097015
2498.7A67097015m80785o34670k06070k3632P782O24428K20966N7487K29454o6452
$$ 167097015 166616230 165981560 165775490 165751858 165759640 166384068 166605034 166662521 166891975 166825523
2508.3A66825523q73565n08118K73495n82123l06854M52346P12796L07693J59798O00014
$$ 166825523 165951958 165443840 165717335 165135212 164828358 165280704 165993500 166301193 166460991 167061005
2518A67061005j0052o87275j150684n227N44873n04990Q9836J109562O47545p28722
$$ 167061005 167050953 166363678 165212994 165207767 165752640 165247650 165337486 166447048 167094593 166365871
2527.6A66365871r37061o81343n70545k72522O5422P35340R72920O06021k83985k04983
$$ 166365871 165428810 164747467 164176922 163904400 163969822 164705162 165678082 166284103 166000118 165795135
2537.3A65795135j68800r22603q59395j41029O41155K67392J03321L38020R8209j48182
$$ 165795135 165626335 164703732 163844337 163703308 164344463 164611855 164715176 165053196 165151405 165003223
2546.9A65003223p25364m59748L39261j06240l73935P78522K90337q64582l93792K71073
$$ 165003223 164277859 163818111 164157372 164051132 163677197 164455719 164746056 163881474 163487682 163758755
2556.6A63758755O5174j134358k77176R95179J27315l91216J33152M83723L19862K36874
$$ 163758755 163823929 162689571 162412395 163407574 163534889 163143673 163276825 163760548 164080410 164317284
2566.2A64317284q07476n95303J17798p23572m09412j19038K76604P61356L32928m21162
$$ 164317284 163509808 162914505 163032303 162308731 161899319 161780281 162056885 162818241 163151169 162730007
2575.9A62730007m19369O17562J1539o45580o0501N4855J92852O53324K71397l50342
$$ 162730007 162310638 162928200 162939739 162294159 162233658 162288513 162481365 163134689 163406086 163055744
2585.5A63055744l45421l58848m8638k55813j36700q4247k32087O29101J50108p3261
$$ 163055744 162710323 162351475 162302837 162047024 161910324 161826077 161593990 162223091 162373199 162299938
2595.1A62299938M24881K96841l67890r02671k26632n5599K50569L10592l92933k32677
$$ 162299938 162724819 163021660 162653770 161751099 161524467 161468868 161719437 162030029 161637096 161404419
2604.8A61404419q6384l91617Q4267O88305k05364p90959l09810P07664J008186J40477
$$ 161404419 161318035 160926418 161010685 161698990 161493626 160702667 160392857 161100521 162108707 162249184
2614.4A62249184j62239n28450n31121l8223N10426J10035r12743k62280K90146n035
$$ 162249184 162086945 161558495 161027374 160989151 161499577 161609612 160696869 160434589 160724735 160719700
2624.1A60719700M6863L33615K861j04599o9866o59657k03571M17366N18131o2942
$$ 160719700 160766563 161100178 161103039 160998440 160928574 160268917 160065346 160482712 161000843 160937901
2633.7A60937901l29628K55165k96288r43346o53458p6999K42176P23085N84831J77136
$$ 160937901 160608273 160863438 160567150 159623804 158970346 158893347 159135523 159858608 160443439 160620575
2643.4A60620575J48354k34280O7520p98855j172352N41926N86948m76036j68037J065626
$$ 160620575 160768929 160534649 160602169 159803314 158630962 159172888 159759836 159283800 159115763 160181389
2653A60181389O79474m41361m34150l98865n63574k18945o1616Q5105O60830J82133
$$ 160181389 160860863 160419502 159985352 159586487 159022913 158803968 158742352 158827457 159488287 159670420
2662.6A59670420J1339l37019n17225L90319r1323k62766k27576j4143L36771j92155
$$ 159670420 159681759 159344740 158827515 159217834 159126511 158863745 158636169 158622026 158958797 158766642
2672.3A58766642P0791J39599k71864o63424l93781O1578K2497K13166J73149o9456
$$ 158766642 158837433 158977032 158705168 158041744 157647963 157709541 157732038 157945204 158118353 158048897
2681.9A58048897k21129J26267K0428O8569o771q31633l01447J46122j53542k10714
$$ 158048897 157827768 157954035 157974463 158043032 158036261 157204628 156903181 157049303 156895761 156685047
2691.6A56685047K58455M76494J33457M4070k96717o69222q75845J12686M90389p32116
$$ 156685047 156943502 157419996 157553453 157597523 157300806 156631584 155755739 155868425 156358814 155626698
2701.2A55626698N1050J102829o1865m79965l95003r74331K06633K37923o71559P1793
$$ 155626698 155677748 156780577 156718712 156238747 155843744 154869413 155076046 155313969 154642410 154714203
2710.9A54714203n2004O8522K59714J45578K1544r2059K52810K64644K06585n06992
$$ 154714203 154662199 154730721 154990435 155136013 155157557 155065498 155318308 155582952 155789537 155282545
2720.5A55282545l67880K61698L04384N7364l51610n26057q28666L39899M63171o2275
$$ 155282545 154914665 155176363 155480747 155538111 155186501 154660444 153831778 154171677 154634848 154572573
2730.2A54572573k394n44291k7694j28594L01085M82540n70059o24847J91040P70540
$$ 154572573 154570179 154025888 153998194 153869600 154170685 154653225 154083166 153458319 153649359 154419899
2739.8A54419899J5736k1124j94636m48169n58100o39448L27253K05898M17424K12974
$$ 154419899 154435635 154414511 154219875 153771706 153213606 152574158 152901411 153107309 153524733 153737707
2749.4A53737707m37288k5664K17362M1161l90530j63403n63793n36346N0430J72052
$$ 153737707 153300419 153274755 153492117 153533278 153142748 152979345 152415552 151879206 151929636 152101688
2759.1A52101688M44899J31292L2254k91434n88970l00655L52153j51720j044044K45094
$$ 152101688 152546587 152677879 152710133 152418699 151829729 151529074 151881227 151729507 150685463 150930557
2768.7A50930557P98846J19123j56603l01418o39610q5764L23686l47414K3041r0532
$$ 150930557 151729403 151848526 151691923 151390505 150750895 150665131 150988817 150641403 150664444 150573912
2778.4A50573912N4779O61821O01368K42205l86582m70752j059981l92055M49180J86548
$$ 150573912 150628691 151290512 151891880 152134085 151747503 151276751 150216770 149824715 150273895 150460443
2788A50460443N05877O304n64318l56293K24266J31531n49755n69916M49591Q64239
$$ 150460443 150966320 150972624 150408306 150052013 150276279 150407810 149858055 149288139 149737730 150601969
2797.7A50601969j34411n24531k75735K25486k55661k96869j00298q00924O3286N44939
$$ 150601969 150467558 149943027 149667292 149892778 149637117 149340248 149239950 148439026 148502312 149047251
2807.3A49047251N31196J55278k83699m9696l16801m73919n26143K99750M35085k2631
$$ 149047251 149578447 149733725 149450026 149400330 149083529 148609610 148083467 148383217 148818302 148795671
2816.9A48795671j5993J70641N17092L0212j11932m45175q50993q28371J71137K88191
$$ 148795671 148779678 148950319 149467411 149497623 149385691 148940516 148089523 147261152 147432289 147720480
2826.6A47720480o93102K15368O70367J165714K05898r74550l56484m76160L03107
$$ 147720480 147027378 147242746 147913113 149078827 149284725 148310175 147953691 147477531 147780638
2835.3A47780638N2633p1325O01225O27374j9693r55057k91748p25165p77445R0886
$$ 147780638 147833271 147761946 148363171 148990545 148970852 148015795 147724047 146998882 146221437 146312323
2844.9A46312323L52659J16787N1546O63109k68412n63707m95644k20184j36662j80473
$$ 146312323 146664982 146781769 146833315 147496424 147228012 146664305 146168661 145948477 145811815 145631342
2854.6A45631342P72285K07444R5472m5767j00841m95100j067114l41425j62726P83863
$$ 145631342 146403627 146611071 146706543 146660776 146559935 146064835 144997721 144656296 144493570 145277433
2864.2A45277433N65577r9278Q3056L05462J82648p64647m29602o38656n83954l9921
$$ 145277433 145843010 145743732 145826788 146132250 146314898 145550251 145120649 144481993 143898039 143858118
2873.8A43858118J86882J48344q3732R10825j18236j079035l25136j28136K23742M91676
$$ 143858118 144045000 144193344 144109612 145020437 144902201 143823166 143498030 143369894 143593636 144085312
2883.5A44085312J31197l24946q7642k43798j64365j08233K56558M39663p89538k89631
$$ 144085312 144216509 143891563 143803921 143560123 143395758 143287525 143544083 143983746 143194208 142904577
2893.1A42904577M78964K12698J23310Q40931P14054o13870m84057n24616j82552J61619
$$ 142904577 143383541 143596239 143719549 144560480 145274534 144660664 144176607 143651991 143469439 143631058
2902.8A43631058m57402m25252M59680N03483o15664k63357N3473L98187J0968j129589
$$ 143631058 143173656 142748404 143208084 143711567 143095903 142832546 142886019 143284206 143295174 142165585
2912.4A42165585q00839n16701L63922O44541M86393q8215m89778M57172m2658n97591
$$ 142165585 141364746 140848045 141211967 141856508 142342901 142254686 141764908 142222080 142179422 141581831
2922.1A41581831l95250J69010j64490o33955j26409l13712P7248j28651n48753l22361
$$ 141581831 141186581 141355591 141191101 140557146 140430737 140117025 140194273 140065622 139516869 139194508
2931.7A39194508k46344O24876Q88844l91922o89421K83394L08504K11220l9616m56057
$$ 139194508 138948164 139573040 140461884 140069962 139380541 139663935 139972439 140183659 140144043 139687986
2941.3A39687986l78494m835P3271m69542k64101L08886J060648K33707j272621r73072
$$ 139687986 139309492 139304657 139377928 138908386 138644285 138953171 140013819 140247526 138974905 138001833
2951A38001833j97516M64125k07414k57493J97831N359j354l80688k12507o22730q31280
$$ 138001833 137804317 138268442 138061028 137803535 138001366 138006725 138005371 137624683 137412176 136789446 135958166
2961.6A35958166k00701M01335M72469J94960j24340p51724o5184j14965o46410n23920
$$ 135958166 135757465 136158800 136631269 136826229 136701889 135950165 135884981 135770016 135123606 134599686
2971.2A34599686p0057K34470o26287K62012R96275K2888j060972q79755J37987Q8120
$$ 134599686 134529629 134764099 134137812 134399824 135396099 135418987 134358015 133478260 133616247 133704367
2980.9A33704367J30176n21049m67215K08922K82545p4349n66997L0718j97640j72281
$$ 133704367 133834543 133313494 132846279 133055201 133337746 133263397 132696400 132727118 132529478 132357197
2990.5A32357197p5665K35501M29372l55882J70488R8162j88589p04041n38416K60439
$$ 132357197 132281532 132517033 132946405 132590523 132761011 132859173 132670584 131966543 131428127 131688566
3000.2A31688566l76920m93784j14432N88198k49758m31595R06754P0934o11219j04523
$$ 131688566 131311646 130817862 130703430 131291628 131041870 130610275 131517029 131587963 130976744 130872221
3009.8A30872221j02558o50120j23501K69270M09727J74170n20249P5074n58539o60858
$$ 130872221 130769663 130119543 129996042 130265312 130675039 130849209 130328960 130404034 129845495 129184637
3019.5A29184637p1258J12600L56016J88484P71904r9945q43487m24509k57559j79624
$$ 129184637 129113379 129225979 129581995 129770479 130542383 130442438 129598951 129174442 128916883 128737259
3029.1A28737259k3670l7489n86500N55877J099196K58713r74036r75876M79298J27392
$$ 128737259 128713589 128676100 128089600 128645477 129744673 130003386 129029350 128053474 128532772 128660164
3038.7A28660164o0139q9655o4096m0007K775K08760l69912L21761k63930o99863K25630
$$ 128660164 128600025 128510370 128446274 128406267 128409042 128617802 128247890 128569651 128305721 127605858 127831488
3049.4A27831488j93501l84979J10826O47240Q1186k36482n37663q75377j59817N50480
$$ 127831488 127637987 127253008 127363834 128011074 128092260 127855778 127318115 126442738 126282921 126833401
3059A26833401O90717m52156l80582K01683R4013j2503q945M81243l41129n39752K21568
$$ 126833401 127524118 127071962 126691380 126893063 126987076 126974573 126965628 127446871 127105742 126565990 126787558
3069.6A26787558j71433n94644N77240J140232o53687j308184l94392N45950P04422
$$ 126787558 126616125 126021481 126598721 127738953 127085266 125777082 125382690 125928640 126633062
3078.3A26633062L95899j09539m57268N6954j53074l75691o21643l27711L34263k16665
$$ 126633062 127028961 126919422 126462154 126519108 126366034 125990343 125368700 125040989 125375252 125158587
3087.9A25158587o32773l41740N53036K20833m5128L90215m75883o92435k56672L0442
$$ 125158587 124525814 124184074 124737110 124957943 124912815 125303030 124827147 124134712 123878040 123908482
3097.6A23908482J95188K84262K33850m21810o92806J33037Q18730l7575o44846m330
$$ 123908482 124103670 124387932 124621782 124199972 123507166 123640203 124458933 124421358 123776512 123772182
3107.2A23772182j17502k64101L57170k48089k55718J68324l91951O6309p5140J65863
$$ 123772182 123654680 123390579 123747749 123499660 123243942 123412266 123020315 123086624 123011484 123177347
3116.9A23177347K78244n82580l05786j89991L49273J0281m53606o2933l03402r4871
$$ 123177347 123455591 122873011 122567225 122377234 122726507 122736788 122283182 122220249 121916847 121821976
3126.5A21821976m46358m39024L32069P31125J55707k51789J22041j89390j48735J44634
$$ 121821976 121375618 120936594 121268663 121999788 122155495 121903706 122025747 121836357 121687622 121832256
3136.1A21832256J56803n56955L24N95217m11692J58263k71826j076355o02760J95150
$$ 121832256 121989059 121432104 121432428 122027645 121615953 121774216 121502390 120426035 119823275 120018425
3145.8A20018425Q86030J41211p37791q21076J012450J256856n49173q68263q19454
$$ 120018425 120904455 121045666 120307875 119486799 120499249 121756105 121206932 120338669 119519215
3154.5A19519215K86722K74839q50439J56126P38192K4090N4636l81937o12975L77465
$$ 119519215 119805937 120080776 119230337 119386463 120124655 120148745 120203381 119821444 119208469 119585934
3164.1A19585934k13967o17952L24926K98081l34263l23887Q8472J42899K0275m17757
$$ 119585934 119371967 118754015 119078941 119377022 119042759 118718872 118807344 118950243 118970518 118552761
3173.8A18552761l81231o50721n69172O78673R16338L73087m77114l73602K53649J76907
$$ 118552761 118171530 117520809 116951637 117630310 118546648 118919735 118442621 118069019 118322668 118499575
3183.4A18499575m25711o57635k03619p29170K1325O38580k96431q1196M72966n293
$$ 118499575 118073864 117416229 117212610 116483440 116504765 117143345 116846914 116765718 117238684 117233391
3193A17233391r85766l99332J55182J5259l95699p87906J764K14148M04930J98259
$$ 117233391 116247625 115848293 116003475 116018734 115623035 114835129 114836893 115051041 115455971 115654230
3202.7A15654230k24981k40488j92747J51567j79758l27206l38964o5270l2634l7852
$$ 115654230 115429249 115188761 114996014 115147581 114967823 114640617 114301653 114236383 114203749 114165897
3212.3A14165897l00340r42345N41277P33757k35252k14024l34492p1029l9654J82600
$$ 114165897 113865557 112923212 113464489 114198246 113962994 113748970 113414478 113343449 113303795 113486395
3222A13486395J85356n75914j057482q36010O380Q07800P15838j00346p33013l11670
$$ 113486395 113671751 113095837 112038355 111202345 111208725 112016525 112732363 112632017 111899004 111587334
3231.6A11587334M85449J04665K14501k14138j135960k48413N38654O65427l62730
$$ 111587334 112072783 112177448 112391949 112177811 111041851 110793438 111332092 111997519 111634789
3240.3A11634789o89421J73559J62249k03162l39317m6387m09917k43245J76792L43075
$$ 111634789 110945368 111118927 111281176 111078014 110738697 110692310 110282393 110039148 110215940 110559015
3249.9A10559015n3119J29280J042394o06956o87599n00870o88067K88039n67913N2757
$$ 110559015 110505896 110635176 111677570 111070614 110383015 109882145 109194078 109482117 108914204 108966961
3259.6A08966961M15058j93214r76353j096754O36892Q90532N77221j76192o32515
$$ 108966961 109382019 109188805 108212452 107115698 107752590 108643122 109220343 109044151 108411636
3268.3A08411636o17828N44291J280107p75490j186075p62062K44017L48424j22671
$$ 108411636 107793808 108338099 109618206 108842716 107656641 106894579 107138596 107487020 107364349
3276.9A07364349J063290Q7748n90430o81038p55958j13058k60983J277399J508265
$$ 107364349 108427639 108515387 107924957 107243919 106487961 106374903 106113920 107391319 108899584
3285.6A08899584r28021r82828k47440k60849N38330J69449n57690k20985K50473J95131
$$ 108899584 107971563 106988735 106741295 106480446 107018776 107188225 106630535 106409550 106660023 106855154
3295.3A06855154p13444p46851n04474n10168K50520M97933l68605l54690L70340O9580
$$ 106855154 106141710 105394859 104890385 104380217 104630737 105128670 104760065 104405375 104775715 104845295
3304.9A04845295j69125J47906Q28018J16033q12702o67886n62478Q50583R8114j106711
$$ 104845295 104676170 104824076 105652094 105768127 104955425 104287539 103725061 104575644 104673758 103567047
3314.6A03567047p40080p54061J157933J708870m16889j674929n48086P85970K96965
$$ 103567047 102826967 102072906 103230839 104939709 104522820 102847891 102299805 103085775 103382740
3323.2A03382740p20119m40112Q52757k19917j114493l48720l27969Q1692R96790N77802
$$ 103382740 102662621 102222509 103075266 102855349 101740856 101392136 101064167 101145859 102142649 102720451
3332.9A02720451j139326r98211k8619J64966N8012Q8768K4100l16954K07186k65046
$$ 102720451 101581125 100582914 100554295 100719261 100777273 100866041 100890141 100573187 100780373 100515327
3342.5A00515327L60671M19855j205950l66907l41921m12645L64008q2360k81601L24288
$$ 100515327 100875998 101295853 100089903 99722996 99381075 98968430 99332438 99250078 98968477 99292765
3352.2I9292765j50757m97503L05299j086158r20716O06327K38562p3757n71757k81200
$$ 99292765 99142008 98644505 98949804 97863646 96942930 97549257 97787819 97714062 97142305 96861105
3361.8I6861105K19965L99437j40419n32580K3060P8287q115l82548n08794m49973
$$ 96861105 97081070 97480507 97340088 96807508 96830568 96908855 96900740 96518192 96009398 95559425
3371.4I5559425K74287l2406p23057J73473k4061k08015j29824l53928q44221l53470
$$ 95559425 95833712 95801306 95078249 95251722 95227661 95019646 94889822 94535894 93691673 93338203
3381.1I3338203P81308N47456k0713j189967k11629Q3990o24829J103487N03969n16996
$$ 93338203 94119511 94666967 94646254 93456287 93244658 93328648 92703819 93807306 94311275 93794279
3390.7I3794279n91698l20606R98268K78941p44973n12075p84846o39162Q55914P66782
$$ 93794279 93202581 92881975 93880243 94159184 93414211 92902136 92117290 91478128 92334042 93100824
3400.4I3100824m15506m87623k25668M6310N70116M33865o46458q29992k60019L14769
$$ 93100824 92685318 92197695 91972027 92018337 92588453 93022318 92375860 91545868 91285849 91600618
3410I1600618M78793N66730n43880j617699J6985K20337K23589L23925l77302N52225
$$ 91600618 92079411 92646141 92102261 90484562 90501547 90721884 90945473 91269398 90892096 91444321
3419.7I1444321M55656p00455j292429m11377K07291L67546P8659j007700N84125N88999
$$ 91444321 91899977 91199522 89907093 89495716 89703007 90070553 90149212 89141512 89725637 90314636
3429.3I0314636j097126n31263N97401K79464q50820m75064M08497R99184l49608q73155
$$ 90314636 89217510 88686247 89283648 89563112 88712292 88237228 88645725 89644909 89295301 88422146
3439H8422146K38733k46725M5033M08840K05888O6557K52686q20999j932736N59245
$$ 88422146 88660879 88414154 88459187 88868027 89073915 89140472 89393158 88572159 86639423 87198668
3448.6H7198668J039485k74086n99279L07560J86834k00863O45648j81876o80170m69589
$$ 87198668 88238153 87964067 87364788 87672348 87859182 87658319 88303967 88122091 87441921 86972332
3458.2H6972332j86462L32107N39417M11034L66707P49922n90124j329871j217146
$$ 86972332 86785870 87117977 87657394 88068428 88435135 89185057 88594933 87265062 86047916
3466.9H6047916k43101J358757Q80394Q48656Q4419j488390n64489O28061k91815J13640
$$ 86047916 85804815 87163572 88043966 88892622 88977041 87488651 86924162 87552223 87260408 87374048
3476.6H7374048J263600K25782l15323m68893k30789l70684o19240P83387R97314M85058
$$ 87374048 88637648 88863430 88548107 88079214 87848425 87477741 86858501 87641888 88639202 89124260
3486.2H9124260p79476j875124m92211P09782l9253n15223l4160J32780M52127M59271
$$ 89124260 88344784 86469660 85977449 86687231 86647978 86132755 86098595 86231375 86683502 87142773
3495.8H7142773M63314N20849j52693m64144J99976M063n50632L80983o2447O6862
$$ 87142773 87606087 88126936 87974243 87510099 87710075 87714138 87163506 87544489 87482042 87548904
3505.5H7548904J06287m91638l33853r97209J169310J358470r12532j38731O49252
$$ 87548904 87655191 87163553 86829700 85832491 87001801 88360271 87447739 87309008 87958260
3514.2H7958260l16954p22027N07555K39897o8684J90029J54791j60112j578455k25859
$$ 87958260 87641306 86919279 87426834 87666731 87598047 87788076 87942867 87782755 86204300 85978441
3523.8H5978441N40467L3149J17016J9369M30050l54395Q6041L85904K5396j32751
$$ 85978441 86518908 86552057 86669073 86688442 87118492 86764097 86850138 87236042 87261438 87128687
3533.5H7128687K35157L68833q80279k35796K30131K56920K29092j34688L12939L82786
$$ 87128687 87363844 87732677 86852398 86616602 86846733 87103653 87332745 87198057 87510996 87893782
3543.1H7893782l53852j536264L98426N3368j014052J087494M36029J061945L73517
$$ 87893782 87539930 86003666 86402092 86455460 85441408 86528902 86964931 88026876 88400393
3551.8H8400393j421452K99177M71649J45054k00643J04618O32400j73750o58779m0235
$$ 88400393 86978941 87278118 87749767 87894821 87694178 87798796 88431196 88257446 87598667 87558432
3561.4H7558432J87444m29144R12610R44910j141377j035881j947260k48394K051792
$$ 87558432 87745876 87316732 88229342 89174252 88032875 86996994 85049734 84801340 86853132
3570.1H6853132P75547n95951l60174Q86202L63111M17557n7096j266375R47275P62196
$$ 86853132 87628679 87032728 86672554 87558756 87921867 88339424 88282328 87015953 87963228 88725424
3579.7H8725424j98679l8824j099949j155644O70214J771622l55072j30377q74681
$$ 88725424 88526745 88487921 87387972 86232328 86902542 88674164 88319092 88188715 87314034
3588.4H7314034j401310J826200O00290j84469j119442Q66070J08690k360830J342726
$$ 87314034 85912724 87738924 88339214 88154745 87035303 87901373 88010063 85649233 86991959
3597.1H6991959m68245O31647J203413j088028K19746k1029J036539L13845o52609
$$ 86991959 86523714 87155361 88358774 87270746 87490492 87469463 88506002 88819847 88167238
3605.8H8167238j348486k15177J395759j595726K340193Q26559l469238K69089J192522
$$ 88167238 86818752 86603575 87999334 86403608 88743801 89570360 86101122 86370211 87562733
3614.5H7562733R43927J764870j386289k079583J60361k003603O80294J082201J01747
$$ 87562733 88506660 90271530 88885241 86805658 86966019 84962416 85642710 86724911 86826658
3623.1H6826658N73950p7505k46315K39696l01437p149386p08623O527328J235371
$$ 86826658 87400608 87323103 87076788 87316484 87015047 79865661 79157038 85684366 86919737
3631.8H6919737l24354k225476J12400J084261O58007J064520M158Q1034J2779M39978
$$ 86919737 86595383 84369907 84482307 85566568 86224575 87289095 87293253 87374287 87387066 87827044
3641.5H7827044n80006j80025J269283J373653n8479n492248j398821p5026l668136
$$ 87827044 87247038 87067013 88336296 89709949 89651470 84159222 82760401 82685375 79017239
3650.1G9017239L95021M375572L415995J33362m66585k228375n98831L121719n84602
$$ 79017239 79412260 83787832 87203827 87337189 86870604 84642229 84043398 87165117 86580515
3658.8H6580515j291628n46513J202212O32219o25439j99270j89667Q22611K26631
$$ 86580515 85288887 84742374 85944586 86576805 85951366 85752096 85562429 86385040 86611671
3667.5H6611671j366376j626435q91361m12245K170143J162062j908207n572419P06396
$$ 86611671 85245295 83618860 82727499 82315254 84485397 85647459 83739252 78166833 78873229
3676.2G8873229O430221P31659j670771j226645J010676Q41112o00081q16545o2761
$$ 78873229 85303450 86035109 84364338 83137693 84148369 84989481 84389400 83572855 83510094
3684.9H3510094J518526J731672q03070n561247J770210J563616n020909J723218K829504
$$ 83510094 85028620 86760292 85957222 80395975 82166185 83729801 78708892 80432110 83261614
3693.5H3261614J390180P10755r77249m68016n2004M76036J65825k144909j836376
$$ 83261614 84651794 85362549 84385300 83917284 83865280 84341316 84507141 82362232 80525856
3702.2H0525856K950878N58405j087789Q37106J57967R9850j538744j684275K378521
$$ 80525856 83476734 84035139 82947350 83784456 83942423 84042273 82503529 80819254 83197775
3710.9H3197775k165308m27961K930917N31035m48O47029o9398j750603m8666O39486
$$ 83197775 81032467 80604506 83535423 84066458 84066010 84713039 84643641 82893038 82844372 83483858
3720.5H3483858l14073j187869O25325P53431q97264k35196l74050P53193M58574M93269
$$ 83483858 83169785 81981916 82607241 83360672 82463408 82228212 81854162 82607355 83065929 83559198
3730.2H3559198O42462j269607o27289m18205j327525j077470J265173P00969R566
$$ 83559198 84201660 82932053 82304764 81886559 80559034 79481564 80746737 81447706 81457272
3738.9H1457272J403961J238069O08836l33701k358427j4937892O466170Q404154J35947
$$ 81457272 82861233 84099302 84708138 84374437 82016010 67078118 73544288 81948442 82084389
3747.5H2084389J22213r19599K301683m50077o406956L658877J760931q73766j166630
$$ 82084389 82206602 81287003 83588686 83138609 76731653 80390530 82151461 81277695 80111065
3756.2H0111065q90656J340561J079321L52097K97794K2869Q5325M32053j241188j817174
$$ 80111065 79220409 80560970 81640291 81992388 82290182 82313051 82398376 82830429 81589241 79772067
3765.9G9772067J122527J829205l06330m105096o33001K391944r5163K82131K46992
$$ 79772067 80894594 82723799 82417469 78312373 77679372 80071316 79976153 80258284 80505276
3774.5H0505276j45798O285P39584R42812j240530q27184J437821L41397k30303j084423
$$ 80505276 80359478 80365763 81105347 82048159 80807629 79980445 81418266 81759663 81529360 80444937
3784.2H0444937r69224N26500J12867l7174m31400K04277L4824l37563J36962R7466
$$ 80444937 79475713 80002213 80115080 80077906 79646506 79850783 79885607 79548044 79685006 79782472
3793.8G9782472J348643j135168l966279K142181L508010O48575j716375m972091j560264
$$ 79782472 81131115 79995947 76029668 78171849 81679859 82328434 80612059 75639968 74079704
3802.5G4079704M243956K238159O13747j488438l605876K545080J35284o17390P43985
$$ 74079704 78323660 80561819 81175566 79687128 76081252 78626332 78761616 78144226 78888211
3811.2G8888211O50182M11320k30198m80180l374100J383920M248037k43978k317653
$$ 78888211 79538393 79949713 79719515 79239335 75865235 77249155 81497192 81253214 78935561
3819.9G8935561l579793j497221L003822J517400K60573o6605j37634J9607N5733k55170
$$ 78935561 75355768 73858547 76862369 78379769 78640342 78573737 78436103 78455710 78511443 78256273
3829.5G8256273L73593r61972L4962K240186O14714j410713j566214p33734k460222
$$ 78256273 78629866 77667894 77702856 79943042 80557756 79147043 77580829 76847095 74386873
3838.2G4386873K850604J320186j639481R54142k49562j176586J181001J026616l10430
$$ 74386873 77237477 78557663 76918182 77872324 77622762 76446176 77627177 78653793 78343363
3846.9G8343363J94912L61514j71209m73990k166805l52059j819391n642757P947306
$$ 78343363 78538275 78899789 78728580 78254590 76087785 75735726 73916335 68273578 76220884
3855.6G6220884K174049n58911j96795N93853L35731j312842j440473J985612j327080
$$ 76220884 78394933 77836022 77639227 78233080 78568811 77255969 75815496 77801108 76474028
3864.2G6474028l795820L890267J646905L94625j478667n515184K446460K858139P99541
$$ 76474028 72678208 76568475 78215380 78610005 77131338 71616154 74062614 76920753 77720294
3872.9G7720294o84071j146097l8781m99263M54746J398429j371173m438019L679476
$$ 77720294 77036223 75890126 75851345 75352082 75806828 77205257 75834084 71396065 75075541
3881.6G5075541K284936l48086J65010j884599j636415K153492P96147R21273N09739
$$ 75075541 77360477 77012391 77177401 75292802 73656387 75809879 76606026 77527299 78037038
3890.3G8037038l255768j797757K251272P06525L46403m05054K52528k25673j742158
$$ 78037038 74781270 72983513 75234785 75941310 76287713 75882659 76135187 75909514 74167356
3898.9G4167356L30229J031294k49486Q9264L48668r29231l5058j19228N44744R69581
$$ 74167356 74497585 75528879 75279393 75368657 75717325 74788094 74753036 74633808 75178552 76148133
3908.6G6148133p46741l75767l28917k34423M35591K18081K66137n96270j227293l11494
$$ 76148133 75401392 75025625 74696708 74462285 74897876 75115957 75382094 74785824 73558531 73247037
3918.2G3247037J45287m99515P85632J139684K9497j76625m8161P14588j36533r0651
$$ 73247037 73392324 72892809 73678441 74818125 74847622 74670997 74622836 75337424 75200891 75110240
3927.9G5110240p12614j851978L98326J014351O4974o67581j30716M48408N65229J39713
$$ 75110240 74397626 72545648 72943974 73958325 74023299 73355718 73225002 73673410 74238639 74378352
3937.5G4378352j70765M97117n42450r06124j380892l68595J675492q5917k71506j01233
$$ 74378352 74207587 74704704 74162254 73256130 71875238 71506643 73182135 73096218 72824712 72723479
3947.2G2723479K90985J00403m25453R8577n80912k86102M53758M39987m96235r75575
$$ 72723479 73014464 73114867 72689414 72787991 72207079 71920977 72374735 72814722 72318487 71342912
3956.8G1342912l510Q76374N66197q17261n27840N05939N45797J02630l3741M20413
$$ 71342912 71339402 72215776 72781973 71964712 71436872 71942811 72488608 72591238 72557497 72977910
3966.5G2977910K39654o27594n24989K63305l20625m95143p67813j99280J139517M87118
$$ 72977910 73217564 72589970 72064981 72328286 72007661 71512518 70744705 70545425 71684942 72172060
3976.1G2172060n09071j030312K46635N64556q3986L05882L16906K81763q55856n27067
$$ 72172060 71662989 70632677 70879312 71443868 71359882 71665764 71982670 72264433 71408577 70881510
3985.7G0881510Q7647J69864K96855n55539l27358L4198N02553J1430J24779J11103
$$ 70881510 70969157 71139021 71435876 70880337 70552979 70587177 71089730 71101160 71225939 71337042
3995.4G1337042j005831n1417j62125l17235L95217
$$ 71337042 70331211 70279794 70117669 69800434 70195651
4000.2G0195651
$$ 70195651
##END=$$ End of the data block
