##TITLE=$$ Begin of the data block
##JCAMP-DX=5.00 $$ ACD/SpecManager v 10.08
##SPECTROMETER/DATA SYSTEM=Varian
##DATE=07 Jan 2013 16:44:18
##DATA TYPE=INFRARED SPECTRUM
##DATA CLASS=XYDATA
##ORIGIN=
##OWNER=
##NPOINTS=3735
##FIRSTX=399.26403809
##LASTX=4000.35498047
##MAXX=4000.35498047
##MINX=399.26403809
##MAXY=72.70699310
##MINY=37.35063171
##XFACTOR=1.0000000000
##YFACTOR=0.000000100000000
##FIRSTY=71.72240448
##DELTAX=0.96440572
##XUNITS=1/CM
##YUNITS=TRANSMITTANCE
##XYDATA=(X++(Y..Y))
399.3 717224045 717642975 723995514 721122208 709241180 702893372 705288315 698195496 693367310
407 693367310 692245636 693332672 714009476 725363922 721682587 727069931 717149048 696207352
414.7 696207352 690089645 697673798 704747391 693000259 698209229 705344543 702157974 698530350
422.4 698530350 689696121 686419373 684264374 686622772 697535858 711632156 716382217 717265167
430.1 717265167 724801788 716731644 697365799 688375168 693555832 699327011 703358917 711594696
437.8 711594696 717502289 717332993 713168564 711728821 703738098 695512314 699420776 704179916 708069000
446.5 708069000 705433197 707144852 715382462 717961121 713823395 703215637 700929031 700736465
454.2 700736465 702297821 712376709 713715210 713078613 710943680 698400574 688337936 687566299
462 687566299 688389053 690521622 697015762 706628036 713639984 712936096 708172302 706937790 703339844
470.6 703339844 697223053 696202087 694330444 695704651 704342651 713451157 717606354 712864380
478.3 712864380 706180573 704079666 698768234 691248398 690063019 690422058 699834747 719005508
486.1 719005508 724501114 718392181 708030167 695805206 692053604 693502960 699880142 705035706
493.8 705035706 711040878 717393494 720015640 716356888 704803848 700876694 699109192 698143158
501.5 698143158 703374481 706719666 710229874 712768784 713826828 705345459 698525467 699919510
509.2 699919510 698374863 696278458 695243912 698181686 706327133 717681351 720790176 708982544
516.9 708982544 696416550 689405670 690240250 696523666 702207642 707118683 710108719 712213516
524.6 712213516 713935013 712446899 704868469 697740555 693601227 694565811 699672241 703679352 706580200
533.3 706580200 708187256 707684937 702240143 696551056 693520355 692256927 693912354 696255112 701838303
542 701838303 707550888 710616989 711259003 704843903 695741577 691567230 691735001 692887726 697277985
550.7 697277985 701575165 705755692 710827713 710143127 705759583 698884964 693431320 692281265 692561264
559.4 692561264 695654297 702220840 708798676 710554733 707457657 701239548 697168427 694686203
567.1 694686203 691089020 691432877 696887207 704402924 708776779 709131012 707113647 701429367 694839325
575.8 694839325 691821060 692478714 694224625 699337387 704710541 707186890 707670822 704193192 700615005
584.4 700615005 698395386 695656052 693102036 694539642 698718033 701711121 704564667 705667343
592.1 705667343 703243408 697913589 692219772 686816254 685273590 689907761 695148544 700341873
599.9 700341873 702294769 703084946 704152756 700815582 695096893 690086594 689551544 690806351 692663040
608.5 692663040 697085037 701468277 702292328 699070969 695682602 691144562 686883087 685640335 688293533
617.2 688293533 693103714 697058640 701354523 701569061 697640381 694124603 691282654 687878647 686067810
625.9 686067810 688675461 692148666 697617187 703726730 704520493 700106277 693779755 688931732 686905518
634.6 686905518 689071808 692920532 696979980 700108795 700814819 701764069 700365753 696851959 692755890
643.3 692755890 688945618 688058624 689965286 694270782 699018478 701753998 702786484 702175369 698315659
651.9 698315659 692830276 688770294 688327332 691095123 694890137 699424362 703070374 703512878 699951935
660.6 699951935 695347137 691529694 688973923 689607925 691125183 693747482 697103348 699876709 700986404
669.3 700986404 699614182 696496735 692695923 691164246 691479416 691025467 691479416 695413284 701138458
678 701138458 703348160 702704849 698754883 693739090 691182022 689447098 690089035 692789764 698018036
686.7 698018036 703483429 704609756 702157516 697964935 693980179 690087051 688382111 690780716
694.4 690780716 694791031 698971100 703084412 704877930 702593079 698090439 692673111 689971466
702.1 689971466 690699844 691272659 693159561 698240814 703343201 704760590 702829361 698699493 693292313
710.8 693292313 689169922 688413010 690080566 693643723 698733292 702817688 705618439 704727249 699623489
719.5 699623489 693701477 689069138 688416367 689786377 692405853 697226181 701141281 702346344 701261368
728.1 701261368 698228378 693167877 689135971 687869644 689469223 694352341 700118408 704851151
735.8 704851151 706691132 704654617 701095047 697939301 693935013 691068115 692005615 695361328 700057220
744.5 700057220 704078140 706656570 706304779 702490158 697967682 693667755 691333160 691634445 695088043
753.2 695088043 699918594 703399353 706666946 707691803 704230270 698419495 693302002 690947037
760.9 690947037 692769852 696126328 699791718 705456848 709682999 709474487 705392456 700190811 695858765
769.6 695858765 693460999 694510269 697618561 701992569 706388931 707876205 707284393 705400467 700611649
778.3 700611649 695588303 692561722 692288895 696320190 701365967 706203079 709021759 708560638 706457748
787 706457748 701135788 695557480 691735687 691123581 693849106 698453293 704861450 707997971 707068024
795.6 707068024 704156036 699286423 693721466 690673447 691242905 693444138 697639694 702631912 706089859
804.3 706089859 705533066 702187271 698023682 692004547 688132401 687452011 689040909 692747574 696987762
813 696987762 700247040 700150909 697686768 693356171 688111038 683972549 682715683 684702682 687892075
821.7 687892075 692707672 697227707 698030472 695067139 690233307 685946579 682007217 678848953 679794769
830.4 679794769 685042801 690798569 694204865 694880142 693271027 689168777 683095245 678368835 677242432
839 677242432 679479141 684188538 689095154 692280350 693669357 692712936 688576889 682019196 676300201
847.7 676300201 675573578 678649445 682386169 686806564 691419067 693028336 690960846 687171860 682358856
856.4 682358856 678456039 676546555 677544632 681404877 686488647 691730576 695137863 695594025 692682953
865.1 692682953 688447113 684371414 681624298 683716354 689039764 695344772 701092300 704179840
872.8 704179840 703952637 700086899 694252090 688481598 685963593 686857986 690087814 695093155 699898987
881.5 699898987 702134399 700667267 697837906 693388519 688477249 685983429 686140289 689756546 696621246
890.2 696621246 702818069 704738312 704528122 701907730 696860428 692779617 689455032 688468475 690550156
898.8 690550156 694790802 700751114 705518875 705842514 702332153 696968765 690580978 686018982 684547882
907.5 684547882 687464981 692888260 697668915 701284561 701740646 699516754 694194946 687301788 682333527
916.2 682333527 681194153 684408951 689548950 695115433 699034958 700275497 697654800 691291885
923.9 691291885 685309982 681025925 679814301 682566757 687388077 692073746 696314468 698037338
931.6 698037338 694662399 689787827 684554749 679250641 677032166 678335419 681872406 686885147
939.3 686885147 691572647 693814850 692619934 687613297 681659241 676836853 674093246 675025330 679350739
948 679350739 685566101 690600510 692668839 691286621 686849670 680927124 676002655 674756012 675970078
956.7 675970078 679187012 684159241 689134369 692499619 692100601 688452454 683232422 678776779 676176529
965.4 676176529 676316223 679569092 683859787 688331604 691910400 692336502 688392487 682195587 676950531
974.1 676950531 673951263 673491592 676412888 681772537 686402435 689317551 689045715 684977875 679722137
982.7 679722137 674439163 670517197 669735565 672274704 676735382 681102600 684157944 684831467 681678314
991.4 681678314 675975113 670396118 665838394 664599380 667022552 671252747 675198441 677866364
999.1 677866364 678906250 676343765 671110001 665271759 660902481 659164886 660290451 664244156
1006.8 664244156 669175186 673386612 673974762 670726624 666039734 660562286 655031052 651734467
1014.6 651734467 653097839 656889114 661391754 665665817 667025070 665130463 661075058 656081696
1022.3 656081696 650987473 648915482 650178833 653853836 659770508 664110031 665858536 665064697
1030 665064697 661473770 655708923 650423813 648950195 649553146 652829361 658760529 663050842 665609741
1038.7 665609741 665749283 662437668 658016739 653566971 649785614 649258423 652144928 655925140 659758377
1047.4 659758377 663364182 664476013 662345352 657817230 652499542 649339523 648058929 649977875
1055.1 649977875 654943008 660155106 664668198 664969635 661522369 656370392 650983658 647871780
1062.8 647871780 646580429 648643723 653362503 658293839 662230301 662087784 659709015 656391068
1070.5 656391068 650573044 645408325 643888626 645473099 649808044 655212173 658746414 659702377
1078.2 659702377 657768860 653580551 648882675 644757233 642579498 643569107 647210846 651942444
1085.9 651942444 656087341 658254471 656871185 652935944 648354721 643621521 641364288 642666626
1093.6 642666626 646120834 650415039 654371796 656074219 654376755 650858459 646359634 642152710
1101.4 642152710 639721107 640121918 644515228 649718628 653716431 656563187 656354446 652526550 647101669
1110 647101669 643185959 640943375 640962067 644098053 649190292 653989487 656170273 655955582 653127594
1118.7 653127594 648648148 645424194 643682098 643558350 646060181 649704590 653563080 657080307
1126.4 657080307 657350769 654875107 651000061 645748901 643081512 643656616 646256256 650945587 654894562
1135.1 654894562 657922668 659317322 656749573 653187180 650117950 646433334 644057846 644559479
1142.8 644559479 648069305 652625885 657017365 659282379 657938385 655183868 651509933 648481979
1150.5 648481979 647659760 649863663 655052490 660597992 665163345 667330780 667362595 665156250 661026001
1159.2 661026001 657780380 655830002 656914368 660676193 665198975 668596878 669844971 669565735
1166.9 669565735 666697769 662473831 657679138 654881058 655962219 659486465 663928680 667512741
1174.6 667512741 669846649 669659348 667257843 662905655 658291779 655977936 655571060 657990265 661848450
1183.3 661848450 666169128 669188919 668484497 665702972 661482697 657223358 654635086 654668732 656141739
1192 656141739 658998337 663106766 665411072 666250076 664955521 661006088 656337433 652891312 651901093
1200.7 651901093 652889862 655528107 659253387 662505951 663427582 661563873 657655334 653309326 650260239
1209.4 650260239 648727264 649494247 652542877 655871658 658101730 658633499 656970062 653827972 650119553
1218 650119553 646473389 644666061 645017242 647436523 650388794 652345200 653520279 652468796 649456177
1226.7 649456177 645552902 641784286 639478722 639354820 641490784 644431381 647494888 649962006
1234.4 649962006 650036316 647079163 642377777 638622627 636876144 636951332 639217834 642764969 645889359
1243.1 645889359 647664413 647259064 644735489 641376877 638032799 635839653 635608635 637390862 640565643
1251.8 640565643 643715057 645712280 646158905 644660797 641051407 637223778 634778481 634354172 635949211
1260.5 635949211 638684387 642058563 644632950 645162430 644110870 641127014 637378311 634756813
1268.2 634756813 633791122 635310860 638166695 641165237 644121857 644974594 643682327 641417694 637784843
1276.9 637784843 634927025 634318390 635359535 637983742 641613007 644687042 645751038 644854202 642621841
1285.5 642621841 640018921 637746124 636584740 637448120 639751205 642469254 645148315 646788864
1293.3 646788864 646475983 644560242 641565170 638579903 637015915 637114830 638914070 641732101 644790878
1301.9 644790878 646839676 646521835 644562378 641520157 638438835 636635246 636105804 636563759 638679314
1310.6 638679314 641771317 644032822 644098206 642186661 639869385 637189636 635074005 634621506 635127220
1319.3 635127220 637055817 640003433 642426300 643155212 641657028 638811302 635977058 633664894
1327 633664894 633059654 634506989 636801338 639391022 641222992 641293030 640020676 638304749 636494904
1335.7 636494904 633980331 632654228 633636665 636241074 638954773 640381470 640761185 639947739 638388214
1344.4 638388214 635799065 632909470 631901474 632664108 634166946 636384926 638906136 640371399
1352.1 640371399 639826736 637611237 634588509 631682777 629948044 630247307 631868210 634255104 636517677
1360.8 636517677 637538376 638096313 635498657 631651764 628985176 627042847 626539001 627856941 629688187
1369.4 629688187 631338921 632638245 632508583 631884842 629910851 626303329 623326492 622489777 623933830
1378.1 623933830 626217270 628644295 630127106 630240097 629031639 626543999 624286308 623581047 624705124
1386.8 624705124 625897484 627009506 629123688 631379356 632220535 631244812 630311699 627992096 624546089
1395.5 624546089 623474960 623984528 626131859 628098564 628926048 629256592 628201752 625852966 623940086
1404.2 623940086 621874580 619686623 619679413 621096153 623043976 624461327 624796410 624683228 623136559
1412.8 623136559 621105461 618854027 617647362 618116379 619728203 622577553 622922554 621337929 620600204
1421.5 620600204 619505539 618547897 615664978 613823624 613576622 614241028 616510162 619103546 619930649
1430.2 619930649 618942757 617993851 615978699 613506393 613103905 614306450 613157845 613015022 615677071
1438.9 615677071 617212982 616697693 615244217 613650627 612212219 610905533 611361542 613260040 615223236
1447.6 615223236 615330429 615475426 616312332 616289749 615129089 613115005 612391396 613352585 615968933
1456.2 615968933 617862282 617664986 618680115 617693825 617118492 615579109 613524933 613104782 611963615
1464.9 611963615 612264442 613817444 616396027 618529053 619629478 620760956 622192078 622492905 618931618
1473.6 618931618 618301544 620108795 620726128 620653038 622792206 624424248 624969444 625102768 623135262
1482.3 623135262 622170067 621544762 622208862 625443459 628288193 630409737 632703743 634451256 631394157
1491 631394157 630154114 630142822 629844742 631374969 634133568 635606804 637134857 639845276 638737488
1499.6 638737488 638256721 638287468 637148476 637539711 639602966 645120926 651562119 648803711 648067780
1508.3 648067780 647458725 646363602 644824600 644301834 643247528 644137268 645974426 648126907 652687302
1517 652687302 650874176 651009064 652960587 654058304 652957458 648240433 648356628 650654984 652346344
1525.7 652346344 653228607 655211182 654873123 653547592 653384171 652615280 653013763 652878418 650749435
1534.3 650749435 651393890 652847366 655102081 658938065 664352264 658204880 657384491 655661316 653621292
1543 653621292 654623871 654197006 651952820 652363205 653747406 654605484 654231491 650813675 649078064
1551.7 649078064 649101334 649617920 648362198 648844299 653118134 658514328 659710541 659087524 648126144
1560.4 648126144 646379623 645549850 645745392 647609482 648350449 648245773 648706284 650111084 652076187
1569.1 652076187 648594208 645428467 645142059 645069656 645929108 649359512 654500504 653701782 651515350
1577.7 651515350 651231995 650086136 649074173 648599854 648490601 649507599 651008987 652890396 654634628
1586.4 654634628 655503998 655808563 655622940 655155945 654655914 654367599 655159607 657153854 658482590
1595.1 658482590 659403839 660211945 660376129 660002289 658826370 658032913 657443924 657671280 658154678
1603.8 658154678 658588028 659837799 661001892 660964661 659670868 658142776 655880814 654834366 654826355
1612.5 654826355 654788895 655761414 658229904 661615219 656514816 653944473 652864761 651306000 650697556
1621.1 650697556 651039505 652545624 650374146 649706955 650473862 650931396 649899979 646032944 644592209
1629.8 644592209 643620300 643328094 643846283 645454712 648620987 647539902 646042023 645541992 642584763
1638.5 642584763 640939484 639925613 639790459 640367126 640696945 642287750 645153427 645382385 644135818
1647.2 644135818 642606735 639231148 638679161 640487900 644367905 652960358 645158920 640847626
1654.9 640847626 640450211 640610580 639561386 638508492 637670593 638114662 639986153 641540222 640956497
1663.6 640956497 640594482 640737610 640453949 641119843 642290802 640143433 638377419 638862953 639003906
1672.3 639003906 639853516 643325806 645913467 641325836 640500946 639630814 638684196 638405800 637938805
1680.9 637938805 639109917 643010025 648528595 640428467 636433601 635482826 634593353 632567291 630800095
1689.6 630800095 629216347 628355522 628465538 628318291 629692993 633053474 628374977 624074554 623354111
1698.3 623354111 624950562 622825775 612689934 616052208 618369293 619302711 617998695 617085686
1706 617085686 615171509 612207642 611684723 611777039 611445580 611678543 613349419 615525932 615133705
1714.7 615133705 613564415 614463577 616886101 610662308 607708702 608578606 609314880 610898056 611891289
1723.4 611891289 611143417 610417747 609591293 608211746 607633018 608758163 608452072 607677727 609664993
1732 609664993 614015274 617481499 609395332 606275826 605263443 605339775 606943436 606870613 604370689
1740.7 604370689 606304741 609629822 610395813 609938087 610026360 610546112 611173325 611929626 612342110
1749.4 612342110 615228081 618959732 618823242 621909790 624862671 627442589 631296463 633581276
1757.1 633581276 635223923 636965065 639588852 643954010 647840424 647644958 648721542 650083618
1764.8 650083618 650459900 651826324 653325424 652938080 654327545 658625031 663757248 664576797 660270233
1773.5 660270233 659494095 660463486 659745255 659907990 660256424 661420746 663597183 664054871 664918289
1782.2 664918289 666050415 666924744 666208649 664767609 665175781 665321579 665838394 667888184 669994812
1790.9 669994812 671741943 670935364 668225555 668889160 669145050 667011261 666632843 668405304 670265808
1799.5 670265808 670252991 671025085 671237030 670249329 670164413 669460754 668767471 668338623 668316345 669459534
1809.2 669459534 670788345 670947647 670823975 671359329 671212921 670552292 669438019 668787079 668562546
1817.9 668562546 668320923 669194412 670466919 671791687 671871872 671465836 672430878 670800781 668946991
1826.5 668946991 669344940 671023178 673588104 672199860 670831757 671526566 671873474 671428375 670477371
1835.2 670477371 670251160 670182114 669709015 670231781 671388245 672434311 673285904 674928665 676218567
1843.9 676218567 672625046 671121140 671362610 671564026 671389542 671686554 672818756 673490448 673731308
1852.6 673731308 673125153 671996613 671130295 671006699 671475525 671592102 671837006 671902924 672246933 672683563
1862.2 672683563 672508774 671919403 671183167 671044617 670606308 671365814 672476501 671191559 671414337
1870.9 671414337 672135696 672051773 671601334 670897751 670207748 669974289 670118027 670580750 671519775 672276993
1880.6 672276993 672624817 671943130 670879211 670299377 669906311 669777451 669378281 670058212 671383591
1889.2 671383591 671125107 671460800 671831436 671057281 670788727 670451431 669286270 669243774 669880371 670206909
1898.9 670206909 670571671 671194229 671824493 671931305 671407623 670264511 669369507 669353180 669964981 670939484
1908.5 670939484 671782379 671765366 670933075 670570145 670112457 669689484 669110107 668755341 670219040 670171738
1918.2 670171738 669191055 670030060 670728989 671802216 671439285 669192276 668140488 667863846 668168030
1926.8 668168030 668720779 669019470 669176636 669553986 669832153 669288254 668156662 667742386 667885513
1935.5 667885513 667874374 667911148 668355103 669109116 668881302 669302444 670460968 668771133 667684097
1944.2 667684097 667953033 667863388 667536392 667527695 668394318 669020691 668832932 668464432 667934418 667227859
1953.8 667227859 666665344 666425476 666585693 667050247 667516174 668240356 668852234 668689194 667967453 667228546
1963.5 667228546 666382599 666118546 667228775 667672958 667360840 667705536 668094711 668271027 667541122
1972.2 667541122 666491165 666279831 666279068 666062851 666296844 667209320 667946320 668251190 668211594 667695465
1981.8 667695465 666923981 666378632 665914993 665179062 665219116 666322632 667156525 667124481 667381973 668024826
1991.5 668024826 667337723 665942764 665022125 664433594 664304352 664854202 665903168 666067581 665728378
2000.1 665728378 665847092 665415726 664636078 663876572 663094559 662993164 663339920 663784256 664392700 664806290
2009.8 664806290 664685669 663955231 663039474 662369537 661836014 661575470 661826096 662481079 663352737 663781052
2019.4 663781052 663373871 662728119 661524506 660200500 659964371 660097809 660104599 660513840 661191940 661455078
2029.1 661455078 661327057 661244507 660709000 659800949 658941345 658304825 658138733 658190155 658980103 659921799
2038.7 659921799 660148926 660357361 659737396 658347702 657419128 656743011 656588516 657095718 657901611
2047.4 657901611 658718185 659182968 658859253 657902298 657129288 656325378 655641403 655730972 656078491 656633148
2057 656633148 657332230 657775116 658132172 657755356 656342392 655212708 654912491 654473267 654126740 654686966
2066.7 654686966 655345001 655840759 656231232 655821533 654557266 653212509 652763901 652964020 653219757
2075.4 653219757 653777390 654538727 655185623 655562973 655318604 654120407 652863159 652085114 651393356
2084 651393356 651454086 652271042 653140259 653608475 653699646 653508148 652581558 651565628 651027679 650734634
2093.7 650734634 650614166 651032028 651727753 652174149 652657776 652697220 652381058 651639252 650032120 648873367
2103.3 648873367 648718719 648976746 649249039 649951096 650930557 651145554 650356293 649073181 648089218
2112 648089218 647328949 647267609 648030396 648555679 649124451 649799881 649774628 649020004 647899017 646747131
2121.6 646747131 646022644 645362167 645169296 646017914 646813736 647376785 647462463 647168961 646692200 645565872
2131.3 645565872 644502487 643649521 643298187 643709106 644610519 645624771 646228561 645890121 644334793
2140 644334793 643005066 642224655 641726074 641714478 642046432 642847137 643503494 643718948 643326263 642544174
2149.6 642544174 641474915 640286713 639389343 638867149 639652138 640718765 641349716 641868668 642001648
2158.3 642001648 641850739 640825272 639528885 638519402 638195457 638673859 639480820 640338287 640635834
2167 640635834 640779953 640050964 638680191 637800598 637170563 636844635 636800880 637603340 638756256 639635582
2176.6 639635582 639883080 639369812 638639984 637446442 636564217 636152191 636408234 637140083 637588196
2185.3 637588196 638204765 638466606 638373680 637877426 637075195 636227722 635443344 635295181 635414925 636339493
2194.9 636339493 637483940 637629738 637563820 637418938 636484871 635191689 634677849 634854813 635644722
2203.6 635644722 636741829 637498283 637844467 637511559 636660919 635517998 634538651 634170189 634444618
2212.3 634444618 635141373 635946846 636574669 636813583 636798019 636271744 635265388 634088440 633404579
2221 633404579 633238373 633606262 634795685 635076065 634841118 635104256 634865913 634163628 633263931 632354469
2230.6 632354469 631782799 632254295 633076706 633745689 634724770 634836464 634302483 633679008 632623596
2239.3 632623596 631333160 630288048 630008659 630514259 631716156 632644424 632529297 631725197 630773697
2248 630773697 630027084 629407463 629092522 629091377 629386978 629935379 630423393 630871239 630703125 629866638
2257.6 629866638 629189110 628234062 627198524 627196999 628074722 629080162 629093933 628729744 629020348 628612938
2267.3 628612938 627368546 626271553 625397377 624921112 625457344 626517601 627058296 627157745 627132988
2275.9 627132988 626875114 626070442 625132141 624169121 623613319 624093742 624747162 625205460 625313530 625007210
2285.6 625007210 624560738 624410591 624076843 622734985 621852570 621886215 622545815 623181610 623485565 623938332
2295.2 623938332 623568001 622610435 621374016 620534286 620387573 620207939 620649948 621688194 622490807
2303.9 622490807 622213974 621719360 621563911 621115837 620421982 619829140 620203934 619912987 619867363 621034355
2313.5 621034355 621062851 620895500 620744476 619729805 618575630 618973885 619635925 619161491 619366150
2322.2 619366150 619545975 620082436 620432739 619541779 618483391 617207184 616382294 616763649 617975807
2330.9 617975807 618326416 618600121 619498062 619715805 619344406 618894958 618284187 617439995 617408218 617124748
2340.6 617124748 617482224 617950478 617090569 616879044 615879288 615418358 614741974 613775597 614297943 614255028
2350.2 614255028 614436340 615815353 616113052 616616173 616445045 614598770 614319725 613711586 611978874
2358.9 611978874 612489738 612809067 612185745 612193985 612634926 612277374 612277451 613562431 612123680 609630356
2368.5 609630356 608953667 609604874 610079765 609569397 609595833 609261055 608340111 607259178 606252785
2377.2 606252785 605981293 606020927 606392212 606531334 606045418 605663757 605764122 605580750 604588623 603881149
2386.8 603881149 603815002 603601952 603254051 603274574 603689766 603840981 603275795 602695580 602108879 601407928
2396.5 601407928 600906181 600184822 600261574 600850296 600735817 600759964 600973701 600662575 599883537 599594536
2406.1 599594536 599058952 598134308 598175812 598490753 598771210 598553276 598254700 598474236 597965088 597102661
2415.8 597102661 596462746 596193886 596444016 596472054 595957222 595923424 596298332 595825386 595424576 595208359
2425.4 595208359 594428825 593885307 593746719 593945656 594239731 594188652 594088097 593689117 593051682 593100510
2435.1 593100510 593034286 592395744 592344704 592547112 592024345 591373329 591707535 592277641 591915741 590820389
2444.7 590820389 589971657 589738274 589247589 589164276 589931068 589978943 589371948 589219131 589168129 588524132
2454.3 588524132 587699471 587582893 587800179 587500992 587267723 587094002 586827774 586619873 586245575 586329079
2464 586329079 585937958 584925385 584592361 584791794 585205727 585106773 584438515 583861732 583741264 583326111
2473.6 583326111 582528839 582233238 581886368 581692200 581478806 581488991 581732407 581096497 580658875 580338516
2483.3 580338516 580000839 580173149 579579315 578345528 577936554 577825737 577390785 577548370 577569656 577166138
2492.9 577166138 576810722 576356697 576266556 576274757 576430664 576352081 575735359 575272141 574648209 573939705
2502.6 573939705 573923416 574280968 573900490 573027191 572539330 572468491 572392273 572074547 571917763 571889839
2512.2 571889839 571472206 570914764 570772476 570546188 570048332 569687653 569886894 570381889 570089722 569606056
2521.9 569606056 569041901 568376083 568048286 567837448 568087921 567826424 567393341 567559319 567276649 566815224
2531.5 566815224 566973267 567627983 567552528 566702728 566284180 566519737 566456375 565816231 565529327 565366936
2541.1 565366936 565111389 564603729 564094276 564216537 564497910 564615593 564120789 563779335 564431381 564681244
2550.8 564681244 563838310 563237267 563156281 562630043 562460327 562822189 562802429 562637291 562226944 561758804
2560.4 561758804 561718407 561457024 561210327 561471634 561341591 560818863 560238266 559965973 559852791 559321213
2570.1 559321213 559032211 558690834 558659439 558942146 558583603 558432007 558614044 558650169 557992020 557298660
2579.7 557298660 557141647 556657562 556368980 556028976 555530434 555493164 555586739 555463295 554702110 554006538
2589.4 554006538 553874512 553390656 552581062 552572098 553084259 553051796 552614708 551854019 551128654 550846481
2599 550846481 550642471 550489159 550020676 549474640 549589577 549572601 549099884 548692245 548278313 547655220
2608.6 547655220 546649513 545711823 545407639 545497932 545727348 545751114 545059586 544418106 544175224 543350601
2618.3 543350601 542314720 541668167 541901855 542570877 542238541 541854401 541867714 541324425 540514565 540128250
2627.9 540128250 539818039 539285431 539095421 538940315 538504753 537785530 537434654 537680550 537674065 537535248
2637.6 537535248 536783257 535695267 535299530 535393562 535350151 535005112 534874725 534622879 534189644 533793526
2647.2 533793526 533399696 532815208 532091866 531946068 532277756 532674522 532238770 531701813 531713905 531141243
2656.9 531141243 530590630 530169678 529967537 530047035 529771156 529700432 529788055 529726562 529441833 528879776
2666.5 528879776 528321915 527991295 527907791 527458649 526909180 527373619 527491150 526684608 526570625 526548843
2676.1 526548843 526301117 525755234 525220566 525521088 525539207 525563774 525826836 525610771 524933853 524385681
2685.8 524385681 523992424 523216248 523039207 523102417 523055115 523402519 523667068 523298569 522498894 522531967
2695.4 522531967 522665558 522080612 521595573 521790695 521885109 521657143 521998520 521596947 520888786 520932808
2705.1 520932808 521038017 520748672 520210991 520230865 519950485 519915886 520554123 520837746 520829277 520204086
2714.7 520204086 519271660 518233910 517667503 517681885 517647133 517943840 518287010 518105011 517572212 517491226
2724.4 517491226 517385559 516336899 515176048 514961090 515257568 515674362 516216812 516040649 515646400
2733 515646400 515127068 514287643 513828926 513681602 513345985 512426262 512328148 512794762 512763519 512631874
2742.7 512631874 512324638 512403107 512056961 511363525 511012192 510533485 510816765 511124725 510901794 511085243
2752.3 511085243 510646820 509953842 509877396 508938332 508328667 508792534 508776779 508758736 509130707 509790688
2762 509790688 509742432 508965607 508109283 507001419 506519203 505895119 505506706 506389313 507029190 507001762
2771.6 507001762 506886826 506560516 505669556 504915581 504661064 504466972 504516525 504974747 505328827 505163460
2781.3 505163460 505097961 504961548 503968964 502846603 502497444 502411499 502314415 502357712 502518768 502513733
2790.9 502513733 501998253 501772385 501324196 500452499 499496918 498246918 498033752 498365822 498436890 498265762
2800.5 498265762 497943916 497306557 495964355 495324554 495101395 494742241 494370346 494150734 494505386
2809.2 494505386 494551544 494165878 493404999 492564926 491924629 491713676 491368256 490198822 489603844 489638596
2818.9 489638596 489643478 489280853 489189453 489673729 489326248 488234596 487201271 486724129 486581192 486616783
2828.5 486616783 486563110 486421051 486300659 485814209 485653152 485202065 484426498 484124222 484247932 484342117
2838.2 484342117 483810234 483701057 483971901 483732681 482988739 482437897 481828308 481214371 481654396 481904869
2847.8 481904869 481778870 481229973 480747490 481188660 480868416 479991837 479349289 478632507 478083115 478323784
2857.4 478323784 478854103 479207191 479297714 479122162 479257736 478586960 477720184 477544861 477277908 477009087
2867.1 477009087 477071190 477668228 477752609 477370605 477074242 477284813 477553902 476708679 475939026 475627403
2876.7 475627403 475435181 475467529 475712509 475546722 475009232 474586525 473707657 473147545 472856255 472544136
2886.4 472544136 472453461 472573929 472670326 472255058 471918602 471219559 470432930 469961243 469567337 469086876
2896 469086876 468781624 469255791 469105949 468767433 468337097 467537956 467120857 466609459 466293030 465994911
2905.7 465994911 466114883 466655540 467076111 466688538 466058922 466169357 465536308 464789276 463525543
2914.3 463525543 462536087 463334846 463756142 464161415 464742317 464571571 463901634 463476601 463450165 463272705
2924 463272705 462778931 462482414 462777481 462796516 463032417 463285332 463125191 462616463 462168159 462192955
2933.6 462192955 461482925 461179008 461307640 461325493 461574173 462052536 462797127 462359390 461416740 460519218
2943.3 460519218 460136452 460300026 460573387 461302757 461187401 461359978 461761131 461562767 461519623 461122284
2952.9 461122284 460608292 460448265 461031189 461854362 462710571 463084412 463022118 463014145 462989388 463806877
2962.6 463806877 463830070 463529854 464449387 465424614 465821152 465808296 466520729 466959343 466560173 466347198
2972.2 466347198 466341553 466666756 466999168 467235489 467833366 468994904 469501343 469050064 468756676 468758087
2981.8 468758087 468818588 468457565 467953072 468003502 468495102 469067802 469813271 470341759 470228577 469750633
2991.5 469750633 469032173 468619156 468647346 469047394 469344673 469551964 469945831 469696236 469113579 468344803
3001.1 468344803 467807083 467562599 467394485 467906227 468157501 468347549 468421478 467987366 467928810 467729034
3010.8 467729034 467164650 466659279 466417847 466544418 466445236 465688171 465239716 465542793 465603867 465348091
3020.4 465348091 465507812 465535507 464695473 464103928 463637619 463313751 464049339 464270706 463931885 463667297
3030.1 463667297 462838745 462102966 461865883 461690102 461411552 461242142 461434975 461601219 461266518 460941925
3039.7 460941925 460629349 460225449 460033340 459603195 459368820 459595947 459506111 458987083 458767166 458841858
3049.4 458841858 458527870 458013458 457330856 456569977 456027336 456063538 456723061 457236671 457259979 456790657
3059 456790657 456215477 455873833 455843773 455581169 454391098 453667755 454501495 455341377 454999886 454326477
3068.6 454326477 453778915 452994308 452291031 452046890 452066231 452098274 451943893 451939812 452241096 451852112
3078.3 451852112 451359558 451005363 450333061 449926224 449331055 448988304 448977737 449446945 450337105 449883881
3087.9 449883881 448560333 447923851 448096466 447755966 447046928 446716919 447182693 448157654 447846565
3096.6 447846565 447405243 446846771 446117821 446108017 445674706 445246849 444756355 444589577 444852066 445033684
3106.2 445033684 444881516 444277573 444203644 443681450 443292007 443698883 443673935 443138695 442850151 443534126
3115.9 443534126 443485069 442551575 441990128 441651840 441235199 440734291 441015472 441578293 441052704 440065346
3125.5 440065346 440436096 440794754 439914703 439611053 439194794 438683624 439058075 438737030 437999535 438164024
3135.2 438164024 438230438 438183174 438362045 438192444 437692413 436823730 436629601 436568832 436167946 436446609
3144.8 436446609 436156158 436180038 436854782 436322212 435736465 435690689 435287056 434726410 434302330 434309578
3154.5 434309578 434361267 434174576 434392891 433764458 432595062 432459335 432483253 432542534 432824707 432938194
3164.1 432938194 432262344 431546097 431387596 431230545 431457100 431020966 430156174 430215950 430718765 430632019
3173.8 430632019 430187569 430310364 430319862 430195312 429889488 429442596 429013023 428708725 428813896 428492050
3183.4 428492050 428373833 428271141 428014793 428112831 427662277 426663322 426078529 426300392 426260643 426247864
3193 426247864 426197662 425944557 425962677 425636826 425522957 424948654 424067230 423530540 423111954 423258171
3202.7 423258171 423854446 424427986 424232063 424326057 424091721 423149490 423016357 422750854 422461395 422598267
3212.3 422598267 422613297 421838722 421646576 422296600 421668587 420941849 420894165 420887604 420327950 419688339
3222 419688339 420031090 420488815 420231209 419512138 419624405 420066757 419841270 419114838 418369904 418644638
3231.6 418644638 418873253 418364143 417873611 417582169 417708435 417918587 417570457 416939468 416541748 416578331
3241.3 416578331 416517715 416262245 416422958 416190948 416081810 415598335 414419937 414673195 415130920 415208473
3250.9 415208473 414799652 414478989 414955139 414392242 414044037 414072266 413584938 412908783 412465782 412544937
3260.5 412544937 412288589 412497978 412966957 413065567 412828445 412037010 411351318 411292839 411870384 411852837
3270.2 411852837 411260757 411135674 411290550 411113968 410956841 410904274 410366364 409783058 408894806 408673172
3279.8 408673172 409584961 410019035 409404488 408796310 409379654 409343338 408870430 408908691 408203621 407700462
3289.5 407700462 407877350 408057480 408144798 407979317 407332153 406854591 406768074 406351013 406132584 406590004
3299.1 406590004 406561394 405631294 405421257 405460129 405355797 405459251 404647865 404008865 403611259 402956696
3308.8 402956696 403115044 403708076 403862267 403749924 403730049 403370399 403097572 402830009 402385368 401842537
3318.4 401842537 401082077 401051445 401589928 401705055 400941734 400326538 400162659 399946136 399838066 399593468
3328.1 399593468 399584656 398971481 398487320 399219093 399505424 398783188 397609215 397308540 397044601 396128006
3337.7 396128006 396537323 397515450 397383461 396735153 396261368 395889969 395669250 395612831 395733261 395123177
3347.3 395123177 393972397 393683052 393920174 394327774 394285393 394077187 394140434 393368607 392156296 392080612
3357 392080612 393209457 393314095 392473373 392607155 392870941 392241516 391596298 391572227 391077309 390312843
3366.6 390312843 390013008 389358406 389343719 389918289 389408722 388964157 388725204 388301544 388461800 388286667
3376.3 388286667 388540077 388433037 387016296 386833153 387079811 386928368 387003517 386986198 386536903 385640526
3385.9 385640526 385335922 385306320 385583267 385706520 385144958 385364647 385549316 384742393 383907089 383458328
3395.6 383458328 383679352 383900909 383435631 382720070 382061234 382146835 382469177 382470131 382461357 381645775 381296883
3406.2 381296883 381707153 381742439 382108307 382016792 381042862 380285797 380367012 380619164 380529404 380222855
3415.8 380222855 379805603 379988708 380493622 380679626 379773521 378628464 378794098 378838120 378398933 378775444
3425.5 378775444 379035988 378470688 378217583 378186722 378643303 378614120 377671852 377492065 377177620 376868668
3435.1 376868668 376302681 376382561 377765923 377642212 376317978 375616417 376746750 377440987 376870651
3443.8 376870651 377000160 377103615 377369232 376615601 375772171 375951614 376627045 377104263 376512527 375992546
3453.4 375992546 375095062 374819260 374952354 374671860 375096703 375494881 375676804 375278091 375189857 374706726
3463.1 374706726 374304428 375113144 374490395 373968773 374646950 375174332 375296974 375034027 375219231 375345993
3472.7 375345993 375453415 375493660 374466324 373602295 374081802 374749146 375254440 375890999 376699028 376222839
3482.3 376222839 373981476 373506317 374170341 374873047 375387383 374964256 375160789 375448189 375261955
3491 375261955 374650879 374644547 375237694 375145721 375075722 374744072 374431458 374139862 374345398 375266533 375790329
3501.6 375790329 375929604 375260048 374505806 374380074 374802856 375361786 376516380 377036057 375769615
3510.3 375769615 375362778 374683800 374063416 374190331 374304886 374795761 375087547 375618248 376173286 375816841
3520 375816841 375252609 376239967 376902390 375686874 375368881 375721321 376452065 376670265 376431503 376103249
3529.6 376103249 376197586 376635971 376299248 376189041 375805664 376382637 376419067 375776939 376888618 376994820
3539.2 376994820 376941719 376887360 377479401 377989883 377823372 378768349 378167686 377727203 376047096 375408821
3548.9 375408821 377255020 378569756 379498444 377753677 377454567 377904854 377918892 379332199 379184875
3557.6 379184875 379485550 379955902 379773064 379617653 380474014 381422462 380538902 383067474 384839287
3566.2 384839287 382889023 381398430 379170761 380564880 380726624 380348473 381277695 381339951 381076851
3574.9 381076851 381230278 382870979 382884903 382499809 383362274 383259201 383648033 384716835 385254402
3583.6 385254402 384742813 386701126 389599533 389496384 389272003 385733566 385506439 387114525 388384857
3592.3 388384857 389109840 388164864 389448471 387972488 387714386 390315514 390838127 392401199 392448616
3601 392448616 391386948 392202644 392699738 391965561 392775917 395142250 393838234 395263100 393705750
3609.6 393705750 390460930 395518570 397871552 395192566 396748276 395789871 396739388 399675446 400316315
3618.3 400316315 400782967 398787079 397038040 398299675 399738464 400659103 401968079 403562279 404495239
3627 404495239 408310509 413050728 406142807 404727097 405412674 408009872 409599457 407959175 408118935
3635.7 408118935 409637337 412025261 411697006 410499535 411286774 412793312 413309288 412927055 414490051
3644.4 414490051 416681595 421305504 424127007 420354805 421833534 421735153 419356575 416356506 417868233
3653 417868233 419745026 421595726 426217422 422407646 420750389 422591667 422995491 423874283 424107513
3661.7 424107513 425064354 425922737 426551971 426744766 426842079 429305649 431430588 431917038 433394852
3670.4 433394852 429683800 427688065 432111511 440028343 444525223 431794395 428546028 432549324
3678.1 432549324 436106987 434222183 432949867 434678154 435495605 435401344 435582504 435875778 438447723
3686.8 438447723 443435211 438979187 435879860 442763672 440075836 436966629 438855972 438800926 440244255
3695.5 440244255 440250549 439360504 439509811 439395180 441213226 443227844 440308075 436919174 439071808
3704.1 439071808 440855141 441297379 441470337 442182693 444992027 440807915 443775940 450264359 439235153
3712.8 439235153 438344345 440705795 440813408 439940491 440640068 442278175 440117035 439471321 443457298
3721.5 443457298 443651886 439252052 441585808 443256454 442871819 440119629 438109283 439870377 440416145
3730.2 440416145 444903831 445981598 440022469 444724083 447189331 441086159 437080154 437832603
3737.9 437832603 438733292 439684982 441774902 438853264 439619980 447988472 446153221 432849541 437337418
3746.6 437337418 440054970 444883347 448384018 439969139 444582367 443034286 435982780 437424126
3754.3 437424126 439818001 442801285 437992210 437036476 442092361 438470154 434677963 436619720
3762 436619720 438057365 438210754 440231094 440240059 437093735 437000008 439679680 441967163 437394753
3770.7 437394753 436526680 437676811 437578087 437462540 436349907 436255035 437295303 439689941 440836449
3779.4 440836449 436186867 436307716 436705894 436178207 438816109 438015518 435980759 435744896 434969444
3788 434969444 435292397 435479889 435914688 435987968 435989265 435623398 435618515 438163414 437071953 434044456
3797.7 434044456 434096375 436285858 442016830 442474861 434270058 433468208 434408989 437279816 441877670
3806.4 441877670 435740318 430725060 433082542 433687744 433913460 434249687 434045448 434099159 438353119
3815.1 438353119 441514854 430216866 430923882 433983040 438103828 444661636 434336472 432225990
3822.8 432225990 434397774 434053993 434820251 435744553 432454758 431307449 432433777 434871407 437564316
3831.4 437564316 430642204 430482788 436424255 432744293 430575027 437208099 433707809 427354774
3839.2 427354774 432358398 431160851 430087852 434306755 433761559 429273148 428896523 429586983 429540520
3847.8 429540520 431532707 431544800 432692604 438729630 437994919 438524780 426010094 422532196 428000832
3856.5 428000832 429217339 428495979 428824234 430350075 432242317 429898529 429065285 433748207 432027054
3865.2 432027054 424982948 425559425 428922653 434980927 431708450 423955116 424736214 427633362 432726784
3873.9 432726784 426983795 424079285 425701866 425632591 426638336 429721832 429241028 423637695 426431122
3882.6 426431122 426574669 426148071 431959648 424676018 421976700 424456863 425140686 427433014 428928146
3891.2 428928146 424886017 423668900 424689560 422805634 422628403 423271484 425297127 427959824 421683960
3899.9 421683960 423704109 426755981 424132233 426319237 424737015 423043861 421882706 421141663
3907.6 421141663 422494659 422662392 422166405 421564636 422207985 422041054 420689430 421449966 423418922
3916.3 423418922 422783165 419745560 421558876 423095016 420340881 420323563 421225395 422555084 421588745
3925 421588745 419269943 419258041 418973732 419735565 419064445 418843040 421100426 420123177 418197174 418210793
3934.6 418210793 418470001 418212814 418380470 418515968 418535385 418559303 419408455 420831757 417474098 415949326
3944.3 415949326 416633759 416815033 418075752 416389771 416396027 417571449 416475983 416657104 416473389
3953 416473389 415729218 414478912 414248161 415441589 415731010 415222054 415105820 416018105 415804214 413929291
3962.6 413929291 412787628 412999725 413339806 412876205 411843948 411982346 412685928 412193260 412729645
3971.3 412729645 412318497 411423836 411187706 410007896 410694122 410873909 410808716 411308403 410598488 411184807
3980.9 411184807 411306000 410702209 411019211 411071053 411157074 411126938 410506287 409742355 409208755 409476585
3990.6 409476585 410021477 409280701 409064064 410108223 409872284 408756180 408602943 408742218 408418274
3999.2 408418274 408464241
4000.2 408464241
##END=$$ End of the data block
