##TITLE=$$ Begin of the data block
##JCAMP-DX=5.00 $$ ACD/SpecManager v 10.08
##SPECTROMETER/DATA SYSTEM=Varian
##DATE=07 Jan 2013 16:01:50
##DATA TYPE=INFRARED SPECTRUM
##DATA CLASS=XYDATA
##ORIGIN=
##OWNER=
##NPOINTS=3735
##FIRSTX=399.26403809
##LASTX=4000.35498047
##MAXX=4000.35498047
##MINX=399.26403809
##MAXY=134.22033691
##MINY=0.00000100
##XFACTOR=1.0000000000
##YFACTOR=0.000001000000000
##FIRSTY=0.00000100
##DELTAX=0.96440572
##XUNITS=1/CM
##YUNITS=TRANSMITTANCE
##XYDATA=(X++(Y..Y))
399.3AX0J08737922%K5482414n6432625j3066780O467094N436486j0220932k2942074
464.8D3461506J943642Q311451N998783P395465k899032p846314m726776l173607M707451
473.5E3172569O402600l148072r60224j13010M512249N524658m733215j802914J9237
482.2E8873878j890659m926693M43489O176224P4062m276630Q46901R731499J776497
490.9F6828568o104943j331932K800495N86857l644131P25296J692810N90317j748325
499.6F0395012J47404N095073J210930p37854j52817J061943O71051k620208j956211
508.2F3114323N47985J404884j601627j111019n928K26169J346268j66115M92634J715973
517.9F5963547Q56422q09967p85271o93969p87770J270199N13314n39788l41690M0398
$$ plain form
399.3 1 1 1 1 1 1 1 1 1 1 1 1 1 1 1 1 1 1 1 1 1 1 1 1 1 1 1 1 1 1 1 1 1 1 1 1 1 1 1 1 1 1 1 1 1 1 1 1 1 1 1 1 1 1 1 1 1 1 1 1 108737923 108737923 134220337 77787712 64720932 71188026 76624512 66403580 43461506
464.8 43461506 45405148 53716599 59715382 67110847 64211815 56365501 51638725 48465118 53172569
473.5 53172569 59575169 56427097 55466873 55353863 59866112 65390770 60657555 58854641 58873878
482.2 58873878 56983219 52056526 52500015 58676239 58750301 54473671 55320572 65052071 66828568
490.9 66828568 60723625 59391693 62192188 62779045 59134914 59860210 61553020 62143337 60395012
499.6 60395012 60542416 65637489 66848419 66110565 65957748 67019691 67690742 65070534 63114323
508.2 63114323 63662308 65067192 63465565 62354546 62348618 62574787 63921055 63754940 64247574 65963547
517.9 65963547 66819969 66010002 65224731 64530762 63742992 65013191 65526505 64986717 64645027 64685425
527.5F4685425N65452L25150L36548k56241p23938j98494M14741L83286O44020L60596
537.2F6536545q10410l07396L15178k69867m47944M39590J98937K5772J043579J64886
546.8F6888870m81964j60484M4288K00585J32233o8833q10417k56760P7477p58316
556.5F4806679k66419j08368n85319L05344K32566o68949l03463j32000O59588Q30353
566.1F4770012l8887l3585M95911L35007p54403m32159l24547q11119l98125M00139
575.8F3208244N80983p79412l70228k0111l62438N62893O69605n5458k69031Q0188
585.4F3245235l40786K3716l87485o69426N72189M6723M5868j8109m89803o55106l23063
596F1049953M22909R0225K95323p13589j443596o74453k12525K69829n1888J20480
$$ plain form
527.5 64685425 65250877 65576027 65912575 65656334 64932396 64733902 65148643 65531929 66175949 66536545
537.2 66536545 65726135 65418739 65733917 65464050 65016106 65455696 65654633 65680405 66723984 66888870
546.8 66888870 66406906 66246422 66290710 66491295 66623528 66554695 65744278 65487518 65564995 64806679
556.5 64806679 64540260 64431892 63846573 64151917 64384483 63715534 63412071 63280071 63939659 64770012
566.1 64770012 64731125 64697540 65193451 65528458 64774055 64341896 64017349 63206230 62808105 63208244
575.8 63208244 63789227 63009815 62639587 62619476 62257038 62819931 63489536 63434078 63165047 63245235
585.4 63245235 62904449 62928165 62540680 61871254 62443443 62490166 62536034 62517925 62028122 61373016 61049953
596 61049953 61472862 61563087 61858410 61144821 59701225 59026772 58814247 59084076 59032188 59152668
605.6E9152668K50217P94854L91521n42179j46206m31965k77889J70219O35834R0870
615.3F0087944j3477Q84231k13588m66713k1820J8787L63369P00684R9758n95921K59461
625.9F1102715N30689L14052M64657J58890p75635o89323O4628J43364N20230L52325
635.5F2186592k75368o70711p9765O85245M00467j84113n69439K18182j78947l76862
645.2F1155281O10909R7122k07478k47013j66084Q8619M97940J20007j46832N77786
654.8F2380257l97675k33333O57836K32083L29723K07340k59250k08958J84425m0088
664.5F2852360M5570K61246j05564O23409K33017m10168n8162M38362j32775n93631
674.1F3153664k5910M67945L14305j40381N33912O63514l17154k22184L95813m8843
$$ plain form
605.6 59152668 59402885 60197739 60589260 60047081 59900875 59468910 59191021 59361240 59997074 60087944
615.3 60087944 60074467 60958698 60745110 60278397 60256577 60275364 60638733 61339417 61439175 60843254 61102715
625.9 61102715 61633404 61947456 62412113 62571003 61795368 61106045 61170673 61314037 61834267 62186592
635.5 62186592 61911224 61240513 61160748 61845993 62246460 62062347 61492908 61711090 61532143 61155281
645.2 61155281 61766190 61863312 61655834 61408821 61242737 61331356 61829296 61949303 61802471 62380257
654.8 62380257 61982582 61749249 62407085 62639168 62968891 63176231 62916981 62708023 62892448 62852360
664.5 62852360 62897930 63159176 63053612 63677021 63910038 63499870 63441708 63880070 63747295 63153664
674.1 63153664 63127754 63595699 63910004 63769623 64303535 64967049 64649895 64427711 64823524 64774681
683.8F4774681k36816P66052L86063j82915M4388m01902j77238J99921J66488M42879
693.4F5781601K13036N592K24525j75743J08620M68964j82160j51497K26227M00482
703.1F6919647K47208J08185R1247R1782Q407l07495K88147L57163n7015J35788O7269
713.7F7950333Q072o7048J6343J46171K89368R9251K60368P08305J02898j07437J6838
724.3F9423462J36635j3840j47560J16051L03726M01062j27831J45302K58591P4112
733.9G0569710M43756J30142J7906j44561L26721M19380k30980n890k32498j47156
743.6G1146530L87901O64391L23074o0653L08090J95236J03531J95915n8250K0225
753.2G3225990K84745Q4976L08426K68440l01582O8862J02532K89040L11927k63359
$$ plain form
683.8 64774681 64537865 65303917 65689980 65507065 65551453 65149551 64972313 65172234 65338722 65781601
693.4 65781601 65994637 66000229 66224754 66049011 66157631 66626595 66444435 66292938 66519165 66919647
703.1 66919647 67166855 67275040 67366287 67458069 67466476 67158981 67447128 67804291 67747276 67883064 67950333
713.7 67950333 67958405 67891357 67907700 68053871 68343239 68442490 68702858 69411163 69514061 69406624 69423462
724.3 69423462 69560097 69546257 69398697 69514748 69818474 70219536 70091705 70237007 70495598 70569710
733.9 70569710 71013466 71143608 71161514 71016953 71343674 71763054 71532074 71526184 71293686 71146530
743.6 71146530 71534431 72198822 72521896 72461243 72769333 72964569 73068100 73264015 73205765 73225990
753.2 73225990 73510735 73595711 73904137 74172577 73870995 73939857 74042389 74331429 74643356 74379997
762.8G4379997K4513K12548R4185j37398J28792L35533K85736M29138J63727L96271
772.5G6313042K66128j19995n9898L01567P06856j3337n59784m11621N4673N77148
782.1G7054779M92569J09390k17788j29197O9130m8561k17125L5065j46408l62984
791.8G6638870n974l2310M3259k11487k1591L84323k74643l82401k6161R9114k61033
802.4G5949966k91923Q0009j09985j8684j78383l37624k37243p03476m71070J08307
812G3789894m27704o90628l61175l68630j63276j19919j36917j91697n00953n46044
821.7G0282951j76162n4734n72624k64427j60255l17208p1205k46361N7099m56162
831.3F8020912j024956o00090j21200K97081n4894j24969j93016m21463k4254J45790
$$ plain form
762.8 74379997 74404510 74617058 74711243 74573845 74702637 75038170 75323906 75753044 75916771 76313042
772.5 76313042 76579170 76459175 76399277 76700844 77407700 77394363 76834579 76422958 76477631 77054779
782.1 77054779 77547348 77656738 77438950 77309753 77378883 77330322 77113197 77148262 77001854 76638870
791.8 76638870 76632896 76600586 76643845 76432358 76410767 76795090 76520447 76138046 76111885 76210999 75949966
802.4 75949966 75658043 75738052 75628067 75609383 75431000 75093376 74856133 74152657 73681587 73789894
812 73789894 73362190 72671562 72310387 71941757 71778481 71658562 71521645 71329948 70828995 70282951
821.7 70282951 70106789 70052055 69479431 69215004 69054749 68737541 68666336 68419975 68477074 68020912
831.3 68020912 66995956 66395866 66274666 66571747 66516853 66391884 66198868 65777405 65753151 65898941
841F5898941k35474l50936J17042J67946J930k70737k5199M20463l04504k07077L32679
851.6F5545074j3031J96969L50082R7389J18881K93694Q86520P60186L17596P12990
861.2F9266350R13536J117637J235192J220993J270714J280800J120834R76608J238724
869.9G9641388J047462O51719O08764P95395M28063J50421M27078l6820j5533J41441
879.5H3839378J47904M35531k06863j21552N776m14162j69418o40381o21063J1078
889.2H2266228k1752j74476l61969j60225k08367o68853m78806R5780K36862p332k30301
899.8H0286789l27881j61529o5644r9296O4109n8425m42635l67973k23359k92297j13502
910.4G8198357P4829N569n45212q38554k42821J27335l5698k16240l9215O9656l14254
$$ plain form
841 65898941 65663467 65312531 65429573 65597519 65599449 65328712 65303513 65723976 65419472 65212395 65545074
851.6 65545074 65532043 65729012 66079094 66176483 66295364 66589058 67475578 68235764 68553360 69266350
861.2 69266350 70179886 71297523 72532715 73753708 75024422 76305222 77426056 78402664 79641388
869.9 79641388 80688850 81340569 81949333 82744728 83172791 83323212 83750290 83713470 83697937 83839378
879.5 83839378 83987282 84422813 84215950 84094398 84100174 83686012 83516594 82876213 82255150 82266228
889.2 82266228 82244476 82070000 81708031 81547806 81339439 80670586 80191780 80287560 80524422 80517090 80286789
899.8 80286789 79958908 79797379 79731735 79632439 79696548 79638123 79195488 78827515 78604156 78311859 78198357
910.4 78198357 78273186 78278755 77733543 76894989 76652168 76779503 76743805 76527565 76488350 76558006 76243752
921G6243752m37729j09497K23815K07306j33209r9426J71127J01586J74392P744l46306
931.6G6003555k00721j35735m6242j26793j72760J51245o7314k54974j80466l32351
941.3G4637444m46297l34686m1451J51024L21487K64595k32818l56110J69388M51408
950.9G4583984M06731L00346L36029N13573K96433K75421M05372J09200o279K56454
960.6G7477264K41150p3364J81206L31970K4750P9361J15547N4535m6219j3039N3269
971.2G8426430j076J20110L173L1746o9168l47358r9755O0112j34254m55994j92306
981.8G7341660J49696K1667j27487j70036J6579k95067l37281k39975m81605M913j495
992.4G5881569k74773j90124k56623j87133m11080m32678k89986l96759k56988m63516
$$ plain form
921 76243752 75806023 75696526 75920341 76127647 75994438 75895012 76066139 76167725 76342117 76349861 76003555
931.6 76003555 75802834 75667099 75620857 75494064 75321304 75472549 75405235 75150261 74969795 74637444
941.3 74637444 74191147 73856461 73815010 73966034 74287521 74552116 74319298 73963188 74132576 74583984
950.9 74583984 74990715 75291061 75627090 76140663 76437096 76712517 77117889 77227089 77220810 77477264
960.6 77477264 77718414 77645050 77826256 78158226 78182976 78262337 78377884 78432419 78386200 78373161 78426430
971.2 78426430 78425354 78545464 78548637 78580383 78511215 78163857 78064102 78124214 77989960 77533966 77341660
981.8 77341660 77491356 77513023 77385536 77215500 77232079 76937012 76599731 76359756 75878151 75883064 75881569
992.4 75881569 75606796 75416672 75160049 74972916 74561836 74129158 73839172 73442413 73185425 72721909
1002G2721909r12110p85660n16906m86878o44554q61328p26440n95124q77159r44237
1011.7F5371513r83932j264279j216217j245166j264428j062786j040176j055996p86964
1020.3E5451569m07513n75638n24372m84211l04729P1552l04321k38347j4114n2330
1030E2617546j7128J18172J83925k9426r4143P6076k1312o13976j93676K19094k65545
1040.6E1979607m98726m09664j80256n14187k80640n18230o81278J72382j30806Q0841
1050.2D9019043K4773k84111m8294j39050J20090M0169R396k53105m02821j67774l47557
1060.9D7570759m93859k19722K01824r1850j61389m37134p17971k08832k7901j96621
1070.5D5217304n81253m70508j58589k0710l26561o87420m80022k64416k50950o27384
$$ plain form
1002 72721909 71809799 71024139 70507233 70020355 69375801 68514473 67788033 67192909 66315750 65371513
1011.7 65371513 64387581 63123302 61907085 60661919 59397491 58334705 57294529 56238533 55451569
1020.3 55451569 55044056 54468418 53944046 53459835 53155106 53226658 52922337 52683990 52669876 52617546
1030 52617546 52600418 52718590 52902515 52873089 52778946 52855022 52833710 52219734 52026058 52245152 51979607
1040.6 51979607 51480881 51071217 50890961 50376774 50096134 49577904 48896626 49069008 48938202 49019043
1050.2 49019043 49043816 48759705 48711411 48572361 48692451 48732620 48742016 48488911 48086090 47918316 47570759
1060.9 47570759 47076900 46857178 47059002 46967152 46805763 46368629 45650658 45441826 45413925 45217304
1070.5 45217304 44636051 44165543 44006954 43986244 43659683 42972263 42492241 42227825 41976875 41349491
1080.1D1349491m46792m47850l31817j70777p23888n34004n41508o03703n03891k89116
1089.8C6756145j43272p9601m3598m31816O2740N5820o6700O7349K12211P12708L08212
1100.4C7410198L4592K85686O69480M40868L88043N27607M50099O25039L70052O28975
1110D1830639M74892K12959K79003L53489O32042P2208j86218l8555L06370K29404
1119.7D4166233q1013J66302J44684K89909M04381M12422j13434N92P34478N06622
1129.3D6631176L71223K79118M73869P77295P82592N23491N39177P11121N39303P07752
1139E2336117P16053R92115R00101Q52977J524098J673973J888408K259160K591678
1147.6F5734680K355347K074081K375275K430977J623039J197960J291649J032677
$$ plain form
1080.1 41349491 40902699 40454849 40123032 39952255 39228367 38694363 38152855 37549152 37045261 36756145
1089.8 36756145 36612873 36533272 36489674 36057858 36120598 36176418 36109718 36177067 36389278 37101986 37410198
1100.4 37410198 37444790 37730476 38399956 38840824 39228867 39756474 40206573 40831612 41201664 41830639
1110 41830639 42305531 42518490 42797493 43150982 43783024 43855232 43669014 43630459 43936829 44166233
1119.7 44166233 44085220 44251522 44396206 44686115 45090496 45502918 45389484 45390076 46124554 46631176
1129.3 46631176 47002399 47281517 47755386 48532681 49315273 49838764 50377941 51089062 51628365 52336117
1139 52336117 53052170 54044285 54944386 55797363 57321461 58995434 60883842 63143002 65734680
1147.6 65734680 68090027 70164108 72539383 74970360 76593399 77791359 79083008 80115685
1155.4H0115685O36497J10420L1861J1230J90575J54937m42024l38791N6389k3094
1165H0503685j67862k49191m19693k77481l25890l00949j31851l59856o0036L4195
1174.6G8245071l42292m95446l47435N8289J77368m1305k84569p8873l18016n04425
1184.3G6068367J205j9676L1906K19681J67946l01750n10208l4943q4152k88925l85987
1194.9G4863464j94053k9267j32484o3789m23546m46884j33942k51526k82547k77039
1204.5G2628387k96318k61589n16113q09662n95978l24798l33443n47470p96234p41997
1214.2F7404785o32995n99732q10043j058975j000031r45526q51563j038799j201580
1222.9E9265541j299915j631691j502465j405666j169079j191135j299332j040741
$$ plain form
1155.4 80115685 80752182 80862602 80894463 80905693 81096268 81251205 80809181 80470390 80526779 80503685
1165 80503685 80335823 80086632 79666939 79389458 79063568 78762619 78630768 78270912 78210876 78245071
1174.6 78245071 77902779 77407333 77059898 77118187 77295555 77254250 76969681 76890808 76572792 76068367
1184.3 76068367 76069572 76049896 76081802 76301483 76469429 76167679 75657471 75622528 75538376 75249451 74863464
1194.9 74863464 74669411 74640144 74507660 74443871 74020325 73573441 73439499 73187973 72905426 72628387
1204.5 72628387 72332069 72070480 71554367 70744705 70148727 69823929 69490486 68943016 68146782 67404785
1214.2 67404785 66771790 66172058 65362015 64303040 63303009 62357483 61505920 60467121 59265541
1222.9 59265541 57965626 56333935 54831470 53425804 52256725 51065590 49766258 48725517
1230.6D8725517j325279j243813j209320j118476j067246j023392o11068o83403o82671
1239.3C9760849p22446l65536k79717k88799k66857o36082k61154k8389p8041k47086
1248.9C6586742n1170k3457j319K11029j34327K1202n9506J05946M4197o7398K87903
1259.5C6919842j637J26324J48277L35358L76469L25882M08462L30944O15105M29333
1269.2D0014359M91672M99134N21172O18320P05425R11053Q35926J045185Q12611Q31592
1278.8D7286449Q67321Q32715J057193J055943J081737P20864O71753Q43475J007240
1287.5E5424690P39376M62670O88286O03641M71222K75272M15291N49793N06451K94418
1297.1F0431110j0387J19675J15154K9976q0155J58379J58642k14535j83033j64719
$$ plain form
1230.6 48725517 47400238 46156425 44947105 43828629 42761383 41737991 41126923 40443520 39760849
1239.3 39760849 39038403 38672867 38393150 38104351 37837494 37201412 36940258 36911869 36833828 36586742
1248.9 36586742 36535572 36512115 36510796 36721825 36587498 36608700 36549194 36655140 36699337 36631939 36919842
1259.5 36919842 36918205 37044529 37192806 37528164 37904633 38230515 38638977 38969921 39585026 40014359
1269.2 40014359 40506031 41005165 41526337 42144657 42850082 43761135 44597061 45642246 46454857 47286449
1278.8 47286449 48153770 48986485 50043678 51099621 52181358 52902222 53573975 54417450 55424690
1287.5 55424690 56164066 56626736 57315022 57918663 58389885 58665157 59080448 59630241 60136692 60431110
1297.1 60431110 60420723 60540398 60655552 60685528 60605373 60763752 60922394 60707859 60524826 60360107
1306.8F0360107l2135k76573k76176J91799J09127k55970l91525m7879o3968k17770
1316.4E9099037j69216j00620j51806k47296j75045k17628J22021J2882k46571j70383
1326E7755375k63802l9810l3661J13411R7683n4962J53503K70176K12750q8539m7024
1336.7E8075100J09562L42949L17482J38450J20694N8536M41433L00636J17047J31778
1346.3F0153667N1804R3613J19182J15238n2169J13762j54744l89068k84794m62719
1355.9E9303772m70295n35488m43432m85561m92707l49338o02417q37189q04539n97786
1365.6E3685020p90111q58765q31203j065739q67283q70895p30263o78760m85104j77593
1375.2D6329304r6936J19015K22954P49123O87534Q18455R84287J126575J086613R59484
$$ plain form
1306.8 60360107 60327972 60051399 59775223 59967022 60076149 59820179 59428654 59380775 59316807 59099037
1316.4 59099037 58929821 58829201 58677395 58430099 58255054 58037426 58159447 58172329 57925758 57755375
1326 57755375 57491573 57451763 57418102 57531513 57629196 57574234 57727737 57997913 58210663 58122124 58075100
1336.7 58075100 58184662 58527611 58845093 58983543 59104237 59162773 59604206 59904842 60021889 60153667
1346.3 60153667 60205471 60299084 60418266 60533504 60481335 60595097 60440353 60051285 59766491 59303772
1355.9 59303772 58833477 58297989 57854557 57368996 56876289 56526951 55924534 55087345 54282806 53685020
1365.6 53685020 52894909 52036144 51204941 50139202 49271919 48401024 47670761 46992001 46506897 46329304
1375.2 46329304 46232368 46351383 46574337 47323460 48010994 48829449 49813736 50940311 52026924 52986408
1384.9E2986408J110378P83963J099098N44533M52099N06088J99310J09394k1225j3447
1394.5E7756599n17601l38333n72811o13716p41753p95360m12769q06511n49179o34827
1404.2E1773739r46854m55665m52595m67137n68431k98561m29890l59364k76725n17796
1413.8D7000721k89829k93503P3410r5783J03294J82526n95085j01201l42887l3131
1423.4D5608532k32906j7723N9745p3547J57875k09248m2800p7679L42037J549P431
1434.1D5523266M00402j19961Q31570m997J97464K20665M97272N37174J14266P21138
1443.7D8918259K34260N91740K78461M25133J060253M99420Q67432L77708R82220M44767
1453.3E4679653N34859Q02849M51767K650261l04429J013253M90272N08946P60994
$$ plain form
1384.9 52986408 54096786 54880749 55979847 56524380 56976479 57482567 57681877 57791271 57770046 57756599
1394.5 57756599 57238998 56900665 56327854 55714138 54972385 54177025 53764256 52957745 52408566 51773739
1404.2 51773739 50826885 50371220 49918625 49451488 48883057 48584496 48154606 47795242 47518517 47000721
1413.8 47000721 46710892 46417389 46490799 46395016 46498310 46680836 46085751 45984550 45641663 45608532
1423.4 45608532 45375626 45357903 45417648 45344101 45501976 45292728 45249928 45172249 45514286 45515835 45523266
1434.1 45523266 45923668 45803707 46635277 46630280 46827744 47048409 47545681 48082855 48197121 48918259
1443.7 48918259 49152519 49744259 50022720 50447853 51508106 52007526 52874958 53252666 54234886 54679653
1453.3 54679653 55214512 56017361 56469128 59119389 58814960 59828213 60318485 60827431 61588425
1462F1588425P84645J020416M64214J500737M79484Q18428J008682P01508Q41026K90146
1471.7F9497711J474266O12221Q15895N15579O90399R30230L95408Q90168M09912Q13064
1481.3G7044853N93582M46564O72768M36363O82907K79617Q37082M51561O62323N96405
1491H2704025L4851M80477K37663N51804K08183N83832K84546j51642M93202K8023
1500.6H5454964J53869O4507L23952K50488j23161O76628R73678K75810p83996r8671
1510.2H7168068j3199J03546J15242j85768J71120j98853M52851J80992m01146K34764
1519.9H7627617m2153k21084l60832j6220J32698l830k70554j68175q7394l83316p3670
1530.5H6133087j01127j39290P4852n0354j45195l83759j66313r1499L86512m3571
$$ plain form
1462 61588425 62373070 63393486 63857700 65358437 65837921 66656349 67665031 68366539 69207565 69497711
1471.7 69497711 70971977 71584198 72400093 72915672 73606071 74536301 74931709 75821877 76231789 77044853
1481.3 77044853 77638435 78084999 78757767 79194130 79877037 80156654 80993736 81445297 82107620 82704025
1491 82704025 82738876 83219353 83457016 84008820 84217003 84800835 85085381 84933739 85426941 85454964
1500.6 85454964 85608833 85673340 85997292 86247780 86124619 86801247 87774925 88050735 87266739 87168068
1510.2 87168068 87154869 87258415 87373657 87187889 87359009 87160156 87613007 87793999 87392853 87627617
1519.9 87627617 87585464 87364380 87003548 86987328 87120026 87116196 86845642 86677467 86590073 86206757 86133087
1530.5 86133087 86031960 85892670 85967522 85917168 85771973 85388214 85221901 85130402 85516914 85473343
1540.1H5473343j388847m8333p85957n77690n60097o78276j81534l92181l47267m51317
1549.8H0061844m27719n24155m43512m3938n37368r92226n04440P3868P1449k47048
1559.4G6486755j999633q80639k04017m67331k60697l92379m27841k40166n7617L54950
1569.1G1911385J89994j66038r4917K73170K71858J60782L09097R93432N25367L59200
1578.7G4733330M49287L21015O57859P64435P08634O93206P09603O04996Q27964R14543
1588.4H1384872L99125O15829P41234Q30994M96727N61164N87654K79618O44081L80340
1598H6921638N93773L44735K02293L58154K66831L25294J2207M36470K40883M8607
1607.6H9750885J21811l876P6569j8486J3809k15485K6696J59973L74916q9600l57757
$$ plain form
1540.1 85473343 84084496 84036163 83250206 82672516 82112419 81434143 81252609 80860428 80513161 80061844
1549.8 80061844 79634125 79109970 78666458 78622520 78085152 77092926 76588486 76662354 76733803 76486755
1559.4 76486755 74487122 73606483 73402466 72935135 72674438 72282059 71854218 71614052 71556435 71911385
1569.1 71911385 72101379 71935341 71840424 72113594 72385452 72546234 72855331 73848763 74374130 74733330
1578.7 74733330 75182617 75503632 76161491 76925926 77634560 78327766 79037369 79642365 80470329 81384872
1588.4 81384872 81783997 82399826 83141060 83972054 84468781 85029945 85617599 85897217 86541298 86921638
1598 86921638 87515411 87860146 88062439 88420593 88687424 89012718 89024925 89461395 89702278 89750885
1607.6 89750885 89872696 89868820 89945389 89926903 89940712 89725227 89751923 89911896 90286812 90197212 89839455
1618.2H9839455J13372l46107k68898j02203J79435j35803m67049k41439j98014N3879
1627.9H8426628m42406j08314n5084l06984l91922k95883J80191M12086m3640o33270
1637.5H6741402m43879j68907j40411j2146k08374j77506k71934J1459k11387m16138
1647.2H4702179M29695l77006j54679K7992M36898J624466j220902o15539l45063j87095
1656.8H4320946j94580J13083J472k0187R2186M7134R5932j95816K5375K2782J24382
1667.4H4432709L97026N48851p9201l51433R6421L2760J08566J6610J27121J19644
1677.1H5449074j64757Q1566j49735M3358J22780N3070J50055o01028j46103p03186
1686.7H4135094k64565k00661k80250n35622p34535n33897j016869n70084n81535j766960
$$ plain form
1618.2 89839455 89952827 89606720 89337822 89235619 89415054 89279251 88812202 88570763 88372749 88426628
1627.9 88426628 87984222 87875908 87820824 87513840 87121918 86826035 87006226 87418312 87374672 86741402
1637.5 86741402 86297523 86128616 85988205 85976059 85767685 85590179 85318245 85329704 85118317 84702179
1647.2 84702179 85131874 84754868 84600189 84628181 85065079 86689545 85468643 84853104 84508041 84320946
1656.8 84320946 84126366 84239449 84240921 84220734 84312920 84360054 84455986 84260170 84285545 84308327 84432709
1667.4 84432709 84829735 85378586 85299385 84947952 85044373 85077133 85185699 85202309 85329430 85449074
1677.1 85449074 85284317 85365883 85216148 85259506 85382286 85435356 85585411 84984383 84838280 84135094
1686.7 84135094 83870529 83669868 83389618 82853996 82119461 81585564 80568695 79998611 79417076 77650116
1696.4G7650116j096809q58284j97548m55361m087219j558098j070022j476235k243851
1705F4606689j366527j488880j577580j044399j249310j141254r90643r36428m98165
1713.7E4313503o56872m22351l08773J02897k91881o84433k18827n61012l19763n54752
1723.4E0397736n78186m63547o40190n88150q13900n06035j126007r40438n14263l41743
1733D3885277L19206j294628K99538j50483L43769K27345J053429K401455R99420J872551
1742.7D9956879K392193L105136K289963K871433L299538L439266M223030K400650
1750.4G3978088L970360L669090J971482J977127K105705J844689J615867J554688
1758.1I2687096P35016P59819N85212R78638R75784J65344L23617L38020L01750K59964
$$ plain form
1696.4 77650116 76553307 75695023 75497475 75042114 70954895 69396797 68326775 66850540 64606689
1705 64606689 63240162 61751282 60173702 59129303 57879993 56738739 55748096 54811668 54313503
1713.7 54313503 53656631 53234280 52925507 53028404 52736523 52052090 51833263 51272251 50952488 50397736
1723.4 50397736 49819550 49356003 48715813 48127663 47313763 46807728 45681721 44741283 44227020 43885277
1733 43885277 44204483 42909855 43209393 43058910 43402679 43630024 44683453 47084908 48084328 49956879
1742.7 49956879 52349072 55454208 57744171 60615604 63915142 67354408 71577438 73978088
1750.4 73978088 77948448 81617538 83589020 85566147 87671852 89516541 91132408 92687096
1758.1 92687096 93422112 94181931 94767143 95745781 96721565 96886909 97210526 97548546 97850296 98110260
1767.7I8110260L27644K23961K77344K48543J39541J08643q0132K6474J03646K42973
1777.4I9728897J04393Q7708J65794K13242J16584j88141M8539J72546J33400M3327
1787A00626289l3172J67396K13654J72859p072N2581j67228j9753K43988J8685j39260
1797.6A01128967k0027J15654J0803P4112L022m8638J60736J53557j8372j36474O9
1808.2A01423409r4010L2913K02103o7497J41098K24159m6463k67647j8715J06911
1817.9A01636261Q224P0748N9028O9886j54457j55945j9730J35636Q3938j60095k4292
1828.5A01549202J67160K92511j21017j16814K8259k0973J4526N1659Q8409n3009J1856
1839.1A01891769L6766L0678o9641k48039K15080K47109o4301J6312K9777J14640o1944
$$ plain form
1767.7 98110260 98437904 98661865 98939209 99187752 99327293 99435936 99355804 99382278 99485924 99728897
1777.4 99728897 99833290 99920998 100086792 100300034 100416618 100228477 100277016 100449562 100582962 100626289
1787 100626289 100593117 100760513 100974167 101147026 101139954 101192535 101025307 101005554 101249542 101268227 101128967
1797.6 101128967 101108940 101224594 101235397 101309509 101312531 101263893 101424629 101578186 101559814 101423340 101423409
1808.2 101423409 101329399 101362312 101564415 101496918 101638016 101862175 101815712 101548065 101529350 101636261
1817.9 101636261 101644485 101715233 101774261 101844147 101689690 101533745 101514015 101649651 101733589 101573494 101549202
1828.5 101549202 101716362 102008873 101887856 101771042 101799301 101778328 101792854 101844513 101932922 101879913 101891769
1839.1 101891769 101928535 101959213 101889572 101641533 101856613 102103722 102039421 102055733 102085510 102200150 102138206
1849.7A02138206n4412k6940J32614P4860j56784N1712Q7715j04828m3686J21025q0543
1860.3A02138939j6274K32544L5248k32139k08336J57982K60360K01927j0505k84584
1869.9A02275162Q0749N4695j26930j27052L6056K19681P9498n8059J709p7347k3598
1880.6A02334564j0948j04897J04912M990k4490J06193n2856k5597J32683Q2290j58248
1891.2A02388596l1952J1642J04317J01272k04895N7579J21598J00990k0699n9936
1900.8A02568512J13029j70356r1545R2514J03599m0077j98998k6046J05919J94175
1910.4A02650726j0475K6146J02966j4694K3674m6074j05514p7744P9773o7322r0614
1921.1A02470848p919m3816P7721J58096J84784o0860j52244j09413J43104K21062
$$ plain form
1849.7 102138206 102083794 102056854 102189468 102264328 102107544 102159256 102246971 102142143 102098457 102219482 102138939
1860.3 102138939 102122665 102355209 102390457 102158318 101949982 102107964 102368324 102570251 102559746 102275162
1869.9 102275162 102355911 102410606 102283676 102156624 102192680 102412361 102491859 102433800 102435509 102358162 102334564
1880.6 102334564 102323616 102218719 102323631 102328621 102304131 102410324 102357468 102331871 102464554 102546844 102388596
1891.2 102388596 102356644 102368286 102472603 102573875 102368980 102426559 102548157 102649147 102628448 102568512
1900.8 102568512 102681541 102511185 102419640 102512154 102615753 102575676 102376678 102350632 102456551 102650726
1910.4 102650726 102640251 102666397 102769363 102754669 102778343 102732269 102626755 102549011 102628784 102561462 102470848
1921.1 102470848 102462929 102419113 102496834 102654930 102839714 102778854 102626610 102517197 102660301 102881363
1930.7A02881363j53763k5352M8782R0126P6057m2724J9737r5863o7238P2517J75438
1941.3A02979080j16073k09908R5482l13K3918P6905N2215k24472o9771J24878k1621
1951.9A02710320R7763p080J08451P5066n6397m2511o1508K51747J03508j63719q8554
1962.5A02927086j1803m9217J7265N9120j10488l0396m5517J91597L02399l0861r2865
1973.1A03126320n127O2134o4545l334l3836n8487J44546j5999K5353J00273R117O2965
1984.7A03349380K2469o8710j12900r0179R3376J13479m3907M6379l7308j29516n1743
1995.3A03090820P6775K41310L0670o6955n9227j1818J02676l8322j30364j66336o737
2005.9A03062492N5054p660N8632P4059J51290o8687j92223L7087k8259r9129K4460
$$ plain form
1930.7 102881363 102727600 102702248 102751030 102841156 102917213 102874489 102894226 102798363 102731125 102803642 102979080
1941.3 102979080 102863007 102653099 102748581 102748268 102772186 102849091 102901306 102676834 102607063 102731941 102710320
1951.9 102710320 102808083 102801003 102909454 102984520 102928123 102885612 102824104 103075851 103179359 103015640 102927086
1962.5 102927086 102915283 102866066 102883331 102942451 102831963 102801567 102756050 102947647 103250046 103219185 103126320
1973.1 103126320 103121193 103183327 103118782 103115448 103081612 103023125 103167671 103151672 103177025 103277298 103286415 103349380
1984.7 103349380 103371849 103303139 103190239 103100060 103193436 103306915 103263008 103309387 103272079 103142563 103090820
1995.3 103090820 103167595 103408905 103439575 103372620 103313393 103301575 103404251 103365929 103235565 103069229 103062492
2005.9 103062492 103117546 103109886 103168518 103242577 103393867 103325180 103132957 103170044 103141785 103042656 103067116
2016.5A03067116L0403J8188Q3794O5834o3080o0043L2738j14601r9282P5745L4164
2027.1A03070976p9345n074K44644J08948r9815r2003o5804m8851o6055R1637J25320
2037.7A03184578Q2664j10557j34873J29219r422K9236M6753p7126m3953o9602m8287
2048.4A02978630m3030L4485O8772J28234j3412k13593J8593J00823j6198k2293J2947
2059A03033958m0344o9237o9435M8142J28540P171Q9531j6670l5888Q8066K9312R8022
2070.5A03291168p629q9829m9682p9338j43616J8669J82838p2799j32942O1096J30127
2081.1A03108063J7807O3141J6479j36230L1601j22170j07071J80397M2885j56151
2090.8A02938751o0119J39328J42128N9928j49002k18391q4747J45439J82030l4203
$$ plain form
2016.5 103067116 103097519 103115707 103199501 103265335 103202255 103142212 103174950 103060349 102961067 103036812 103070976
2027.1 103070976 102991631 102986557 103231201 103340149 103240334 103148331 103082527 103033676 102967621 103059258 103184578
2037.7 103184578 103267242 103156685 103021812 103151031 103141609 103170845 103217598 103140472 103096519 103026917 102978630
2048.4 102978630 102935600 102970085 103038857 103167091 103153679 102940086 102958679 103059502 103043304 103021011 103033958
2059 103033958 102993614 102924377 102854942 102903084 103031624 103038795 103128326 103111656 103075768 103163834 103193146 103291168
2070.5 103291168 103283539 103193710 103144028 103064690 102921074 102939743 103122581 103049782 102916840 102977936 103108063
2081.1 103108063 103125870 103189011 103205490 103069260 103100861 102978691 102871620 103052017 103094902 102938751
2090.8 102938751 102878632 103017960 103160088 103220016 103071014 102852623 102767876 102913315 103095345 103061142
2100.4A03061142J66359N8052k16171j26770j38794O8J16135L8055o4216r3460n3101
2111A02747299O7238J77933J17683q6426k65617o2164J34933R8633n028o2629q9806
2121.6A02772049j55129Q8410K15668q63j28273j11579k4865J31920J28937l9932l6179
2132.3A02840164j05980k0294J10222M4548N9814q1077j51917q2130K8679m3900o4613
2142.9A02533516J65367J14426O5590l6827j52482k5299R7794J3100o6399O5575J9500
2153.5A02793861j54724k35550J91903L58718j00311j92398k50977m6630J93817M1633
2163.1A02599342j70875k10274K02164K21275l5248j28463j37337J44066J79824p7880
2172.8A02586594p7538K0638O7443L15445J93215j44303j71249j70082k7916K6169
$$ plain form
2100.4 103061142 103227501 103285553 103069382 102942612 102803818 102803886 102920021 102958076 102893860 102800400 102747299
2111 102747299 102814537 102992470 103110153 103023727 102758110 102695946 102830879 102929512 102924484 102861855 102772049
2121.6 102772049 102616920 102705330 102920998 102920135 102791862 102680283 102655418 102787338 102916275 102876343 102840164
2132.3 102840164 102734184 102713890 102824112 102868660 102928474 102847397 102695480 102613350 102642029 102598129 102533516
2142.9 102533516 102698883 102813309 102878899 102842072 102689590 102664291 102762085 102775185 102708786 102774361 102793861
2153.5 102793861 102639137 102403587 102595490 102954208 102853897 102661499 102410522 102363892 102557709 102599342
2163.1 102599342 102428467 102218193 102420357 102641632 102606384 102477921 102340584 102484650 102664474 102586594
2172.8 102586594 102509056 102529694 102597137 102912582 103105797 102961494 102790245 102620163 102592247 102618416
2182.4A02618416Q476Q8631J00258q1665k04720j24855o7986R5376J18827J26618Q1764
2193A02759140j4549L0578j02829p6843j4557k2705n7182J1062K48971J72828N043
2203.6A02938957o9740l5675k754M2007m5143j06606J61301J28098P850n2108L730
2214.2A02969917J15860l0380p2136j579K6939j07597p3448k8099N8197J79763K7024
2224.8A03064461J25610o7337j77589M6806N5740Q7624q1001n7389n981J4503R9648
2235.4A03105095r0729j7402R2361p2136M883J14273j63727j30363O3926L2936J80123
2246A03119240J09222j55556j76841N2612J9310r1637n3108j22108J06933J65482N8220
2256.7A03031769q072j06476O1234M2434l6247M7836N5642k4056M2351P5226j19881
$$ plain form
2182.4 102618416 102626892 102715523 102815781 102734116 102529396 102404541 102336555 102431931 102550758 102677376 102759140
2193 102759140 102744591 102775169 102672340 102595497 102580940 102558235 102501053 102512115 102761086 102933914 102938957
2203.6 102938957 102869217 102833542 102830788 102872795 102827652 102721046 102882347 103010445 103018295 102966187 102969917
2214.2 102969917 103085777 103055397 102983261 102981682 103008621 102901024 102827576 102799477 102857674 103037437 103064461
2224.8 103064461 103190071 103122734 102945145 102991951 103047691 103135315 103054314 102996925 102990944 103005447 103105095
2235.4 103105095 103014366 102996964 103089325 103017189 103022072 103136345 102972618 102842255 102906181 102939117 103119240
2246 103119240 103228462 103072906 102896065 102948677 102967987 102876350 102823242 102701134 102808067 102973549 103031769
2256.7 103031769 103023697 102917221 102978455 103020889 102984642 103032478 103088120 103064064 103106415 103181641 103061760
2267.3A03061760j18767M6456Q2504p3441j19301l5972J65436Q8066k80014q4702J34041
2277.9A02866066J43517L1738j24092K82O5414N9517J8357n8426k06070j04515Q6525
2288.5A02778313Q5418P2396j18859o6482l700l6683K4888M8843L6484k983K2911k49634
2300A02590912j38481O1783O3217K03842j84387j46920L6591r5863M3838J07414l3447
2310.7A02508499k28775j37337q6105O4316K41333K81723Q6014j80199p339o1249Q8997
2321.3A02569878n7373m79096k21115J5160J20628j34094k16797K525K98554k6390
2330.9A01871880k15638K76436o0623K7885N7465p2945J79223M11956L36174l89160
2340.6A02422653k12417k17118m04236P8957L01674j34079k49512J95618j41640k40257
$$ plain form
2267.3 103061760 102942993 102989449 103071953 102998512 102879211 102843239 103008675 103096741 102816727 102732025 102866066
2277.9 102866066 103009583 103041321 102917229 102917511 102982925 103042442 103060799 103002373 102796303 102691788 102778313
2288.5 102778313 102863731 102936127 102817268 102750786 102747086 102710403 102735291 102784134 102820618 102817635 102840546 102590912
2300 102590912 102452431 102514214 102577431 102781273 102596886 102449966 102486557 102390694 102434532 102541946 102508499
2310.7 102508499 102279724 102142387 102056282 102120598 102361931 102643654 102729668 102549469 102542130 102480881 102569878
2321.3 102569878 102512505 102033409 101812294 101827454 101948082 101813988 101597191 101599716 101898270 101871880
2330.9 101871880 101656242 101932678 101872055 101899940 101957405 101884460 102063683 102475639 102811813 102422653
2340.6 102422653 102210236 101993118 101588882 101667839 101969513 101835434 101585922 101781540 101639900 101399643
2350.2A01399643J06834J77002O4606K13921L79875o24710k43836r7275m55955M88892
2359.8A01408997P7774l24356m59343M32754P00714j37214K02095p7019n39810m89922
2369.5A00794670J99127N46112K07726K87475K404l05924k7107J05339O9992L6247
2379.1A01916061o5780L3813N5954J702J21025J38794M7981j4092Q8837Q2886P1037
2389.7A02478218m0878l43163n3520J75087P3448Q5480j14716k18010l2447L9314m1382
2400.3A02007431J32179J95183j37466k32552p8918k8687J0063J18592M4990k42523
2410A01788292j86455J54038J30577P6286l8834j10809P3143j90391j44837P5279Q5244
2420.6A01711533J69616o2202N180l1204r9793K2378p4143N165m7981r964L1471N1178
$$ plain form
2350.2 101399643 101506477 101683479 101748085 101962006 102341881 101717171 101473335 101376060 100920105 101408997
2359.8 101408997 101486771 101162415 100703072 101135826 101836540 101699326 101901421 101824402 101284592 100794670
2369.5 100794670 100993797 101539909 101747635 102035110 102037514 101731590 101704483 101809822 101879814 101916061
2379.1 101916061 101850281 101884094 101940048 101941750 102062775 102201569 102249550 102235458 102324295 102407181 102478218
2389.7 102478218 102437340 102094177 102040657 102215744 102289192 102374672 102259956 102041946 102009499 102048813 102007431
2400.3 102007431 102139610 102334793 102197327 101964775 101885857 101857170 101867233 101985825 102030815 101788292
2410 101788292 101601837 101755875 101886452 101962738 101923904 101813095 101886238 101695847 101551010 101626289 101711533
2420.6 101711533 101881149 101818947 101824127 101792923 101693130 101715508 101641365 101646530 101598549 101588585 101620056 101671234
2432.2A01671234M5326m7409J40854j01875k67037m5074N1567J37535Q1650n2376j91177
2442.8A01423218n5504J47888j2985j74088N8281J96305j08673k17606k4666K1767
2452.4A01253937j05797o7490j7791N3726R6489l1746K502o7528M868K5703r4711N7129
2464A01109291K968o5064N65Q2520j39016j79641K51518J78764j66473l45154p3547
2474.6A00656731J34857M593M0703m4304o2821K1378N1605m6471n554J7708j20117
2485.2A00648308N5885r6786k64687j36238k8008O4560K0317N7389q5289m9080N0957
2495.8A00237328m8500J8249j5579P6164k3254l02658j11931J42173N2475o1569l715
2506.4I9959183j3436M013p797k0096q255l2211m8912j88744p5767l7773j04668J59187
$$ plain form
2432.2 101671234 101716560 101669151 101810005 101708130 101441093 101396019 101447586 101585121 101666771 101614395 101423218
2442.8 101423218 101367714 101515602 101502617 101328529 101386810 101583115 101474442 101256836 101232170 101253937
2452.4 101253937 101148140 101080650 101062859 101116585 101213074 101181328 101183830 101116302 101121170 101146873 101052162 101109291
2464 101109291 101112259 101047195 101047760 101130280 100991264 100811623 101063141 101241905 101075432 100730278 100656731
2474.6 100656731 100791588 100796181 100836884 100792580 100729759 100751137 100802742 100756271 100750717 100768425 100648308
2485.2 100648308 100704193 100607407 100342720 100206482 100178474 100243034 100263351 100320740 100235451 100186371 100237328
2495.8 100237328 100188828 100207077 100191498 100267662 100244408 99941750 99829819 99971992 100024467 99962898 99959183
2506.4 99959183 99945747 99949760 99941963 99921867 99913612 99881401 99832489 99643745 99567978 99530205 99425537 99584724
2518I9584724J41320L6110J9439q9859m3174p8629j68571l5004J69243k5910k29225
2528.6I9280464J28372R1103j58691J9073o065l6896O020J4305L2219L555N7670l2363
2540.2I9398766n1621L7682o4743k13364o5895J13350o9649P55J43151k5048j32705
2550.8I9070679M4815J81038j54778r7099J59767j43585j77254J69014J67893r2545
2560.4I9127945p7095O454r5543j44248J08848K36939j92276l19863l9291J20628J97960
2571I8930458O3232n7067r7382j29257O9885O8314j48827r3124p9743n8593L1120k2347
2582.6I8476669K6787N1666q2389j99944j19164k5695J4160M0756q8852L3356Q4289
2593.2I8211639k50335j72768K22046L6255k59613l9902R857p5721j07201k7931J56997
$$ plain form
2518 99584724 99726044 99762154 99781593 99691734 99648560 99569931 99401360 99366356 99535599 99509689 99280464
2528.6 99280464 99408836 99499939 99341248 99360321 99354256 99317360 99323380 99337685 99369904 99373459 99431129 99398766
2540.2 99398766 99347145 99384827 99320084 99106720 99040825 99154175 99084526 99085281 99228432 99203384 99070679
2550.8 99070679 99115494 99296532 99141754 99044655 99204422 99060837 98883583 99052597 99220490 99127945
2560.4 99127945 99050850 99057304 98961761 98817513 98926361 99163300 98971024 98651161 98611870 98732498 98930458
2571 98930458 98993690 98936623 98839241 98709984 98779869 98848183 98699356 98606232 98526489 98467896 98499016 98476669
2582.6 98476669 98503456 98555122 98472733 98272789 98153625 98127930 98142090 98182846 98093994 98127350 98211639
2593.2 98211639 97961304 97788536 98010582 98046837 97787224 97747322 97757179 97681458 97574257 97546326 97703323
2603.8I7703323k7633k41539k16202k0035o470k36641k24838j8043P4768k9343j61514
2614.4I6595833l05275L5072K92893q6098q0376j39000k56706k0798R446j5625n5413
2625I5973953o8611r1537k14081j24436K1698l4309j08864j11557K6016L2326q8592
2635.6I5212006J4930n2475j39038j92451r0912K4689j15990J79596l723k69921q9279
2646.3I4477432j30874J42982n9654k12151M9973o7581l3509q8081j43517p4722j01478
2656.9I3758820n0553N5268j21270k15660Q3702J5152j18644j46813n6007R7931l5271
2667.5I3266655M5357M9637j28907k54051j54640m7638j27495J03081L6377r5116l1318
2678.1I2661942j43082J13678K46124j22742k93258J02569K53281k18391k15775J4145
$$ plain form
2603.8 97703323 97675690 97434151 97217949 97197914 97191444 96954803 96729965 96711922 96786690 96757347 96595833
2614.4 96595833 96290558 96325630 96618523 96532425 96452049 96313049 96056343 96035545 96044991 96029366 95973953
2625 95973953 95905342 95813805 95599724 95475288 95496986 95462677 95353813 95242256 95268272 95300598 95212006
2635.6 95212006 95226936 95174461 95035423 94842972 94752060 94776749 94660759 94840355 94836632 94566711 94477432
2646.3 94477432 94346558 94489540 94429886 94217735 94267708 94200127 94166618 94078537 93935020 93860298 93758820
2656.9 93758820 93708267 93763535 93642265 93426605 93510307 93525459 93406815 93260002 93203995 93301926 93266655
2667.5 93266655 93312012 93361649 93232742 92978691 92824051 92776413 92648918 92751999 92788376 92693260 92661942
2678.1 92661942 92518860 92632538 92878662 92755920 92462662 92565231 92818512 92600121 92384346 92398491
2687.7I2398491p0816L9581Q6273m6264j15319o6963J46424J16432j28311k15516k5268
2698.3I2118744P7553j53298r9945j5556j87447j08947N7258r651J8295J21124n2604
2708.9I1765526K029J15265l2539j24573j85135o1302R7328Q072j84021J9722J8166
2719.5I1438538k05773R6672r1095j87324O2629r1484j63200k50580k6954K2003j11733
2730.2I0491699K16652J46774j72134j82770n3772j13151j11512J40229m2473k65015
2739.8I0054527j2848k6893j80069p4013j23543J2673J38282o5567r2323j84685k63794
2750.4H9181747J8662L08632N1140j87363K8946q6105k13173m5929J1413q4137j07231
2761H8876602L4104J3519j07994j17165k6550M2793J41052P2846p4906J2719j33339
$$ plain form
2687.7 92398491 92327675 92367256 92453529 92407265 92291946 92224983 92371407 92487839 92359528 92144012 92118744
2698.3 92118744 92196297 92042999 91943054 91927498 91740051 91631104 91688362 91678711 91697006 91818130 91765526
2708.9 91765526 91767555 91882820 91850281 91725708 91540573 91479271 91576599 91584671 91400650 91420372 91438538
2719.5 91438538 91232765 91329437 91238342 91051018 91113647 91022163 90858963 90608383 90581429 90603432 90491699
2730.2 90491699 90708351 90855125 90682991 90500221 90446449 90333298 90221786 90362015 90319542 90054527
2739.8 90054527 90041679 90014786 89834717 89760704 89637161 89649834 89788116 89722549 89630226 89445541 89181747
2750.4 89181747 89200409 89509041 89560181 89372818 89401764 89315659 89102486 89056557 89067970 88983833 88876602
2761 88876602 88910706 88924225 88816231 88699066 88672516 88715309 88856361 88929207 88854301 88867020 88733681
2771.6H8733681j09139J88034J88584m7089l46512l16520j07972R7527Q3526p7178
2781.3H8286942M714j49093j48956J21574j31081k27211J16761J0803k29050j22291
2790.9H7533112j39451k14653r4017m1717j29654j45164j38871k14012j94008p0671
2800.5H6150894o6330j40121k35878m61792k86583P9941j15258l38234m45671l56476
2810.2H3784492j20643k69318k90649j21819p9231l36891n30419j16554j09276l82934
2819.8H1426758l21282k36656o7436l04306m65775k90412k25976P0107l014k88459
2829.5G9293549l41141m16542k40486j33873k52846k72484j63254k08427l07686l06259
2839.1G6650551k91741j29661k20963k66578k08046l45963j93886j03469k45301m72221
$$ plain form
2771.6 88733681 88624542 88812576 89001160 88954071 88607559 88291039 88183067 88280594 88364120 88286942
2781.3 88286942 88291656 88142563 87993607 88115181 87984100 87756889 87873650 87884453 87655403 87533112
2790.9 87533112 87393661 87179008 87084991 87043274 86913620 86768456 86629585 86415573 86221565 86150894
2800.5 86150894 86084564 85944443 85708565 85246773 84960190 85040131 84924873 84586639 84140968 83784492
2810.2 83784492 83663849 83394531 83103882 82982063 82902832 82565941 82035522 81918968 81809692 81426758
2819.8 81426758 81105476 80868820 80801384 80497078 80031303 79740891 79514915 79585022 79582008 79293549
2829.5 79293549 78952408 78535866 78295380 78161507 77908661 77636177 77472923 77264496 76956810 76650551
2839.1 76650551 76358810 76229149 76008186 75741608 75533562 75187599 74993713 74890244 74644943 74172722
2848.8G4172722l40912J53137K09030q3778l47672j57920l6263k21664j25145n3192
2858.4G3168343k52114m03557r5977q698j35918J7663j33393k03613m9835r0256j13976
2869G1698669o8229k21939k56119m3549j46766k36740k09176j85913k50541k76306
2878.7F9803391R30k24800n28724m47495l25287j52069l84399n33081m98169o85822
2888.3F6024475o58668n99312p30271r00501r00143p80532r18068j072602j084774
2897E8379604j089328r62281q47961r33293r82849q55651q15011p52662o21491p76268
2906.6D9742809q40488o39282m32984p6408l0441l35965j63807J16150j05121k14779
2916.3D7019684j8555j8314l5462N1758K01363L38749J43890q4087j36528j64948l1379
$$ plain form
2848.8 74172722 73831810 73984947 74193977 74110199 73762527 73604607 73568344 73346680 73221535 73168343
2858.4 73168343 72916229 72512672 72416695 72407997 72272079 72289742 72156349 71952736 71902901 71812645 71698669
2869 71698669 71630440 71408501 71152382 71108833 70962067 70725327 70516151 70330238 70079697 69803391
2878.7 69803391 69804321 69579521 69050797 68603302 68278015 68125946 67741547 67208466 66710297 66024475
2888.3 66024475 65365807 64766495 64036224 63135723 62235580 61455048 60536980 59464378 58379604
2897 58379604 57290276 56327995 55480034 54546741 53563892 52708241 51893230 51140568 50519077 49742809
2906.6 49742809 48902321 48263039 47830055 47753647 47723206 47387241 47223434 47339584 47234463 47019684
2916.3 47019684 47001129 46982815 46947353 46999111 47200474 47539223 47683113 47599026 47462498 47297550 47266171
2926.9D7266171J4793l10124l17775j03592j43360k11716m65263m20174j89968l77850
2936.5D4741142n58716l41785p9784k27654j13582J12503K14141K48848J21628L67924
2946.2D4484665M65450P67613R03431O96342R40830R11560J352303J524300J190567
2954.8E3237061J248161J091827J406777J492515J262600J448799J343098J025570
2962.6F3556408J093807J258240J044090J008957R90898J018517Q90602N77576Q74679
2971.2G2313774P13173L62556N77271P23045P09671M13628L60451M08889K52350L73413
2980.9G7208221L47298J61591J14967J20155K56188L83339K81433J81099K74528J11038
2990.5G9439857P9216J75889q1536M8416O1493l8765K93167K68708p1564l19473k03270
$$ plain form
2926.9 47266171 47280964 46970840 46653065 46549473 46406113 46194397 45729134 45308960 45118992 44741142
2936.5 44741142 44182426 43840641 43760857 43533203 43419621 43532124 43746265 43995113 44116741 44484665
2946.2 44484665 44950115 45717728 46621159 47317501 48258331 49169891 50522194 52046494 53237061
2954.8 53237061 54485222 55577049 56983826 58476341 59738941 61187740 62530838 63556408
2962.6 63556408 64650215 65908455 66952545 67961502 68952400 69970917 70861519 71439095 72313774
2971.2 72313774 73026947 73389503 73966774 74689819 75399490 75813118 76173569 76582458 76834808 77208221
2980.9 77208221 77555519 77717110 77832077 77952232 78208420 78591759 78873192 79054291 79328819 79439857
2990.5 79439857 79519073 79694962 79613426 79661842 79723335 79684570 79977737 80246445 80174881 79855408 79652138
3001.1G9652138N172K83387L37600p4798j20667k33055j17981K26326O8733j65878
3010.8G9860977k76336j24589o0508R4108J14357k34649k75566r9755M1214k37762
3020.4G8801491k20963j7235j31851j27205r8312J31210j17653k72827n6640j91239
3030.1G7698776j20636j42631j79222k14173j86737N2803N1544k21115l49624m334
3039.7G6384651l7063p2648j16889l33992K555q7265k62794j49399j53763k14470l27987
3050.3G4630936k56630j60042K2690j73851k72187O699j74370k83211k44071k06795
3060G2889168j84242j22651j05468l32428j97815q4702l70903l15636O7925o2004l53058
3070.6G0828186k05147j29013k23869k16316j56006l11714k82319p7034j44706j10588
$$ plain form
3001.1 79652138 79657310 79940697 80278297 80203499 80082832 79849777 79731796 79958122 80026855 79860977
3010.8 79860977 79584641 79460052 79399544 79493652 79608009 79373360 79097794 78998039 79039253 78801491
3020.4 78801491 78580528 78563293 78431442 78304237 78205925 78337135 78219482 77946655 77890015 77698776
3030.1 77698776 77578140 77435509 77256287 77042114 76855377 76908180 76959724 76738609 76388985 76384651
3039.7 76384651 76347588 76274940 76158051 75824059 75826614 75739349 75476555 75327156 75173393 74958923 74630936
3050.3 74630936 74374306 74214264 74236954 74063103 73790916 73797615 73623245 73340034 73095963 72889168
3060 72889168 72704926 72582275 72476807 72144379 71946564 71861862 71490959 71175323 71243248 71181244 70828186
3070.6 70828186 70623039 70494026 70270157 70053841 69897835 69586121 69303802 69226768 69082062 68971474
3080.2F8971474j32073k47696l15811k45697k67113l56384r1484k43622l50555p9926
3089.9F6641113r8533j58951l28926k63542r2659j50567j96380l47489j68060J06507
3099.5F4942513k84127p82535m33464J08463r5974l01998k57012k64640j17691k77947
3109.1F2235588m84127k19543j6381q7631l80295m43912k50126j67866m4483j08757
3118.8F0032467k62772l20308k54876k32814m35280k40666j64550l77671k20932j37310
3128.4E7385288j94336k30430l15461l01353j39847j24138k92472k46621l40950n44742
3138.1E4654938j82888J38076q3202k80666m69227n20172j85002j33693l43159l12080
3147.7E2282925j84616j90445l35465k97802m4933j09245m95175n53600k48917j61907
$$ plain form
3080.2 68971474 68839401 68591705 68275894 68030197 67763084 67406700 67315216 67071594 66721039 66641113
3089.9 66641113 66542580 66383629 66054703 65791161 65698502 65547935 65351555 65004066 64836006 64942513
3099.5 64942513 64658386 63875851 63442387 63550850 63454876 63152878 62895866 62631226 62513535 62235588
3109.1 62235588 61751461 61531918 61515537 61427906 61047611 60603699 60353573 60185707 60141224 60032467
3118.8 60032467 59769695 59449387 59194511 58961697 58526417 58285751 58121201 57743530 57522598 57385288
3128.4 57385288 57190952 56960522 56645061 56343708 56203861 56079723 55787251 55540630 55199680 54654938
3138.1 54654938 54472050 54610126 54526924 54246258 53777031 53256859 53071857 52938164 52595005 52282925
3147.7 52282925 52098309 51907864 51572399 51274597 51229664 51120419 50625244 50071644 49822727 49660820
3157.4D9660820l20572k88360q7227o9413j71154j26205j40873l72742m82582l48244
3167D7253448j76361j28944j87508m03541m52568n5420l0541l15101k83814j84833
3176.6D5034817k29840l25477j72135k15869l77823j13980L422l02330n22507k87277
3186.3D2491001j53107l06629m21261l19263j949k06105m38312j86871m2541o5048
3195.9D0349915k42936k16354q54r9209l70758m82937l21911j76434j76021k73487
3205.6C7989014m67560l23937j22715k26661M7565O1020l12859k36396j66390j79008
3215.2C6062073k27127j70979j55319k94273j92944l14713k36858P0465j53000m21535
3224.9C3965790k43397k5795j01578k5715j00757m17904l66276j73664j69651k55775
$$ plain form
3157.4 49660820 49340248 49051888 48964661 48895248 48724094 48597889 48457016 48084274 47601692 47253448
3167 47253448 47077087 46948143 46760635 46357094 45904526 45849106 45818565 45503464 45219650 45034817
3176.6 45034817 44804977 44479500 44307365 44091496 43713673 43599693 43603115 43300785 42778278 42491001
3186.3 42491001 42337894 42031265 41610004 41290741 41288792 41082687 40644375 40457504 40414963 40349915
3195.9 40349915 40106979 39890625 39889771 39790562 39419804 38936867 38614956 38438522 38262501 37989014
3205.6 37989014 37521454 37197517 37074802 36848141 36895706 36956726 36643867 36407471 36241081 36062073
3215.2 36062073 35834946 35663967 35508648 35214375 35021431 34706718 34469860 34540325 34387325 33965790
3224.9 33965790 33722393 33696598 33595020 33569305 33468548 33050644 32684368 32510704 32341053 32085278
3234.5C2085278j79671n0308o3892k89547l38238j49189j21464k6270l8427k39203
3244.2C0589069l00096j68102l4224j7076j52016k74418k5002j0414k46078j33736
3253.8B9227907r6611l13948j79368O1042k15416j94599p5355k75065j18013L2661
3263.4B7853235k3536j26860r4164N0598j52084m71718j84797P5905k32005k31521
3273.1B6463053j20384R5233K21123j25351k12169p9140k7113k52956l45904k5436
3282.7B5590956R4827j02003O3332J61585k87056j16608l45880m88738K13036R7393
3292.4B4880844J16549o4068j88372J81784j60290j34909j28767m11787j79575q796
3302B3902613n4180l7598n4030j54123k2575J00082m2028p3025J43520J20062p4940
$$ plain form
3234.5 32085278 31905607 31855299 31791407 31501860 31163622 31014433 30892969 30866699 30828272 30589069
3244.2 30589069 30288973 30120871 30086647 30069571 29917555 29643137 29618135 29607721 29361643 29227907
3253.8 29227907 29131296 28817348 28637980 28699022 28483606 28289007 28213652 27938587 27820574 27853235
3263.4 27853235 27829699 27702839 27608675 27659273 27507189 27035471 26850674 26926579 26694574 26463053
3273.1 26463053 26342669 26437902 26659025 26533674 26321505 26242365 26215252 25962296 25616392 25590956
3282.7 25590956 25685783 25583780 25647112 25808697 25521641 25405033 25059153 24570415 24783451 24880844
3292.4 24880844 24997393 24933325 24744953 24926737 24766447 24631538 24502771 24090984 23911409 23902613
3302 23902613 23848433 23810835 23756805 23602682 23580107 23680189 23638161 23565136 23708656 23828718 23753778
3312.6B3753778l02738l69093k525R0282M061j33386r7125K2994n9061P7262o6221
3323.2B2918228q8426j06587r6016N6879j17203J84613J03414k00330m3879N5599Q8143
3333.8B2754435q7162j62947j97338m4745J11203J44317n2162j89364J91859r4364
3343.5B2373732l57685m0530J56634R4154j1560L8969k45846k64872m4987R0416J64404
3354.1B1952829R4141L0114O8599K45072r3365j14054K5059q2243J1141n1085K24116
3364.7B2310324J43564j06770k14262j53856J92757P293P8660J38908J71591K4645
3374.3B2592854k97564O8359K5168j44619o0234J07801K79068K00960J41423p4461
3384B2838755k13755k17508N3714L16815K43641J99726O3572j77286j25536J47682
$$ plain form
3312.6 23753778 23451040 23081947 23079422 23169704 23173765 23040379 22943254 22966248 22907187 22984449 22918228
3323.2 22918228 22829802 22723215 22627199 22684078 22566875 22751488 22854902 22654572 22610693 22666292 22754435
3333.8 22754435 22667273 22504326 22306988 22262243 22373446 22517763 22465601 22276237 22468096 22373732
3343.5 22373732 22016047 21975517 22132151 22226305 22214745 22253714 22007868 21742996 21698009 21788425 21952829
3354.1 21952829 22046970 22077084 22145683 22390755 22297390 22183336 22208395 22126152 22137293 22086208 22310324
3364.7 22310324 22453888 22347118 22132856 21979000 22171757 22179050 22257710 22396618 22568209 22592854
3374.3 22592854 22295290 22363649 22388817 22244198 22183964 22291765 22570833 22771793 22913216 22838755
3384 22838755 22625000 22407492 22461206 22778021 23021662 23221388 23284960 23107674 22982138 23129820
3393.6B3129820J13050K19138R2620j96169K01073K73401o5174j18810m460j30472
3403.3B3514017K2324M07947K78475J63420K71913J43088l71504k21493K22305K89322
3412.9B4719814L50945J3996J2445K82582L59079J23417j84093M0529J87183L04796
3422.6B6210693L90038J59464k24833l7805K44386J41089K89556O2052J07412J85791
3432.2B7527843J44623K29883j00952Q2381K58110L56947K02707Q2903K84349n012
3441.8B9063782O7322J34241K84750K17353m365K77076K16456L26130J92121J14033
3451.5C0888899J44960J83413M31419Q5425n2811K21849O58572L00426j78764L06896
3461.1C2990284L04211K30335J67175J32916K77156J18817N0342K33094M94293L65959
$$ plain form
3393.6 23129820 23242870 23462008 23554628 23358459 23559532 23832933 23767759 23648949 23644489 23514017
3403.3 23514017 23536341 23944288 24222763 24386183 24658096 24801184 24429680 24208187 24430492 24719814
3412.9 24719814 25070759 25084755 25097200 25379782 25738861 25862278 25678185 25718714 25905897 26210693
3422.6 26210693 26600731 26760195 26535362 26497557 26741943 26883032 27172588 27234640 27342052 27527843
3432.2 27527843 27672466 27902349 27801397 27883778 28141888 28498835 28701542 28784445 29068794 29063782
3441.8 29063782 29131104 29265345 29550095 29767448 29763083 30040159 30256615 30582745 30774866 30888899
3451.5 30888899 31033859 31217272 31648691 31734116 31681305 31903154 32561726 32862152 32683388 32990284
3461.1 32990284 33294495 33524830 33692005 33824921 34102077 34220894 34271236 34504330 34998623 35364582
3470.8C5364582K31136K79343L16570K04064P5142L02723L58272L13683J48075K09526
3480.4C7803116K10594N0575M33239L97190M48201M11850Q3404J67019M0657L16559
3490.1D0362404N88058K43416J96404K31163J89087L21460K73331J75762L58986N67997
3499.7D3508068M58443L12347L65833J20076K02552N78339L72215L63949N14794L03600
3509.4D7100216J98372J17382Q4457M44580M97712M28890M40132L10951N92186N07225
3519E0722103O676K0740K25884N28038P95284N23449K03732L76571K94152K77160N16785
3529.6E4490574L17726M49722M03546L47439M03900J88236L67020O05957O40659N10517
3539.2E8725296L87043K40582Q1783K87987M70417M84958K01062K95070O46816N53185
$$ plain form
3470.8 35364582 35595718 35875061 36191631 36395695 36470837 36773560 37131832 37445515 37593590 37803116
3480.4 37803116 38013710 38064285 38497524 38894714 39342915 39754765 39838169 40005188 40045845 40362404
3490.1 40362404 40950462 41193878 41390282 41621445 41810532 42131992 42405323 42581085 42940071 43508068
3499.7 43508068 43966511 44278858 44644691 44764767 44967319 45545658 45917873 46281822 46796616 47100216
3509.4 47100216 47298588 47415970 47500427 47945007 48442719 48871609 49311741 49622692 50214878 50722103
3519 50722103 50728779 50749519 50975403 51503441 52298725 52822174 53025906 53402477 53696629 53973789 54490574
3529.6 54490574 54808300 55258022 55661568 56009007 56412907 56601143 56968163 57574120 58214779 58725296
3539.2 58725296 59112339 59352921 59434704 59722691 60193108 60678066 60879128 61174198 61821014 62374199
3548.9F2374199L13888J83388N56545N46605K6260M57451R86435M65332j320L17879
3558.5F6226662M71740N73990M76349M21311M11727P8888J83144K52518P15263J117783
3568.2G0929375L17032O5124L62335K67189K57935N20698L80761K45094L06389L72329
3577.8G4024261L75878M07142M25232K26357L76656L85849J84005J96335N06485Q82721
3587.5G7990921M27116M74060J95549J27694K17727J80596L19984K31934L08326M52996
3597.1H0926903O30905M66797K15874O60995N86151K38808J6754P8514R3048K07787
3606.8H4122536M84146J43249K86736N45219N99533O43776n7655M1832N15999Q1489
3616.4H7406860l36586M71115R06296O48773N00649n3482k07161J04347M47891L18306
$$ plain form
3548.9 62374199 62688087 62871475 63428020 63974625 64000885 64458336 65444771 65910103 65908783 66226662
3558.5 66226662 66698402 67272392 67748741 68170052 68581779 68660667 68843811 69096329 69811592 70929375
3568.2 70929375 71246407 71311531 71673866 71941055 72198990 72719688 73100449 73345543 73651932 74024261
3577.8 74024261 74400139 74807281 75232513 75458870 75835526 76221375 76405380 76601715 77108200 77990921
3587.5 77990921 78418037 78892097 79087646 79215340 79433067 79613663 79933647 80165581 80473907 80926903
3597.1 80926903 81557808 82024605 82240479 82901474 83487625 83726433 83743187 83821701 83914749 84122536
3606.8 84122536 84606682 84749931 85036667 85581886 86181419 86825195 86767540 86809372 87325371 87406860
3616.4 87406860 87070274 87541389 88447685 89096458 89597107 89543625 89336464 89440811 89888702 90207008
3626I0207008L19779J16028l22220R30069M60838J75255L56132L97652o2256J50604
3635.7I2728889L33901J26198J88087L9978L88039N19569L33466L23097P1404J95259
3645.3I5247887J66175P6829J62986M4625K26036R30847J46080k42020M51287K38357
3655I7449089j94694J08169N94528O39160K44545K35619J91864j69571J72814P24708
3664.6I9996231K03018k44667L00217L33687M12849R6680r16K81151o5910O5666r3658
3675.2A01284348J241821J25229k87560L54553Q950k59919J54084L21846q2550l2860
3684.9A02827942K74635J46996L22456R2362l62908P2075M35455j3038M7790J18958
3694.5A03962723j35254K55455J03981K327J54793K42881M00818m1404o6239L5767
$$ plain form
3626 90207008 90526787 90642815 90320595 91250664 91711502 91886757 92242889 92640541 92578285 92728889
3635.7 92728889 93062790 93188988 93377075 93417053 93805092 94324661 94658127 94981224 95052628 95247887
3645.3 95247887 95414062 95490891 95653877 95698502 95924538 96855385 97001465 96759445 97210732 97449089
3655 97449089 97254395 97362564 97957092 98596252 98840797 99076416 99268280 99098709 99271523 99996231
3664.6 99996231 100199249 99954582 100254799 100588486 101001335 101098015 101097099 101378250 101312340 101378006 101284348
3675.2 101284348 102526169 102651398 102363838 102718391 102727341 102467422 102621506 102943352 102860802 102827942
3684.9 102827942 103102577 103249573 103572029 103664391 103301483 103373558 103809013 103795975 103843765 103962723
3694.5 103962723 103827469 104082924 104186905 104189232 104344025 104586906 104987724 104946320 104880081 104915848
3704.1A04915848J22566r2384j08528K85934J13777j53015l05946K18650N34668k11006
3713.8A05320564j76834j77460M1298Q3657J70662Q4243J14373M30305K49580n45928
3723.4A05594460k67846N0133k2789L81943k4254j79459K35939J27633L52378n416
3733.1A06242722j71532n64346j018097K35412k632L37319N97145O58020K72995n07981
3742.7A06079025j56769L3120p00608K46483M06075o897J81534P42057K33216L23089
3752.4A07380325p63603k89490k29705q5167P568p1190M86702O18362n77400n68084
3762A05908318j45775K49412K66464j76010l67797q4008K71408L56812j45035L70110
3771.7A06503899j06980n04211j8227K01477K02790j31173K03385N00480j4534k98919
$$ plain form
3704.1 104915848 105038414 104946030 104837502 105123436 105237213 105084198 104778252 104996902 105531570 105320564
3713.8 105320564 105143730 104966270 105007568 105091225 105261887 105346130 105460503 105890808 106140388 105594460
3723.4 105594460 105326614 105376747 105353958 105735901 105711647 105532188 105768127 105895760 106248138 106242722
3733.1 106242722 106071190 105506844 104488747 104724159 104721527 105058846 105655991 106314011 106587006 106079025
3742.7 106079025 105922256 105955376 105254768 105501251 105907326 105900429 106081963 106824020 107057236 107380325
3752.4 107380325 106616722 106327232 106097527 106012360 106019928 105948738 106435440 107053802 106476402 105908318
3762 105908318 105762543 106011955 106278419 106102409 105734612 105650604 105922012 106278824 106133789 106503899
3771.7 106503899 106396919 105892708 105874481 106075958 106278748 106147575 106350960 106851440 106836906 106537987
3781.3A06537987n38727l33901J71547O39061J88370p6912p1831j52259M0451l15018
3790.9A06088768j63338M9332j34689J61445N04547M02588m05914j43860o8191r2644
3800.6A06198044J25915O8200o8772M8279K60284J52131Q0245p91999o0242M54330
3810.2A06466415j05331j74309j46324J39206Q4251L7964J67145m08714K79426J21941
3819.9A06461670o8695l2654q018N55816J40686q6067l50906o61492k40165N39238
3829.5A06249413P47924K19345j55525o26251l83415j23993L73405N12848M40621J9554
3839.2A07273926n30838l06084k2346K89138L07946p59659l83248q750K42393K92076
3848.8A06394554R3796O1211K38418O42243J91291n69915p32018Q0887n7686j60278
$$ plain form
3781.3 106537987 105999260 105665359 105836906 106475967 106664337 106587425 106515594 106363335 106403786 106088768
3790.9 106088768 105925430 105974762 105840073 106001518 106506065 106908653 106502739 106358879 106290688 106198044
3800.6 106198044 106323959 106392159 106323387 106371666 106631950 106784081 106864326 106072327 106012085 106466415
3810.2 106466415 106361084 106186775 106040451 106179657 106263908 106301872 106469017 106060303 106339729 106461670
3819.9 106461670 106392975 106360321 106352303 106908119 107048805 106962738 106611832 105950340 105710175 106249413
3829.5 106249413 106997337 107216682 107061157 106434906 106051491 105927498 106300903 106813751 107254372 107273926
3839.2 107273926 106743088 106437004 106414658 106703796 107011742 106252083 105868835 105860085 106102478 106394554
3848.8 106394554 106488350 106549561 106787979 107430222 107621513 107051598 106319580 106400467 106342781 106182503
3858.4A06182503j6655j46301R3063K35473J50078K36618Q6625o57097m34662j14823
3868.1A05614822O5758Q64563O97754p9781l24630j20354K02866m27475q0590j07864
3877.7A06305069l07724l95996n42984L40942M52095L07579J1002K79533K61208n49736
3887.4A06160988j62781K12540N20553R6543l50312k1133k31560m1488L23082j52085
3897A06354347m76471K67105K45537K17064N23247m93851m29046l83011j7609p8911
3906.7A05728401k7214M96758P3494k48131o9077j44821j67442K33688M46129n0751
3916.3A06271034k92572J14411K26669K03575j07689l47259j07163K89391K82585o500
3926A06526482p1213j37360j01333R9525l5675j30295j91070k16561J53366K19727
$$ plain form
3858.4 106182503 106165848 106019547 106112610 106348083 106498161 106734779 106821404 106164307 105729645 105614822
3868.1 105614822 105680580 106545143 107242897 107163116 106838486 106718132 106920998 106493523 106412933 106305069
3877.7 106305069 105997345 105601349 105058365 105399307 105851402 106158981 106169983 106449516 106710724 106160988
3887.4 106160988 105998207 106210747 106731300 106827843 106477531 106456398 106224838 106183350 106506432 106354347
3897 106354347 105877876 106144981 106390518 106607582 107130829 106636978 106207932 105824921 105807312 105728401
3906.7 105728401 105701187 106197945 106271439 106023308 105954231 105809410 105641968 105875656 106321785 106271034
3916.3 106271034 105978462 106092873 106319542 106523117 106415428 106068169 105961006 106250397 106532982 106526482
3926 106526482 106455269 106317909 106216576 106316101 106280426 106150131 105959061 105742500 105895866 106115593
3935.6A06115593p729j54419j23138J16051J38366M4938K10662j7936n14893j07468
3945.2A05700027K36016n9303j11039K82547j07734k47681L80341K7954k76604P2197
3954.9A05896721J04179o7924k02713j35704j15074j1551Q0391J45958K14126J67458
3964.5A06075867M440k55981k25228N493K14249k91695m84130J14906K30781L00949
3974.2A05689651n3482k57652J11939J33064R6390k1363j67022l65166K32017N50652
3983.8A05949028L4683J83647O1364l31330m61036o8200J07727j19644K35115L04695
3993.5A05896049J10825k40517j35612K13921p4837j30089P7454
4000.2A05717194
$$ plain form
3935.6 106115593 106107864 105953445 105830307 105946358 106084724 106129662 106340324 106322388 105807495 105700027
3945.2 105700027 105936043 105876740 105765701 106048248 105940514 105692833 106073174 106101128 105824524 105896721
3954.9 105896721 106000900 105932976 105730263 105594559 105479485 105467934 105548325 105694283 105908409 106075867
3964.5 106075867 106080307 105824326 105599098 105604591 105818840 105527145 105043015 105157921 105388702 105689651
3974.2 105689651 105636169 105378517 105490456 105623520 105719910 105698547 105531525 105166359 105398376 105949028
3983.8 105949028 105983711 106167358 106228722 105897392 105436356 105368156 105475883 105356239 105591354 105896049
3993.5 105896049 106006874 105766357 105630745 105844666 105769829 105639740 105717194
4000.2 105717194
##END=$$ End of the data block
