##TITLE=$$ Begin of the data block
##JCAMP-DX=5.00 $$ ACD/SpecManager v 10.08
##SPECTROMETER/DATA SYSTEM=Varian
##DATE=07 Jan 2013 16:01:46
##DATA TYPE=INFRARED SPECTRUM
##DATA CLASS=XYDATA
##ORIGIN=
##OWNER=
##NPOINTS=3735
##FIRSTX=399.26403809
##LASTX=4000.35498047
##MAXX=4000.35498047
##MINX=399.26403809
##MAXY=107.11683655
##MINY=0.00000100
##XFACTOR=1.0000000000
##YFACTOR=0.000001000000000
##FIRSTY=0.00000100
##DELTAX=0.96440572
##XUNITS=1/CM
##YUNITS=TRANSMITTANCE
##XYDATA=(X++(Y..Y))
399.3 1 1 1 1 1 1 1 1 1 1 1 1 1 1 1 1 1 1 1 1 1 1 1 1 1 1 1 1 1 1 1 1 1 1 1 1 1 1 1 1 1 1 1 1 1 1 1 1 1 1 1 1 1 1 1 1 1 1 1 1 17415638 17415638 55306725 95320908 67525063 46688663 54728474 86051064 94465904
464.8 94465904 90517509 79507904 74337830 80198708 83505455 84070740 77413231 75518860 70339607
473.5 70339607 68200851 66174461 64203918 66779404 64918846 70681244 75976570 73092369 70592560
482.2 70592560 72159035 75182831 77127884 82789375 88263893 84634438 76840698 75796768 72940147
490.9 72940147 66913734 70646111 76719261 79528076 77455002 77578003 76901329 73793083 72927429
499.6 72927429 73529472 77492722 76207199 75078194 79911568 81254311 78050697 75665962 76589340
508.2 76589340 76099770 75282509 75317505 76250946 78389496 79296082 78006607 74522789 73515923
516.9 73515923 75327248 76183899 77789894 78598328 77833641 77354561 77789314 77300835 75883904
525.6 75883904 75377922 76036270 77018890 77951904 77823395 76157112 75082214 74853737 75132584 75878601
535.2 75878601 76678864 77052177 76677444 76699875 76610329 76294479 75523521 75072845 75432487 75715240
544.9 75715240 77033073 77418831 76859200 76509193 76662483 76771591 75322151 75429832 76120888 75904663
554.5 75904663 75589096 75407227 76594086 76899796 75930733 74865257 74182106 74490837 75292877 75898018
564.2 75898018 75943962 76205132 76179619 75968262 75771507 75799538 76262627 75315689 74851936 75777710
573.8 75777710 76017220 75676186 74903358 74362122 74561905 74622101 74620270 75476158 75891434 74894508
583.5 74894508 73837555 74235611 75430977 75994621 75716743 75275230 75152763 74924240 74508850 74314362
593.1 74314362 74403236 74500420 74576859 74880882 74512070 74037643 74479820 74822021 74410538 73885086
602.8 73885086 74202232 74918625 74671677 73954498 74029663 74281998 74372757 74349777 74034523 73773003
612.4 73773003 73252541 73503708 74291039 74671219 75352943 75009537 74388092 74685211 74393295 74498459
622 74498459 75476715 75507629 75155731 75225784 75136444 74771156 74545494 74520554 74062798 73941910 74195663
632.7 74195663 74025063 74005646 74205864 74492516 74350403 74328308 74588356 74497314 74591187 74419899 74217232
643.3 74217232 74200935 74231834 74194847 74091309 74624359 75098915 74809494 73847984 73870537 74455292 73987663
653.9 73987663 73606537 73288643 73854568 74701881 74421654 74139244 74082748 74022957 73848785 74218620
663.5 74218620 74891235 74864197 74429558 73697906 72841171 74012589 74604362 74591805 74794693 74669342
673.2 74669342 74022285 73806137 73891571 74507797 74718544 74475021 74435478 74277100 74172874 74293869
682.8 74293869 74794365 74862961 74513718 74531464 75148224 75577858 75069038 74618195 74454033 74533409
692.4 74533409 74425293 74468231 75067642 74873596 74186600 73885132 74491905 75029518 74706841 74974083
702.1 74974083 75400803 75468262 75355682 74816887 74583351 74538399 74513618 74892540 75106407 74986816
711.7 74986816 75067810 75222130 75164711 75051262 74879944 74949135 75356056 75530182 75727951 75561684
721.4 75561684 75137642 75587341 75684547 74931892 74736191 75199951 75315247 75199028 75683815 75925934
731 75925934 75751854 75696793 75786133 75782440 75270363 74926514 75074844 75627640 75969398 75815132 75861404
741.6 75861404 75962303 75862381 75724197 76011276 76222252 76091324 76187309 76551971 76728653 76150398
751.3 76150398 76179070 76775681 76544128 76206619 76463646 77405533 77898544 77155876 76390030 76483955
760.9 76483955 76693153 76630424 76858147 77098663 76990097 76670067 76532562 76534180 76843155 77292900
770.6 77292900 77070763 76998466 77292679 77511932 77710991 77934746 77986740 77567436 77549843 77766441
780.2 77766441 77848244 78001663 77820770 77823761 78141708 78153473 78030945 78163277 78327988 78474670 78635330
790.8 78635330 78707993 78567757 78119362 77998428 78215370 78625443 78944054 78751251 78609070 78481567
800.5 78481567 78402130 78568634 78742752 78630638 78155441 78098892 78750298 79352142 79286591 78912392
810.1 78912392 78678253 78616074 78887054 79260597 79188354 78926849 78924271 78924675 79073135 79292351 79203316
820.7 79203316 78768814 78543434 79137718 79442322 79319977 79427452 79349731 79170044 79033226 79178604
830.4 79178604 79437149 79312759 79007210 78895905 79283890 79794113 79563492 79285858 79679604 79721191
840 79721191 79790474 80183022 80279312 80322823 80002838 79847244 80150589 80338951 80435982 80409157 80606850
850.6 80606850 80922745 81020706 80963928 81003700 81254425 81275284 81272697 81349495 81432098 81811874 81847664
861.2 81847664 81619141 82053856 82358269 82240143 82720810 83276413 83491440 83726875 83648422 83789223
870.9 83789223 84121498 83960861 84116440 84442978 84535507 84767036 85046059 85431267 85423027 85015800
880.5 85015800 84970306 85350250 85744217 85913307 85757179 85217186 85249550 85649094 85498810 85492744 85768539
891.1 85768539 85936317 85858139 85877182 85976372 85798721 85693398 85941162 86604385 86599037 86099373 86192650
901.7 86192650 86414673 86729912 86716225 86594330 86657669 86401001 86543297 86819244 86792099 86856819 87084885
912.3 87084885 87311058 87212357 87134827 87190987 87190811 87041504 86847679 86956413 87148659 87269852 87027298
922.9 87027298 86700180 86941940 87360771 87727539 87751503 87516205 87497810 87545479 87836647 88171379
932.6 88171379 88241486 88330940 88451073 88407181 88284744 88215546 87978760 87927055 88083443 87928001 88015472
943.2 88015472 88381645 88386276 88517075 88897636 88819023 88849083 88903893 88470421 88537827 88792519 88939339
953.8 88939339 89264908 89448074 89659172 89576859 89371590 89335556 89319252 89465942 89476799 89571190 89979424
964.4 89979424 90251190 90169571 89916115 89679741 89639618 89775520 89942780 90337410 90576401 90510193
974.1 90510193 90386726 90182564 90206917 90313683 90423668 90659859 90890633 90859627 90507599 90385201
983.7 90385201 90460060 90621040 90784988 90658119 90648018 90728073 90809662 90996460 90794876 90687668 91090950
994.3 91090950 91056290 90649635 90458275 90576447 90861603 90757225 90624222 90637291 90541122 90505714 90364761
1004.9 90364761 90454185 90596207 90267601 90145378 90389664 90127975 89568794 89580757 89723511 89721931
1014.6 89721931 89599373 89031425 88452560 88304192 88337013 88143929 87882271 87731079 87700806 87671402
1024.2 87671402 87570557 87404877 87016472 87042969 87422745 87715797 87784554 87388557 87479507 87946518
1033.8 87946518 87770248 87173424 86794922 86969147 87146584 86954063 86804482 86932312 87072266 86850250
1043.5 86850250 86416298 86370544 86553322 86664200 86771561 86571007 86579826 86778160 86704552 86737564 86471992
1054.1 86471992 86215355 86420662 86373657 86161133 86230927 86447189 86611717 86490181 86026398 85685066
1063.7 85685066 85639000 85979515 86524445 86451172 86214920 86610619 86923462 86641754 86170029 85954491
1073.4 85954491 86001709 85832375 85489510 85145126 84867195 84958267 84856300 84905357 85188431 84684105
1083 84684105 84384254 84497993 84440269 84761421 84915016 84527466 84017235 83655457 83789749 83929169
1092.7 83929169 83755150 83736908 83623207 83461189 83544624 83709831 84132843 84511642 84593208 84620880
1102.3 84620880 84367889 84155464 84416389 84651596 84611359 84533035 84599968 84733467 84884346 84828690
1112 84828690 84508568 84799919 85482544 85676659 85642578 85587082 85314293 85082863 85325508 85598724
1121.6 85598724 85602989 85574913 85662079 85711555 85746445 86225967 86349358 86104431 86173500 86329239 86658653
1132.2 86658653 86798645 87222656 87998466 88336823 88605232 88935928 89308815 89614418 89897522 90419365
1141.9 90419365 91050415 91541191 91747658 92082611 92524818 92791206 93167053 93332878 93302216 93615379
1151.5 93615379 93915787 93919807 93881989 94167343 94437759 94353607 94248817 94155304 94239578 94428368 94503738
1162.1 94503738 94397911 94194717 94268097 94382080 94220665 94011482 94089546 94188599 94147377 94080261 93866203
1172.7 93866203 93818466 93876335 93807899 93753792 93818977 93818489 93668526 93634773 93452385 93337875 93450912
1183.3 93450912 93445786 93335281 93040825 93068031 93472046 93580917 93426140 93415436 93556992 93527313 93449509
1193.9 93449509 93411575 93303528 93209526 93238663 93078522 92784500 92898285 93051338 92975533 92823799
1203.6 92823799 92870598 93058632 92963417 93026337 93119179 93006180 92979530 92945496 92889687 92713242 92649940
1214.2 92649940 92721130 92565414 92271507 92062096 92058571 91993752 91791397 91646721 91584023 91429352 91085838
1224.8 91085838 90952179 90922585 90775017 90564110 90332710 90307472 90007927 89472160 89246490 89017647
1234.4 89017647 88857925 88819885 88640015 88466927 88277992 88086517 87958336 87830421 87739830 87474945
1244.1 87474945 87076591 86780167 86702141 86726753 86392319 85981705 85777580 85612686 85443031 85357132
1253.7 85357132 85355148 85185791 85078667 84870697 84642685 84571220 84376167 84505836 84595078 84472557
1263.4 84472557 84411812 84190788 83997490 83945702 84075050 84199905 83988098 83660835 83706711 83960350
1273 83960350 84170097 84350777 84377411 84431877 84544563 84728271 84909081 85077812 85300491 85570198
1282.7 85570198 85932770 86214828 86446846 86521080 86673271 87056847 87341438 87572876 87838539 88085129
1292.3 88085129 88198112 88481087 88759209 88843437 89072853 89242035 89410019 89703873 89809883 89710419
1301.9 89710419 89857826 90068695 89915901 89826035 90071449 90297951 90270935 90507378 90790955 90525894
1311.6 90525894 90172699 89989708 90086571 90214333 90077705 90061630 90035072 89921288 89985130 90132668
1321.2 90132668 90196022 90158546 90122597 90127411 90114746 89985245 89998878 90154671 90016655 89920364 90123772
1331.8 90123772 90065941 89736183 89617676 89679764 89658989 89537994 89559502 89575470 89509720 89804947 90063782
1342.4 90063782 90096237 90121140 90138588 90191063 90160744 90089859 90275871 90380325 90365616 90493027 90515282
1353.1 90515282 90384315 90220322 90204254 90216354 90223946 90283798 90104469 89809319 89573883 89350975 89353615
1363.7 89353615 89627586 89761536 89585129 89326271 89000465 88775169 88629074 88336044 88042839 87604141
1373.3 87604141 87264885 87123489 86929260 86812515 86740547 86937614 87013084 86999763 87173302 87453392
1382.9 87453392 87801552 87992088 88040985 87977097 88363106 88962021 89133835 89210381 89421577 89549477
1392.6 89549477 89485374 89424339 89509727 89722107 89477005 88888702 88836723 89145020 89042160 88813019
1402.2 88813019 88776917 88472931 87900589 87827652 87851555 87851173 87686974 87408386 87158821 86873688 86816948
1412.8 86816948 86902931 86857002 86516983 86163078 86183472 86151794 86159615 86521599 86607697 86529648 86300842
1423.4 86300842 86239861 86713600 86918793 86808548 86725189 86530579 86550323 86905655 87027908 86864380
1433.1 86864380 86837433 86779732 86254303 85924896 86556419 87072998 87440887 87624542 87708076 87712524 87815536
1443.7 87815536 87894302 88088211 88307503 88356331 88463531 88885712 89131699 89072838 89227478 89550667
1453.3 89550667 89906403 89763336 89314293 89650116 89575394 90181686 90837349 91180222 91395615 91718216
1463 91718216 91863678 91673325 92130936 92142616 92055634 92202599 92490997 92612625 92021332 91686241
1472.6 91686241 92211273 92830086 92918808 92942673 93375168 93428894 93567894 93459816 93267914 93490799
1482.3 93490799 93674835 93809875 93833771 93755966 93589706 93703690 93486618 92803848 93298790 93832451
1491.9 93832451 94104172 94285561 94269897 93803505 93486000 93766029 93456963 93773705 94064728 93936897
1501.6 93936897 93976875 94054726 93958389 93237473 91360970 92071426 93215424 93456215 93554527 93638535
1511.2 93638535 93551483 93696648 93782455 93603355 93198990 92591789 93002991 93369896 93221581 92292572
1520.8 92292572 91712845 92742645 93280640 92988922 92411705 92616074 92612015 92771164 93204964 93215240
1530.5 93215240 92958954 92644653 92540581 92718521 92805878 92754150 92544403 92124809 90646355 90101700
1540.1 90101700 91026718 91235245 91310814 91554703 91590561 91553505 91712463 91762726 91535339 91055367
1549.8 91055367 91256615 91442757 91409248 91393616 90931961 90998367 90788048 89857307 88679474 86430939
1559.4 86430939 89040390 90519890 90723053 90649704 90512474 90561546 90636726 90601112 90479675 90106560
1569.1 90106560 90037308 90583374 90821190 91053932 91052879 90691505 90140709 90056190 90700645 90988884
1578.7 90988884 91045563 90885490 90644226 90620293 90718979 90793190 90762329 90617897 90479996 90430870 90323212
1589.3 90323212 90192841 90236755 90120979 89978271 89906746 89805115 89800117 89755234 89513557 89252449 89362770
1599.9 89362770 89283791 88922745 88570297 88257492 88322098 88163200 87951027 87823013 87637390 87454346
1609.6 87454346 87215675 87138138 86926865 86805000 86610107 86171898 85447128 85287247 85839645 85592735
1619.2 85592735 85283737 85111176 84847351 84070427 83884804 84423492 84338074 84229439 83820007 83645668
1628.9 83645668 83590927 83454720 83418404 83178123 82914543 82176239 81667473 82339149 82460510 82563255
1638.5 82563255 82313370 82133347 81907387 81986160 82141945 82110680 81817291 81045990 80798935 80959854
1648.1 80959854 81699577 81760201 81646278 81449638 79461449 80092308 81518700 82128151 82131760 82195541
1657.8 82195541 82270538 82276894 82404701 82302025 81920486 82133659 82716431 82810982 83006996 83094864 82506050
1668.4 82506050 81976974 82632988 83151840 83388031 83884293 83987526 83622429 84228508 84603134 84699928
1678 84699928 84536720 84337379 84560394 84954849 84776108 83558022 83799072 85259995 85730789 85623062
1687.7 85623062 85740585 85780457 85902924 86394112 86260567 86151367 85945694 85147636 84810844 85494202
1697.3 85494202 85755577 85408363 84198380 85093231 85943329 85902412 85463501 85178696 84825844 84768021
1707 84768021 85130836 85410301 85352814 85257362 85240585 85194923 85061844 84556839 84689697 84696777 84619225
1717.6 84619225 85238152 85757858 85955200 85936401 86187889 86279739 86673264 87085999 87262337 87609245
1727.2 87609245 87720291 87671791 87644852 88318344 88638702 88554146 88449608 88815102 89887497 90384865
1736.9 90384865 90775925 90915100 91068336 91821564 92330063 92777534 93037361 93541122 94009056 94457870
1746.5 94457870 95008171 95444206 95807335 96047836 96315544 96825470 97426155 97903786 98234230 98250290
1756.2 98250290 98254524 98630737 98775345 99051620 99145859 98949051 99302254 99552444 99661949 99779099
1765.8 99779099 99831543 99761162 100036064 100224754 99961113 99544121 99419701 100338097 100701782 100586617
1775.4 100586617 100661049 100712769 100867706 101046066 100950470 101125137 101238365 101170235 101204750 101263657 101327789
1786 101327789 101322357 101419167 101621628 101635353 101378532 101077362 101076897 101564621 101878975 101785606 101747940
1796.7 101747940 101895103 101838722 101792313 101910286 102052101 102015953 102122169 102415779 102416573 102229019 102093094
1807.3 102093094 102149780 102316574 102213486 102074188 102398247 102714279 102771690 102766014 102776772 102702576 102587784
1817.9 102587784 102645523 102700386 102772430 102710121 102456627 102518860 102474998 102416115 102695137 102752892 102673164
1828.5 102673164 102301735 102192802 102641373 102965858 103117424 103084282 103127350 103123245 102998901 103037979
1838.1 103037979 103291397 103314957 103161377 103072327 102850517 102569954 102543678 102816231 102920708 103039940
1847.8 103039940 103219398 103200363 103318542 103380234 103288223 103307571 103299423 103368958 103438164 103365738 103339211
1858.4 103339211 103348816 103255241 103206932 103255783 103238869 103236298 103375404 103482254 103234039 102951057 103077705
1869 103077705 103223534 103327751 103509758 103485260 103322021 103350540 103469498 103460526 103464844 103491302 103426979
1879.6 103426979 103402992 103345917 103375671 103506493 103464043 103465340 103419266 103355240 103368202 103236832 103262314
1890.2 103262314 103400711 103489204 103563789 103603012 103532288 103436295 103580986 103654419 103593491 103568527 103669731
1900.8 103669731 103723122 103659721 103658684 103486946 103388824 103457161 103440170 103403587 103437126 103564926 103556442
1911.4 103556442 103539780 103622169 103718483 103774345 103771652 103593063 103299446 103490379 103565186 103519859 103464386
1922 103464386 103218979 103327179 103564850 103694725 103639671 103500992 103516792 103547630 103536011 103538696 103643219
1932.6 103643219 103669807 103552956 103420311 103376648 103415451 103383224 103365173 103427917 103394295 102955666 102814491
1943.2 102814491 103222748 103317589 103347076 103447723 103336876 103116325 103212303 103479088 103525017 103529739 103434143
1953.8 103434143 103384544 103484276 103385719 103205292 103216743 103250198 103159203 103173615 103196884 103107971 103124466
1964.5 103124466 103209122 103147636 103056656 103018715 102945122 103067413 103247047 103155334 102999718 103097717 103104630
1975.1 103104630 102890022 102924400 102866402 102790131 102997345 103001083 102910278 102985474 103027634 102893051 102814323
1985.7 102814323 102884682 102837067 102683006 102696983 102723450 102597641 102646515 102679909 102565643 102488235 102542717
1996.3 102542717 102665245 102560265 102568100 102692528 102696907 102629501 102437828 102377563 102479179 102581482 102428299
2006.9 102428299 102265022 102330711 102334969 102427147 102419624 102296326 102342323 102397552 102238457 101944321 101966377
2017.5 101966377 102075493 102076988 102157616 102167542 102170708 102175026 102040787 101918304 102006706 102126488 102091553
2028.1 102091553 102067802 102107147 102049187 101969292 102086266 102125023 101850464 101647812 101763161 101856438 101763771
2038.7 101763771 101778076 101757439 101646393 101714096 101746819 101759895 101784279 101683578 101574059 101470123 101488045
2049.3 101488045 101568825 101652740 101713104 101591705 101532784 101481117 101419724 101465118 101532112 101514191 101305901
2059.9 101305901 101319679 101353226 101375793 101594780 101451752 101356628 101488144 101376961 101145393 101136650 101324707
2070.5 101324707 101307716 101286720 101294609 101204247 101164146 101198166 101237381 101095360 100923607 100900314 101045006
2081.1 101045006 101111221 101020264 100960289 100866020 100843704 100836632 100866867 100956383 100927643 100853928 100934662 101077568
2092.7 101077568 100986763 100873199 100783882 100841156 101030739 101031334 101010399 100933197 100988083 100926903 100733162
2103.3 100733162 100837410 100778549 100715218 100767967 100881584 100981812 100832420 100792747 100728027 100726448 100854309
2113.9 100854309 100804718 100857979 100897949 100720261 100573593 100578171 100691910 100810867 100820602 100805153 100761345
2124.5 100761345 100613670 100588135 100679825 100767334 100853134 100923973 100913200 100762283 100707466 100703056 100642838
2135.1 100642838 100678749 100691711 100705681 100727676 100749901 100946060 100996124 100811798 100769646 100797943 100738129
2145.8 100738129 100674759 100709023 100764999 100733330 100677544 100715797 100800575 100700897 100604179 100709702 100823296
2156.4 100823296 100859177 100736336 100703110 100896835 100971970 100976158 100963135 100872688 100844902 100892410 101012711
2167 101012711 101045578 100943420 100969246 101035141 100958160 100864967 100913963 100969368 100952744 101058426 101171227
2177.6 101171227 101113022 101003677 101041069 101177086 101274765 101318909 101235939 101193962 101259575 101356201 101428780
2188.2 101428780 101334442 101238197 101247643 101336777 101434860 101449394 101481148 101529892 101422302 101284790 101324425
2198.8 101324425 101316154 101352173 101487778 101589600 101671768 101592026 101591782 101683662 101743660 101809731 101835487 101807144
2210.4 101807144 101654137 101648254 101639183 101623894 101826790 101927345 101945435 101923958 101887886 101894669 101945854
2221 101945854 101869179 101708832 101802979 101940697 102082489 102165764 102144882 102155258 102218117 102226654 101982948
2231.6 101982948 101990768 102208710 102249352 102169136 102059570 102158112 102227829 102275116 102312660 102284081 102379929
2242.2 102379929 102465202 102519501 102462746 102441399 102501274 102501266 102510040 102402443 102310219 102327522 102394135 102467857
2253.8 102467857 102547279 102745560 102810066 102643906 102597076 102813301 102999672 102920357 102837219 102828690 102694885
2264.4 102694885 102717010 102842445 102777405 102815773 102944122 103042000 103093964 102945175 102795174 102850685 103017807
2275 103017807 103168610 103194580 103097084 103069420 103037827 103122070 103390160 103326752 103160194 103183876 103204544
2285.6 103204544 103233551 103282761 103327995 103294121 103288078 103216202 103167107 103394585 103415665 103175674 103117714
2296.2 103117714 103198532 103296181 103520401 103721626 103583359 103305321 103292015 103469238 103537682 103493576
2305.8 103493576 103368195 103309906 103424927 103530838 103648651 103717438 103500465 103189964 103296074 103573273
2315.5 103573273 103543640 103560265 103716522 103612030 103238342 102908203 102975372 103382614 103414330 103290970
2325.1 103290970 103410507 103132782 102916435 103059685 103322350 103446907 103156456 103292282 103499786 103356064
2334.8 103356064 103138618 102962738 103265259 103658447 103922821 103768875 103116066 102808945 103275558 104194748
2344.4 104194748 104515358 103956566 103696304 103864159 103922951 103985664 103861488 103635056 103857887 103808434
2354.1 103808434 103406235 103467644 103897316 104070923 103422356 102604355 102481064 103018204 104195808 105057259
2363.7 105057259 104366722 103582306 103555664 103654099 103939545 103886803 103664238 103868073 104167999 104406151
2373.3 104406151 104536957 104378624 104204277 104414185 104698235 104730782 104716217 104720512 104729637 104762009 104816635
2383.9 104816635 105004837 105070686 104991066 105025589 105013077 105184944 105347321 105180328 105178314 105238579 105172447
2394.6 105172447 105099953 105047806 105048584 105061325 105109642 105279274 105477531 105360703 105180161 105065323 104932259
2405.2 104932259 105064430 105220047 105364594 105482864 105292213 104905762 104774216 105111214 105326248 105285034
2414.8 105285034 105279022 105248131 105218445 105289436 105384285 105440666 105501648 105404289 105338028 105470100 105586304
2425.4 105586304 105558578 105457428 105429619 105342842 105396072 105529037 105579544 105623627 105496437 105611145 105795013
2436 105795013 105634262 105481361 105528343 105628609 105539055 105571030 105721756 105717354 105734291 105735260 105706657 105684265
2447.6 105684265 105634598 105554291 105544121 105601379 105615044 105671646 105678825 105536789 105526489 105773926 105867477
2458.2 105867477 105777344 105792137 105843544 105943245 105950050 105846062 105891876 105968887 105905884 105774483 105740654
2468.8 105740654 105889519 106029625 105961143 105812630 105660820 105619080 105817513 105996971 106064064 106004128
2478.5 106004128 105919601 106031815 106104622 106122650 106139450 106060516 106040909 105909645 105730995 105857460 106091866
2489.1 106091866 106217354 106114059 105870773 105788368 105868523 106008026 106094322 106181259 106225906 106115273
2498.7 106115273 106099045 106084167 105943672 105864555 105905434 106072540 106089867 106003143 106157990 106287445 106239883
2509.3 106239883 106205025 106209236 106216476 106217331 106182182 106072517 106082687 106193848 106207298 106286484 106479729 106434441
2520.9 106434441 105997185 105831215 106117195 106259979 106297852 106304565 106201057 106058769 106049179 106239471
2530.5 106239471 106294571 106258476 106224312 106117836 106124451 106219078 106255402 106185165 106138985 106208214 106196381
2541.1 106196381 106201225 106247047 106127182 106211838 106384979 106249771 106234917 106377769 106373863 106323875 106331009
2551.7 106331009 106127403 105910049 106131363 106358154 106389153 106261192 106129745 106199081 106226105 106365112
2561.4 106365112 106534042 106527031 106446617 106363945 106323715 106251366 106230133 106294540 106444946 106563393 106646561
2572 106646561 106565651 106353935 106442039 106404152 106229576 106164520 106165817 106300873 106229370 106232094 106373497
2582.6 106373497 106417519 106397591 106235146 106258072 106466171 106563530 106508698 106469826 106402733 106296928 106428055
2593.2 106428055 106487778 106380028 106475937 106579712 106350548 106212837 106302818 106210884 106210640 106290413 106324654
2603.8 106324654 106447464 106409111 106318832 106373909 106369804 106111687 105964760 106183037 106229645 106111916 106167801
2614.4 106167801 106137352 106112465 106312073 106327209 106062874 105945381 106108185 106241943 106165924 106117538
2624.1 106117538 106101898 106077888 106186882 106162262 105961143 105962975 106065826 106046448 106022369 106029182 106017563
2634.7 106017563 106050484 106095421 105964424 105829735 105928612 106004303 105907211 105829994 105911644 105896942 105689171
2645.3 105689171 105651047 105758919 105808701 105717445 105668129 105840332 105796379 105584366 105536499 105566498 105744850
2655.9 105744850 105827538 105750244 105749802 105760056 105845970 105734917 105512123 105593597 105676788 105745033 105799522
2666.5 105799522 105699898 105547783 105379211 105270775 105162491 105267410 105621613 105706535 105465164 105332825
2676.1 105332825 105422722 105363853 105225128 105305992 105459106 105468628 105355148 105414680 105501617 105330299 105304604
2686.8 105304604 105359253 105172920 105143082 105299286 105393028 105377098 105239182 105160881 105211655 105272675 105174881
2697.4 105174881 105149002 105133026 104961868 104968071 104955353 105019226 105057877 104887131 104877693 104922119 105013687
2708 105013687 104864365 104736748 104946007 104991928 105062202 105086311 105058037 105071068 104943100 104813148 104724472
2718.6 104724472 104763474 104676888 104435463 104451660 104593475 104564995 104492966 104484535 104447014 104402344 104345085
2729.2 104345085 104494057 104808022 104861366 104574890 104338455 104403084 104451065 104463249 104385429 104176262
2738.8 104176262 104026131 103978485 104085350 104224533 104386345 104358414 104312134 104302460 104055084 104003456 104002800
2749.4 104002800 103968552 103986267 103935799 103865494 103744118 103757515 103814384 103912010 103821022 103535255 103556992
2760 103556992 103714294 103792160 103730919 103674988 103623779 103544388 103527237 103524246 103551041 103493507 103527390 103534248
2771.6 103534248 103482780 103503189 103439087 103357620 103209221 103258034 103319366 103210381 103219147 103209930 103159042
2782.2 103159042 103016228 103020973 103174080 103190933 103025429 102791771 102783928 102896721 103021408 102811684
2791.9 102811684 102587471 102885361 103123459 103058746 102873039 102882057 102764656 102524216 102590439 102395287
2801.5 102395287 102206009 102171410 102090324 102270042 102389709 102315033 102064476 101869392 102048805 102163864
2811.2 102163864 101964958 101730408 101609573 101545471 101529823 101449646 101268379 101189034 101111465 101024239 101181755
2821.8 101181755 101263794 101074760 101004433 100991089 100905640 100832840 100675507 100533287 100521942 100483330 100343178
2832.4 100343178 100212440 100093727 100024086 99964935 99845657 99890923 99932869 99777740 99588867 99426590
2842 99426590 99421875 99425934 99353004 99412468 99447273 99311150 99146019 98971680 98757927 98725945 98854408
2852.6 98854408 98809586 98503677 98270576 98363403 98431885 98353020 98202545 98088440 98079201 97933395 97979912
2863.2 97979912 98113159 98063911 98158623 98142448 97954948 97811501 97805092 97748520 97487839 97387100 97397385
2873.8 97397385 97413033 97328865 97202202 97254143 97281708 97258621 97032814 96642197 96458542 96499008 96575180
2884.4 96575180 96538948 96404579 96284271 96341850 96280762 96043816 96006851 95859268 95550407 95409271
2894.1 95409271 95249069 94966667 94758194 94704506 94690338 94486710 94321205 94188095 93640526 93166145
2903.7 93166145 92963989 92781906 92567444 92250679 92090919 91881424 91778206 91646812 90958702 90590561
2913.4 90590561 90682610 90516953 90255791 90280975 90309486 90084579 89919037 89769096 89628738 89765266
2923 89765266 89875153 89549110 89435875 89568573 89209961 89096779 89438255 89546135 89492256 89294167
2932.7 89294167 88994255 88890961 88695488 88391724 88366470 88186172 87979904 87883850 87603661 87550682
2942.3 87550682 87567856 87359169 87111649 86995468 86721725 86382912 86593971 86863327 86964035 87166595
2952 87166595 87229340 87125092 87273232 87667435 87996582 88347511 88485306 88687088 89056389 89198250
2961.6 89198250 89439545 89768776 89901527 89835419 90043884 90375351 90471313 90662354 90743118 90805588
2971.2 90805588 90994751 91061607 90917969 90878319 91071991 91017250 91012115 91201157 91318550 91303482 91185928
2981.8 91185928 91289154 91318916 91090584 90924637 90956726 90924713 90776772 90821884 90757362 90663185 90732368
2992.5 90732368 90657036 90512802 90409416 90474754 90645638 90496712 90162537 90014297 90018982 90081230 89942711
3003.1 89942711 89770256 89794502 89713181 89671379 89668137 89588425 89382988 89247192 89416397 89290924 89110657
3013.7 89110657 89084892 88897408 88832085 88746315 88600502 88485535 88379570 88315201 88277565 88253693 88108963
3024.3 88108963 88031792 88027260 87873756 87605515 87431412 87341064 87149178 87132416 87159836 86969849 86785805
3034.9 86785805 86722305 86711884 86612312 86494408 86336868 86265442 86365211 86205429 85975342 85995789 85858688
3045.5 85858688 85578064 85478569 85351631 85275574 85292221 85214020 85238205 85160583 85093918 85081032 84707932
3056.1 84707932 84532532 84592972 84397285 84179405 84201569 84349106 84174088 83860329 83765800 83733818
3065.7 83733818 83667839 83489700 83423332 83496277 83359283 83014114 82780235 82858719 82880806 82636955 82419167
3076.4 82419167 82414192 82398293 82175636 82115677 81990746 81690430 81730606 81727852 81572319 81460503 81258492
3087 81258492 81178314 81200714 81176445 81036644 80733810 80468979 80515289 80606750 80366356 80278755 80315598
3097.6 80315598 80091705 79925041 79881020 79737785 79480644 79344994 79233322 79136711 79264908 79219055
3107.2 79219055 78925514 78713593 78638504 78624695 78644951 78496147 78132019 77976791 77895821 77808983 77673706
3117.8 77673706 77433746 77550430 77630791 77439438 77290344 77101105 76918739 76860458 76875359 76792206
3127.5 76792206 76586899 76212494 76007324 76213020 76167282 75863480 75797958 75781021 75659103 75559799
3137.1 75559799 75401764 75318954 75391869 75233055 74964012 74828552 74700378 74492950 74318253 74198685
3146.8 74198685 74053810 74118240 74265831 74187538 73949394 73774345 73646820 73416824 73153870 72878639
3156.4 72878639 72874664 72868301 72631355 72715965 72811264 72577225 72236046 72125648 72234718 72166893 71990753
3167 71990753 71770088 71618843 71499603 71284889 71214859 71253319 71218552 71065742 70805283 70493080 70340698
3177.6 70340698 70396355 70427086 70290344 70064377 69986610 69973129 69955185 69878181 69753967 69691544 69343834
3188.2 69343834 68971283 68911743 68895195 68896202 68788437 68585388 68550980 68682991 68565315 68146004 68058838
3198.8 68058838 68110733 67988922 67810516 67441704 67284187 67468216 67482735 67230370 67067001 67127823
3208.5 67127823 67073959 66945160 66876640 66770515 66609947 66371689 66194923 66248108 66402611 66220695
3218.1 66220695 66024216 66046883 65753929 65508659 65602768 65694954 65621529 65536301 65545822 65412781 65075233
3228.7 65075233 64747253 64797615 64787552 64371468 64240295 64417702 64516121 64415230 64229431 64101974
3238.4 64101974 64037544 64090546 64092484 63973793 63869625 63839035 63691875 63544273 63688263 63669540 63271271
3249 63271271 63059124 63225414 63258453 63068722 63094696 63216309 63035442 62865910 62828396 62559811 62335060
3259.6 62335060 62390064 62572411 62568722 62397530 62474998 62600468 62664349 62489437 62062031 61880249 61775974
3270.2 61775974 61735744 61833920 61747860 61687653 61807980 61713028 61498665 61424786 61370899 61282661 61205631
3280.8 61205631 61145222 60872833 60830044 61107033 61093941 61078079 61024628 60856838 60617989 60474789 60679630
3291.4 60679630 60789253 60925720 60920147 60657478 60558037 60469715 60411919 60431290 60482346 60383537 60237476
3302 60237476 60193119 60112919 60206425 60184742 60093227 60241306 60204418 60087162 60136158 60114918 59851589
3312.6 59851589 59521362 59460434 59500023 59575428 59617455 59487484 59570625 59618359 59499714 59454411 59355484
3323.2 59355484 59403034 59374130 59251728 59200935 59085884 59139565 59152588 58980686 58921635 59026188 58928642
3333.8 58928642 58650864 58588024 58605618 58582573 58580894 58704689 58715923 58603294 58535378 58431557 58478359
3344.4 58478359 58389225 58285801 58453110 58680679 58812172 58641479 58390049 58202618 58271778 58367931
3354.1 58367931 58315979 58446030 58249573 57966831 58119770 58212967 58046837 57920174 57910732 57903698 58024132
3364.7 58024132 58242676 58254639 57972187 57839058 57989914 58150261 58117073 57757908 57530777 57490948
3374.3 57490948 57513153 57719555 57814182 57821285 57874935 57942978 57973785 57876766 57846157 57905842 57670399
3384.9 57670399 57551903 57848621 57814106 57587734 57802753 58208527 58031876 57612274 57565136 57528496
3394.6 57528496 57718430 57969616 58235104 58516094 58392029 58295555 58216892 58157497 58016541 57985584
3404.2 57985584 58355202 58477547 58553818 58578564 58424786 58373920 58379627 58370304 58335018 58565361 58587185
3414.8 58587185 58396732 58606087 58867638 58820736 58516190 58613831 58909641 58885628 59041069 59086044
3424.5 59086044 59192898 59571224 59564323 59488056 59596107 59648090 59563622 59449707 59619339 59647247 59346638
3435.1 59346638 59264690 59647018 59961151 59828300 59996750 60280743 60242249 60382988 60496758 60434978
3444.7 60434978 60491596 60688000 60582432 60510983 60819393 60789993 60710556 60794666 60741589 60848289 61099663
3455.3 61099663 61486107 61809177 61760319 61537437 61447186 61551540 61666847 61771786 61779781 61718681 61848030
3466 61848030 62124371 62386181 62540878 62543182 62495533 62647011 62919502 62907391 62605289 62387058 62577473
3476.6 62577473 62971691 63256939 63561317 63707069 63382290 63096668 63411118 63795242 63816017 63850056
3486.2 63850056 63910015 63962143 64234489 64581848 64739143 64605919 64755501 65033661 64974075 65023399
3495.8 65023399 65127975 65235924 65260300 65082939 65070412 65208252 65368927 65420189 65477722 65797997
3505.5 65797997 66301109 66443855 65891457 65641525 66141632 66390190 66409950 66670540 66874641 66794792
3515.1 66794792 67010284 67309265 67251289 67185707 67174286 67398239 67640091 67694550 67828552 67732407 67866859
3525.7 67866859 68298737 68373436 68451027 68599724 68914528 69389580 69332954 69092873 69182022 69193817 69138481
3536.4 69138481 69428207 69580025 69637718 70030716 70260674 70156570 70280952 70768517 70888939 70526024
3546 70526024 70518204 70697266 70885117 71192871 71321800 71310570 71416031 71535866 71897354 72270859 72253609
3556.6 72253609 72367310 72498787 72522041 72781357 72785164 72457199 72442467 72902733 72998863 72771675 73058929
3567.2 73058929 73383057 73793076 74021164 74099319 74260498 74400177 74541885 74681137 74681793 74796570
3576.9 74796570 75187332 75251999 75160797 75358253 75611008 75768822 75808578 75779144 75374657 75157784
3586.5 75157784 75893112 76082130 76424477 76773544 76983826 77060394 76621262 76528671 76692078 77001068
3596.1 77001068 77347527 77232780 77413254 77608986 77748650 78373077 78490677 78350967 78607788 78787384
3605.8 78787384 78969742 79219330 78965393 78623611 79033325 79433006 79520676 79693779 79753220 79731644
3615.4 79731644 79884529 79952179 80176277 80554527 80928802 81018982 80885941 80929108 81344574 81571541
3625.1 81571541 81242310 81192871 81054031 80057022 80929474 82020554 82517662 82618172 82426582 82714775
3634.7 82714775 83434044 83742485 83544113 83376320 83454613 83851486 84023895 84012596 84377480 84774086
3644.4 84774086 84849457 84113441 83533379 84571808 84428444 83976463 84683929 85815170 86474762 86674286
3654 86674286 86399109 85968170 86386299 87090691 87229118 87556374 88067200 88276115 88344887 88549156
3663.6 88549156 88967407 89010101 89044205 89384453 89223816 89274094 89401863 90150764 91166496 91161652
3673.3 91161652 90658974 89442955 91029114 92032906 92322601 92836632 92901634 93240898 93487984
3682 93487984 93683052 93861130 94299500 94808708 94529190 94410461 95316193 95830452 95139420 95150131
3691.6 95150131 96238213 96295441 96421715 96888145 97382263 97674141 97727249 97629402 97769562 97951439
3701.3 97951439 97784760 98599815 99033356 99043869 99032036 99022163 99386703 99183807 98840164 99419113
3710.9 99419113 99606491 100081337 100558929 100723801 100617874 100414436 100364670 100654152 100943336 100855431
3720.5 100855431 100678070 100644623 101097809 101250557 101227448 101164505 101229477 101614876 101847382 101843102 101743965
3731.2 101743965 101699341 101770355 101949173 101955292 101668571 101507835 101762039 102460350 102540146 102220581
3740.8 102220581 102286308 102652618 102645424 101420441 101657501 102339973 102583084 102377838 102203224 103582611
3750.4 103582611 103949150 103881363 103544731 103241760 103105278 103177299 103396217 103600601 103446625 103336342
3760.1 103336342 104015915 104064133 103816711 103809990 103571739 103538353 104190872 104222389 103980782 103771294
3769.7 103771294 103663269 104151268 104580788 104768295 104722717 104491379 104396347 104561584 104796890 104683105
3779.4 104683105 104601082 104660210 104602798 104665726 104543320 104608788 104799858 104776161 104799561 104825401 104975037
3790 104975037 104894569 104796455 104825279 104734261 104891640 105143936 105049492 104831581 104920525 104823273 104501823
3800.6 104501823 103968094 104211990 105005257 105289062 105380203 105034630 104071106 104615746 105213196 105550896
3810.2 105550896 105607681 105304581 105109276 105318993 105563965 105216240 104605240 104975044 105246933 104959465
3819.9 104959465 104459274 104718391 105433876 105869240 105769409 105588448 105423431 105228004 105626160 105929207
3829.5 105929207 105808571 105264572 105223808 105887421 105720146 105080658 105207893 105198021 104979080 104987663
3839.2 104987663 104461121 104125397 104885849 105246529 105426804 105731377 105905853 106065155 106034256 105645378
3848.8 105645378 105231033 105470779 105703835 105767014 107116837 106365944 105125015 105303024 105609322
3857.5 105609322 106223412 106234474 105961082 105556183 105117744 105763863 105819321 105031792 105557304 105994995
3867.1 105994995 105913528 105510307 104211098 104394890 105805328 106356056 106138535 105985306 106256561
3875.8 106256561 106261292 105926071 105492622 105126152 105245285 105975891 106291573 106262680 106006142 106085571
3885.4 106085571 106528801 106521027 106309570 106137634 105962914 105657204 106080193 106412430 106045753 105774597
3895.1 105774597 106131218 106314728 106054787 105998199 106087708 105901138 105731064 106366989 106551193 105802895
3904.7 105802895 105915436 106220818 106060753 105983658 106172935 106392326 106364441 106310272 106276001 106427483
3914.4 106427483 106653732 106406578 105997955 105826714 105680969 105682709 106056229 106379539 106205627 105851868
3924 105851868 106095596 106552155 106640617 106464653 106294495 106247391 106265640 106242409 105948723 106103630 106298431
3934.6 106298431 106234421 106312462 106072327 105892883 106156158 106395416 106369400 105981476 105646568 105677246
3944.3 105677246 105875404 106296761 106572090 106475250 106456177 106403152 106380020 106608009 106320198 106154617
3953.9 106154617 106572784 106698280 106663437 106479706 106209976 106229103 106330368 106306610 106256592 106281776
3963.6 106281776 106407631 106425499 106304962 106432335 106491661 106296799 106031113 105870010 106080315 106220840
3973.2 106220840 106310188 106619095 106784096 106787613 106747032 106521004 106352936 106479851 106433632 106301239
3982.8 106301239 106161812 106201851 106578346 106629990 106751091 106735764 106273788 106261391 106417061 106384644
3992.5 106384644 106505516 106870567 106955177 106679771 106708168 106721664 106644928 106787674
4000.2 106787674
##END=$$ End of the data block
