##TITLE=$$ Begin of the data block
##JCAMP-DX=5.00 $$ ACD/SpecManager v 10.08
##SPECTROMETER/DATA SYSTEM=Varian
##DATE=07 Jan 2013 16:01:40
##DATA TYPE=INFRARED SPECTRUM
##DATA CLASS=XYDATA
##ORIGIN=
##OWNER=
##NPOINTS=3735
##FIRSTX=399.26403809
##LASTX=4000.35498047
##MAXX=4000.35498047
##MINX=399.26403809
##MAXY=126.93159485
##MINY=0.00000100
##XFACTOR=1.0000000000
##YFACTOR=0.000001000000000
##FIRSTY=126.93159485
##DELTAX=0.96440572
##XUNITS=1/CM
##YUNITS=TRANSMITTANCE
##XYDATA=(X++(Y..Y))
399.3A26931595T7j26931594%U4N6658439m338932j9143010j3638622j9537875J5543502
$$ 126931595 126931595 126931595 126931595 126931595 126931595 126931595 126931595 126931595 126931595 126931595 126931595 126931595 126931595 126931595 126931595 126931595 126931595 126931595 126931595 126931595 126931595 126931595 126931595 126931595 126931595 126931595 1 1 1 1 1 1 1 1 1 1 1 1 1 1 1 1 1 1 1 1 1 1 1 1 1 1 1 1 1 1 1 1 1 1 1 56658440 52319508 33176498 19537876 1 15543503
463.9A5543503J0954157j4648980o844014k057504k947161%K273965M682400K184882
$$ 15543503 26497660 11848680 5004666 2947162 1 1 2273966 6956366 9141248
472.6I141248r82982k970697J993886m75223l47616N069372p7894K504710J846127
$$ 9141248 8158266 5187569 7181455 6706232 6358616 11427988 11350094 13854804 15700931
481.2A5700931p944432o358760j397738%WK319477N233437l099041k974564R78543
$$ 15700931 7756499 1397739 1 1 1 1 1 1 2319478 7552915 4453874 1479310 2457853
493.8B457853L021413k923205k73899K986956k089872n02193R0229n6749R37528p17060
$$ 2457853 5479266 2556061 2282162 5269118 3179246 2677053 2767282 2710533 3648061 2931001
503.4B931001j425328j91295K476170j20358j836724m44391p63065O06025M20791K63719
$$ 2931001 1505673 1314378 3790548 3670190 1833466 1389075 626010 1232035 1652826 1916545
513.1A916545J491463j240814j519430J548740J051428p08664j398018j17805R67785
$$ 1916545 3408008 2167194 647764 2196504 3247932 2539268 1141250 1023445 1991230
521.7A991230K44353l85314o69566l09124M52230R05522M26876k72785o33277k89133
$$ 1991230 2235583 1850269 1180703 871579 1323809 2229331 2656207 2383422 1750145 1461012
531.4A461012P73764O5356r76299r12413R95206J650023r47691m72265Q75607N80043
$$ 1461012 2234776 2300132 1323833 411420 1406626 3056649 2108958 1636693 2512300 3092343
541C092343J63098o17985k98892l94267j45773J047104N41704o10960k63396j71696
$$ 3092343 3255441 2637456 2338564 1944297 1798524 2845628 3387332 2776372 2512976 2341280
550.7B341280j125987m11356L19740M73338Q74394J45979l72826N55183N72979o19196
$$ 2341280 1215293 803937 1123677 1597015 2471409 2617388 2244562 2799745 3372724 2753528
560.3B753528o38227l45881K05650J92640p18919k49901O3673K76129P3347m56940
$$ 2753528 2115301 1769420 1975070 2167710 1448791 1198890 1262563 1538692 1612039 1155099
570A155099J92833M00637p9070n39815l64383M4238L33305L48066K97961J82300l30580
$$ 1155099 1347932 1748569 1669499 1129684 765301 809539 1142844 1490910 1788871 1971171 1640591
580.6A640591O1215J84650m82693j21717P31373K27770n08971j28546l03884k15721
$$ 1640591 1701806 1886456 1403763 1282046 2013419 2241189 1732218 1603672 1299788 1084067
590.2A084067K97870K6984K45008L56063l5498l3898k1820o750M17753J51374o30049
$$ 1084067 1381937 1408921 1653929 2009992 1974494 1940596 1918776 1912026 2329779 2481153 1851104
600.8A851104o38953R9974O48652j01344n50239r8198K26336J24198o3861k66506k41047
$$ 1851104 1212151 1312125 1960777 1859433 1309194 1210996 1437332 1561530 1497669 1231163 990116
611.4I90116P11253P5340m48072O51621k3927p10909k902K33121k78882k57780l7545
$$ 990116 1701369 1776709 1328637 1980258 1956331 1245422 1242520 1475641 1196759 938979 901434
622I01434j65311J90343K71680N26427q6173p66817m1079K24369K86815l43145n06755
$$ 901434 736123 926466 1198146 1724573 1638400 871583 830504 1054873 1341688 998543 491788
632.7D91788N66418M93622k08006k63954M25541J82367o10044k26492J28765L22691
$$ 491788 1058206 1551828 1343822 1079868 1505409 1687776 1077732 851240 980005 1302696
642.3A302696K73168l14325l99706m3742K48574L56580J50468n4439k07244k55053
$$ 1302696 1575864 1261539 861833 818091 1066665 1423245 1573713 1519274 1312030 1056977
651.9A056977J54826K22294j63147j68196j20707j5582K92068L13739L1103m8776M01862
$$ 1056977 1211803 1434097 1270950 1102754 982047 966465 1258533 1572272 1603375 1554599 1956461
662.5A956461L36938k18135k61025l86449n3397K051069p52798r97961o05960l41551
$$ 1956461 2293399 2075264 1814239 1427790 1374393 3425462 2672664 1674703 1068743 727192
672.2G27192L50890M10142l6104L4854j69618J62410M10740n63866l16980J97361j6485
$$ 727192 1078082 1488224 1452120 1486974 1317356 1479766 1890506 1326640 1009660 1207021 1190536
682.8A190536J0632j4467K12643J83042J14622k25851l54600J81792m1463k5699L306
$$ 1190536 1201168 1186701 1399344 1582386 1697008 1471157 1116557 1298349 1256886 1231187 1234493
693.4A234493l7950N04335L79738l18020o80617l02549M1309J73562L85153J68767
$$ 1234493 1196543 1700878 2080616 1762596 1081979 779430 820739 994301 1379454 1548221
703.1A548221o5816q9835k55899j20731K14681K7651l5508M2425K2782O1411l8257
$$ 1548221 1482405 1392570 1136671 1015940 1230621 1258272 1222764 1265189 1287971 1349382 1311125
713.7A311125R2637Q7823K28601R8490m71696j92223J36394o9380m25964l72187J63839
$$ 1311125 1403762 1491585 1720186 1818676 1346980 1154757 1291151 1221771 795807 423620 587459
724.3E87459O17745L97573k34495n306J74116J55472k0444n08298J01562N25229j16076
$$ 587459 1205204 1602777 1368282 1362976 1537092 1692564 1672120 1163822 1265384 1790613 1674537
734.9A674537m92647k99559J51287M72577J16385j46488J1229k14291j29298Q5665
$$ 1674537 1181890 882331 1033618 1506195 1622580 1476092 1487321 1273030 1143732 1229397
744.5A229397K64745L08244j35101j84877j07556k0201J50828J20921l8293l6475L0972
$$ 1229397 1494142 1802386 1667285 1482408 1374852 1354651 1505479 1626400 1588107 1551632 1582604
755.1A582604J439O2651j12915J52107K18551j68631j80793k51766J97053L79213K23312
$$ 1582604 1584043 1646694 1533779 1685886 1904437 1735806 1555013 1303247 1500300 1879513 2102825
765.7B102825r8391n47565J5722L9008r9545K69629q3513k51611J44595L58769K29953
$$ 2102825 2004434 1456869 1472591 1511599 1412054 1681683 1598170 1346559 1491154 1849923 2079876
776.4B079876k16334m94466P2083N01363L62198J22119m13131m33991n6298M5123J22482
$$ 2079876 1863542 1369076 1441159 1942522 2304720 2426839 2013708 1579717 1523419 1568542 1691024
787A691024k3580l00487l0157L01980M5461J29899L07199r0766L659K26774l26593
$$ 1691024 1667444 1366957 1336800 1638780 1684241 1814140 2121339 2030573 2034232 2261006 1934413
797.6A934413m08639n0318j5312L21074M16999j6183m01791j25888J12465k86135K31964
$$ 1934413 1525774 1475456 1460144 1781218 2198217 2182034 1780243 1654355 1766820 1480685 1712649
808.2A712649P59218K6585o11938j31633L27741j70513j74175K00794K25906L5926
$$ 1712649 2471867 2498452 1886514 1754881 2082622 1912109 1737934 1938728 2164634 2200560
817.8B200560r6937J37659O6863k04950k11629K4155K21099J44443m2479l9432O1770
$$ 2200560 2103623 2241282 2308145 2103195 1891566 1915721 2136820 2281263 2238784 2199352 2261122
828.4B261122j27391j79995J44252L61273j23095l35079L75129L54335k80326q1401
$$ 2261122 2133731 1953736 2097988 2459261 2336166 2001087 2376216 2730551 2450225 2368824
838.1B368824L72140J9961k31144j40673k3935J63584q0624k9578j73732k03033K66601
$$ 2368824 2740964 2760925 2529781 2389108 2365173 2528757 2448133 2418555 2244823 2041790 2308391
848.7B308391J5853K11423M55659O8274l1402j6333M5435m0197l50661n9508O84677
$$ 2308391 2324244 2535667 2991326 3059600 3028198 3011865 3057300 3017103 2666442 2606934 3291611
859.3C291611R8764n31452J95930J73503j74693R9113n3167P9465N58941J35452j30900
$$ 3291611 3390375 2858923 3054853 3228356 3053663 3152776 3099609 3179074 3738015 3873467 3742567
869.9C742567P1455m7308k8669m0122K1453O0373j64656q9527J62736K70138K01515
$$ 3742567 3814022 3766714 3738045 3697923 3719376 3779749 3615093 3525566 3688302 3958440 4159955
880.5D159955k6366j50440N3103J69510K67177J76168q2405n4407j74515K14349L06890
$$ 4159955 4133589 3983149 4036252 4205762 4472939 4649107 4566702 4512295 4337780 4552129 4859019
891.1D859019k75070j07445j5034J38048J65537j34064M16245N07959k01474j48857
$$ 4859019 4583949 4476504 4461470 4599518 4765055 4630991 5047236 5555195 5353721 5204864
900.8E204864K49719P3608j45400J16370L13493J09184j82277k75853j2376K33300
$$ 5204864 5454583 5528191 5382791 5499161 5812654 5921838 5739561 5463708 5451332 5684632
910.4E684632K19021P7551o0411Q0166l9966J19697M93099J25302Q8665r0603k66774
$$ 5684632 5903653 5981204 5920793 6000959 5960993 6080690 6573789 6699091 6787756 6697153 6430379
921F430379N1070R1043J66651j2248K30417L85598N2778M2375j49595J87011L17797
$$ 6430379 6481449 6572492 6739143 6726895 6957312 7342910 7395688 7438063 7288468 7475479 7793276
931.6G793276J29690K24615l0462M5382O432l0869J20564J96741K74002m4072M2389
$$ 7793276 7922966 8147581 8117119 8162501 8168933 8138064 8258628 8455369 8729371 8685299 8727688
942.2H727688J27691J30737J01810l14838J91617N42362M4917j99281k59192J58837
$$ 8727688 8855379 8986116 9087926 8773088 8964705 9507067 9551984 9352703 9093511 9252348
951.9I252348M52526J35160l5133O54J95642L18925O7137j20720Q5184L92164J65307
$$ 9252348 9704874 9840034 9804901 9805555 10001197 10320122 10387259 10266539 10351723 10743887 10909194
962.5A0909194k17791Q7533J83938k05700k3993K98759K46868O7210j61839L9299L50504
$$ 10909194 10691403 10778936 10962874 10757174 10733181 11031940 11278808 11346018 11184179 11223478 11573982
973.1A1573982K63781J15561j27720j66252J70828M42004J62270k33120l4563K0445
$$ 11573982 11837763 11953324 11825604 11659352 11830180 12272184 12434454 12201334 12166771 12187216
982.7A2187216J66074J78711P565M45661N3066l49897J2979K65148M16164j23770j30711
$$ 12187216 12353290 12532001 12539566 12985227 13038293 12688396 12701375 12966523 13382687 13258917 13128206
993.3A3128206J81551M0250K03218j4760J9356K10327q6688k5986R1634O8460J15646
$$ 13128206 13309757 13350007 13553225 13538465 13557821 13768148 13681460 13655474 13747108 13815568 13931214
1004A3931214l336o4350Q4255l8743q8263K55452K17625Q3698J73709n2613k39899
$$ 13931214 13927878 13863528 13947783 13909040 13820777 14076229 14293854 14377552 14551261 14498648 14258749
1014.6A4258749j18203p735N1382R2336J43853j7214k61359j87986J14294K43842o1191
$$ 14258749 14140546 14132811 14184193 14276529 14420382 14403168 14141809 13953823 14068117 14311959 14250768
1025.2A4250768k91147j97070P2909J82239Q2273J15471J60448L17515N5384m20236
$$ 14250768 13959621 13762551 13835460 14017699 14099972 14215443 14375891 14693406 14748790 14328554
1034.8A4328554k68984J05817L22302Q6045q3020m2809J6659J03927Q0610J24504L2787
$$ 14328554 14059570 14165387 14487689 14573734 14490714 14447905 14464564 14568491 14649101 14773605 14806392
1045.4A4806392R5298l4889j77739r194J5461M8568j49120K34374M13514j50408k54694
$$ 14806392 14901690 14866801 14689062 14679868 14695329 14743897 14594777 14829151 15242665 15092257 14837563
1056A4837563j63250L40707L44953l26928m19084L5401K09176P2629O3945k60773M5891
$$ 14837563 14674313 15015020 15359973 15033045 14613961 14649362 14858538 14931167 14995112 14734339 14780230
1066.6A4780230N03287j2653n44946k33656N62284J92079k57593K4533J70251M07853
$$ 14780230 15283517 15270864 14725918 14492262 15054546 15246625 14989032 15013565 15183816 15591669
1076.3A5591669K72616k07924l85277m3188j77965m67679N9403K67597p826p8351M3078
$$ 15591669 15864285 15656361 15271084 15227896 15049931 14582252 14641655 14909252 14901426 14823075 14866153
1086.9A4866153j62237l49757O9991L51488J41903k31279k54060l7690J9119L14041
$$ 14866153 14703916 14354159 14424150 14775638 14917541 14686262 14432202 14394512 14413631 14727672
1096.5A4727672M11275O7r7620l63793n98101k4845K04041J33124J62368J73694R8788
$$ 14727672 15138947 15139014 15041394 14677601 14079500 14054655 14258696 14391820 14554188 14727882 14826670
1107.1A4826670k67959j08566K38459k602k08763J25244L48496K61195K38813J9770
$$ 14826670 14558711 14450145 14688604 14686002 14477239 14602483 14950979 15212174 15450987 15470757
1116.8A5470757j36246l43179j62345K54733r9307k72751l7959N9378P3311K76459
$$ 15470757 15334511 14991332 14828987 15083720 14984413 14711662 14673703 14733081 14806392 15082851
1126.4A5082851L14214l7314n3525J11156L09002J77658j79891n4131K28925J71999
$$ 15082851 15397065 15359751 15306226 15417382 15726384 15904042 15724151 15670020 15898945 16070944
1136.1A6070944j51340j38839J80533M22729L02735L12172L61940k8059J14124K10610
$$ 16070944 15919604 15780765 15961298 16384027 16686762 16998934 17360874 17332815 17446939 17657549
1145.7A7657549L2518R5251L456n3302P8668P2045k4542K03232K8564j43579P3026
$$ 17657549 17690067 17785318 17788774 17735472 17814140 17886185 17861643 18064875 18093439 17949860 18022886
1156.3A8022886K6491R1702l6829j67810r1107n106N8939O5672Q5955l5235N5382N1821
$$ 18022886 18049377 18141079 18104250 17936440 17845333 17840227 17899166 17964838 18050793 18015558 18070940 18122761
1167.9A8122761j17939j36284K4437m9374k26190K36610K86394K831j95208k37493
$$ 18122761 18004822 17868538 17892975 17843601 17617411 17854021 18140415 18143246 17948038 17710545
1177.5A7710545O9358j3397j1923j09682m2024J32551k34247j34955O9729J20430J29599
$$ 17710545 17779903 17766506 17754583 17644901 17602877 17735428 17501181 17366226 17435955 17556385 17685984
1188.1A7685984o4247j56632j06573L6068r4622p6200J36211J2432o2950m877r3700
$$ 17685984 17621737 17465105 17358532 17394600 17299978 17223778 17359989 17372421 17309471 17304594 17210894
1198.8A7210894k24045l5023J53977P89l6722M5538J36713J51438r5400j41316p9431
$$ 17210894 16986849 16951826 17105803 17106592 17069870 17115408 17252121 17403559 17308159 17166843 17087412
1209.4A7087412j02923P5030N3577n1576N3718N0337K243R3287m0556k97303q7610
$$ 17087412 16984489 17059519 17113096 17061520 17115238 17165575 17167818 17261105 17220549 16923246 16835636
1220A6835636J9518r0963j10737j12707R0460J70940K0079j26799j14447m3171l5177
$$ 16835636 16855154 16764191 16653454 16540747 16631207 16802147 16822226 16695427 16580980 16537809 16502632
1230.6A6502632n6913j05129o7191k08341k23973j01151p4337N1201L7299Q2998L2953
$$ 16502632 16445719 16340590 16273399 16065058 15841085 15739934 15665597 15716798 15754097 15837095 15870048
1241.2A5870048r9632k5944j43125k79853k20798l5887Q5555l6353q8611O849j24755
$$ 15870048 15770416 15744472 15601347 15321494 15100696 15064809 15150364 15114011 15025400 15032249 14907494
1251.8A4907494j45565J97258k2978l43712m7019l9575j72724q8368j12850j4997O1016
$$ 14907494 14761929 14959187 14936209 14592497 14545478 14505903 14333179 14244811 14131961 14116964 14177980
1262.4A4177980K81l4055r5673j10330p668J20116p8816k77594l2847J055j69087r4794
$$ 14177980 14178261 14144206 14048533 13938203 13930535 14050651 13971835 13694241 13661394 13662449 13493362 13398568
1274A3398568P8331Q3152q1796p4952O5990J66918L8533j60735J0605J50348N8930
$$ 13398568 13476899 13560051 13478255 13403303 13469293 13636211 13674744 13514009 13524614 13674962 13733892
1284.6A3733892J9179P0697J32330R1998N2758j6500p1817l6259K9941J36651J71751
$$ 13733892 13753071 13823768 13956098 14048096 14100854 14084354 14012537 13976278 14006219 14142870 14314621
1295.2A4314621K32886K80024J03386J9353J01580N5427O006m7763M9100K19137n6947
$$ 14314621 14547507 14827531 14930917 14950270 15051850 15107277 15113283 15065520 15114620 15333757 15276810
1305.8A5276810j13162L7470l9046J19857J83649m9895j72078j10169m2074N6361J25428
$$ 15276810 15163648 15201118 15162072 15281929 15465578 15415683 15243605 15133436 15091362 15147723 15273151
1316.4A5273151J37679k3006k16742K0112J17487K7897k9029o2403j521l3551N0155
$$ 15273151 15410830 15387824 15171082 15191194 15308681 15336578 15307549 15245146 15243625 15210074 15260229
1327A5260229k5291l1548J04574j09017j03385M3744R7118J1424j24172L8490L3112
$$ 15260229 15234938 15203390 15307964 15198947 15095562 15139306 15236424 15247848 15123676 15162166 15195278
1337.6A5195278q6845J55377K68512r3259j99190o6432n817k434l6654j0216Q4152
$$ 15195278 15108433 15263810 15532322 15439063 15239873 15173441 15167624 15165190 15128536 15118320 15202472
1348.2A5202472M8251p7413n5340K1636K7035J1070k7341j0147L2113Q5525M084j62794
$$ 15202472 15250723 15173310 15117970 15139606 15166641 15177711 15150370 15140223 15172336 15257861 15261945 15099151
1359.8A5099151j06109j5061k5925p5505p2693O4722O0857j28839j59369k1386Q1904
$$ 15099151 14993042 14977981 14952056 14876551 14803858 14868580 14929437 14800598 14641229 14619843 14701747
1370.4A4701747p3841l33721k61215k6326P3492O4483j4468q7660r2496j90646n8769
$$ 14701747 14627906 14294185 14032970 14006644 14080136 14144619 14130151 14042491 13949995 13759349 13700580
1381A3700580K70680M5270j92312j6416K1136k855J54988J57950K0504O6135P1407
$$ 13700580 13971260 14016530 13824218 13807802 13828938 13826083 13981071 14139021 14159525 14225660 14297067
1391.6A4297067j5107L9244J14123K52451J4987k19515q8507K6941K9985j3656r3573
$$ 14297067 14281960 14321204 14435327 14687778 14702765 14483250 14394743 14421684 14451669 14438013 14344440
1402.2A4344440k35361j97281Q1671j5801k14060j40105J0076k3696r3354j78116j87331
$$ 14344440 14109079 13911798 13993469 13977668 13763608 13623503 13633579 13609883 13516529 13338413 13151082
1412.8A3151082J8073k5688o8263J1810l4910L5839J00102m7510p1505m9972J16093
$$ 13151082 13169155 13143467 13075204 13087014 13052104 13087943 13188045 13140535 13069030 13019058 13135151
1423.4A3135151N8753n3083j433p1374K3158j01620k58292J57210J46832o704l6452
$$ 13135151 13193904 13140821 13139388 13068014 13091172 12989552 12731260 12888470 13035302 13028598 12992146
1434.1A2992146k2085M1330J95635n4092j1942J52157M2037K1815J7240j07406q0497
$$ 12992146 12970061 13011391 13207026 13152934 13140992 13293149 13335186 13357001 13374241 13266835 13186338
1444.7A3186338N8131J01341j21176P2372K77475P6811J8883j0619O6939J01149J3752
$$ 13186338 13244469 13345810 13224634 13297006 13574481 13651292 13670175 13659556 13726495 13827644 13841396
1455.3A3841396k93958J46909Q20745K1768j84737l08717o7210R6754J2123J01444
$$ 13841396 13547438 13694347 14515092 14536860 14352123 14043406 13976196 14072950 14085073 14186517
1464.9A4186517j11272N3620J35548j4464r0523J2760K05847Q9170M9204j01040q0460
$$ 14186517 14075245 14128865 14264413 14249949 14159426 14172186 14378033 14467203 14516407 14415367 14334907
1475.5A4334907P8050n6770j75914j27408l2286j2618J51552o9852k69884j39214j2754
$$ 14334907 14412957 14356187 14180273 14052865 14020579 14007961 14159513 14089661 13819777 13680563 13667809
1486.1A3667809Q6876L2195M5632r3671r1763J03400k116j08753j32069J92038K99888
$$ 13667809 13754685 13786880 13832512 13738841 13647078 13750478 13748362 13639609 13507540 13699578 13999466
1496.7A3999466k42141j13927L1988r8798m4989J9918k47964l83996n53646J26747
$$ 13999466 13757325 13643398 13675386 13576588 13531599 13551517 13303553 12919557 12365911 12492658
1506.4A2492658P93239l38409J2004K2097J01023j60022j10501K677j73883j92347
$$ 12492658 13285897 12947488 12959492 12981589 13082612 12922590 12812089 12814766 12640883 12448536
1516A2448536m09439K10896K950k71341J78046M74986m34891k22424q998p5031J67855
$$ 12448536 12039097 12249993 12252943 11981602 12159648 12634634 12199743 11977319 11968321 11893290 12061145
1526.6A2061145j76599k23591J02939j2203p7512k74782O0875J302k82535k56478k32641
$$ 12061145 11884546 11660955 11763894 11751691 11674179 11399397 11460272 11461574 11179039 10922561 10689920
1537.2A0689920J13023M61122K89305j147549j81915L91397J0209K84032m63385l43064
$$ 10689920 10802943 11264065 11553370 10405821 10223906 10615303 10625512 10909544 10446159 10103095
1546.9A0103095j68362o8687P9271j58639k31708j75428L4998k06842j1071j87283
$$ 10103095 9934733 9866046 9945317 9786678 9554970 9379542 9414540 9207698 9196627 9009344
1556.5I009344n97888N15589J030952k2396q38692m00845k15749j07872Q8786j68882
$$ 9009344 8411456 8927045 9957997 9935601 9096909 8696064 8480315 8372443 8461229 8292347
1566.2H292347k62249k31370K82735L69568m43741j26311k2695k93267n79084j65162
$$ 8292347 8030098 7798728 8081463 8451031 8007290 7880979 7858284 7565017 6985933 6820771
1575.8F820771O74033K6413l21480k86891j88424k29780j7989j90349q8356L3629n102
$$ 6820771 7494804 7521217 7199737 6912846 6724422 6494642 6476653 6286304 6197948 6231577 6226475
1586.4F226475r9677l64508k03207j41672p9588j20732n3160j47022k97499l9868j48042
$$ 6226475 6126798 5762290 5559083 5417411 5337823 5217091 5163931 5016909 4719410 4679542 4531500
1597D531500j13011j91627k14581j24581q5078j40175j79025j6720k13131j7690O5029
$$ 4531500 4418489 4226862 4012281 3887700 3802622 3662447 3483422 3466702 3253571 3235881 3300910
1607.6C300910p6831j07053j09171m2869k30835m6224j51716k30091j22024L69714
$$ 3300910 3224079 3117026 3007855 2964986 2734151 2687927 2536211 2306120 2184096 2553810
1617.3B553810j0509l60699o4873k19677r7599k1260Q6677J93904k50548o9376k5706
$$ 2553810 2543301 2182602 2117729 1898052 1800453 1779193 1865870 2059774 1809226 1739850 1714144
1627.9A714144K9971k02763j18788J44840j02023k9811k20781K76314O7702j00775
$$ 1714144 1744115 1541352 1422564 1567404 1465381 1435570 1214789 1491103 1558805 1458030
1637.5A458030R1350k44418K1307J24880q327k92576j11539k8805p0678O11281J5997
$$ 1458030 1549380 1304962 1326269 1451149 1442822 1150246 1038707 1009902 939224 1550505 1566502
1648.1A566502q832k95746l92406n02814J40418L073226j387607m21464k16058m8251
$$ 1566502 1557670 1261924 869518 366704 507122 3580348 2192741 1771277 1555219 1506968
1657.8A506968j13551N0221J03046j76797K30173K35616l7087j81310K5579P4170j19440
$$ 1506968 1393417 1443638 1546684 1369887 1600060 1835676 1798589 1617279 1642858 1717028 1597588
1668.4A597588M46630J09521J49141R5135k00368k13995L13922K96311m66138m4462
$$ 1597588 2044218 2153739 2302880 2398015 2197647 1983652 2297574 2593885 2127747 2083285
1678B083285M87K91419K26578q1769K4544j49851R20230J46140r330j65798J46125
$$ 2083285 2083772 2375191 2601769 2520000 2544544 2394693 3314923 3461063 3451733 3285935 3432060
1688.6C432060J53808j02509Q2850p6740J87342j13430k02078Q06453K54550Q2938
$$ 3432060 3585868 3483359 3566209 3489469 3676811 3563381 3361303 4167756 4422306 4505244
1698.3D505244l42649Q29894J165410m28829k86983l63837L34539M27123O63621J96103
$$ 4505244 4162595 4992489 6157899 5729070 5442087 5078250 5412789 5839912 6503533 6699636
1707.9F699636j04471o2221K08340K84271R4853J81972k1400J53143J87008O53256
$$ 6699636 6595165 6532944 6741284 7025555 7120408 7302380 7280980 7434123 7621131 8274387
1717.6H274387J376041k66371k04104J40459N78058L55609L40792L87696L34999L44955
$$ 8274387 9650428 9384057 9179953 9320412 9898470 10254079 10594871 10982567 11317566 11662521
1727.2A1662521J84245L13560M10034M56328J40476Q2548M63366J192996N30884J89102
$$ 11662521 11846766 12160326 12570360 13026688 13167164 13249712 13713078 14906074 15436958 15626060
1736.9A5626060M82016M37325M70268N46629L27991K80129L38672Q07230M36573K58795
$$ 15626060 16108076 16545401 17015669 17562298 17890289 18170418 18509090 19316320 19752893 20011688
1746.5B0011688M53058N82701M24532K19219N04635P69596M01732J44827K82928K63159
$$ 20011688 20464746 21047447 21471979 21691198 22195833 22965429 23367161 23511988 23794916 24058075
1756.2B4058075N02575O50335K70104K53631J76178O03508N86020K85684M39225L80584
$$ 24058075 24560650 25210985 25481089 25734720 25910898 26514406 27100426 27386110 27825335 28205919
1765.8B8205919K66636J56506L51848K43691K75314K57759L020O33709L36959L11341
$$ 28205919 28472555 28629061 28980909 29224600 29499914 29757673 29760693 30394402 30731361 31042702
1775.4C1042702N29775L18644J85169M40205L98884J01627K70134Q8085N5752K87578
$$ 31042702 31572477 31891121 32076290 32516495 32915379 33017006 33287140 33375225 33430977 33718555
1785.1C3718555M46259L25451K72541K61555P3867K07764J18305Q6140M46548K77028
$$ 33718555 34164814 34490265 34762806 35024361 35098228 35305992 35424297 35510437 35956985 36234013
1794.7C6234013K31941K01427K99416K63782J79177J79245Q9718J24595L70026L05324
$$ 36234013 36465954 36667381 36966797 37230579 37409756 37589001 37678719 37803314 38173340 38478664
1804.4C8478664J31668J73775J19278J71009K50832J38210l1032P1407L05965J71505
$$ 38478664 38610332 38784107 38903385 39074394 39325226 39463436 39432404 39503811 39809776 39981281
1814C9981281Q8555K06054K75025K07088J04573R7362J33164J22787m1828O8287K19989
$$ 39981281 40069836 40275890 40550915 40758003 40862576 40959938 41093102 41215889 41174061 41242348 41462337
1824.6D1462337J78601k7317M7626J67465j43142J53549L87852N0911L8414J42158
$$ 41462337 41640938 41613621 41661247 41828712 41685570 41839119 42226971 42277882 42316296 42458454
1834.3D2458454J84227J44787K11067J29357Q1878J1925n1205j6357j00887l8300L13740
$$ 42458454 42642681 42787468 42998535 43127892 43209770 43221695 43170490 43154133 43053246 43014946 43328686
1844.9D3328686K80464o4182j3070K44343J66153J46183K4266L2070m025K026J76117
$$ 43328686 43609150 43544968 43531898 43776241 43942394 44088577 44112843 44144913 44140888 44142914 44319031
1855.5D4319031J54762K2377o8306L326m4273L4954P5627J22940J90986r3574j21861
$$ 44319031 44473793 44496170 44427864 44431190 44386917 44421871 44497498 44620438 44811424 44717850 44595989
1866.1D4595989p6420j4343M2503J79177K14271m5307q1264p4314Q5231J40740N722
$$ 44595989 44519569 44505226 44547729 44726906 44941177 44895870 44814606 44740292 44825523 44966263 44971985
1876.7D4971985P4051L5633r2011m6081J77582P3215j55464q1417Q8188l277k53952
$$ 44971985 45046036 45081669 44989658 44943577 45121159 45194374 45038910 44957493 45045681 45042404 44788452
1887.3D4788452j34941M2812J08788o771m8439O1477J03829J41697P6637l1189j67503
$$ 44788452 44653511 44696323 44805111 44798340 44749901 44811378 44915207 45056904 45133541 45102352 44934849
1897.9D4934849r6489N2841l803j03703o8611Q4465j02142j65203Q770R1465L8704
$$ 44934849 44838360 44891201 44887398 44783695 44715084 44799549 44697407 44532204 44540974 44632439 44671143
1908.5D4671143q4309l445j28795j41285L116N7297M9011r0267j65829j77051L3306
$$ 44671143 44586834 44583389 44454594 44313309 44316425 44373722 44422733 44332466 44166637 43989586 44022892
1919.1D4022892r548j61644j42403l4706M9568J2188n8536j06755M5533p8957k31853
$$ 44022892 44013344 43851700 43709297 43674591 43724159 43736347 43677811 43571056 43616589 43537632 43305779
1929.7D3305779j32775n7812n0376j78250L8906J30024r3136k11010j44622o0784j10168
$$ 43305779 43173004 43115192 43064816 42886566 42925472 43055496 42962360 42751350 42606728 42545944 42435776
1940.3D2435776n1590k08306L4821J27163k31838k76669k56969m5491J1399N0129p6466
$$ 42435776 42384186 42175880 42210701 42337864 42106026 41829357 41572388 41526897 41538296 41588425 41511959
1951D1511959k23122k7877j66146j01825j39759j85261K9457m322q3447k67532k14218
$$ 41511959 41288837 41260960 41094814 40992989 40853230 40667969 40697426 40693104 40609657 40342125 40127907
1961.6D0127907p0057L9070j2398j88522j64410k48764j61487q7269R491J5003l55747
$$ 40127907 40057850 40096920 40084522 39896000 39731590 39482826 39321339 39234070 39243561 39258564 38902817
1972.2C8902817l34301j7693p1190j42128N2410m1217j34266r6077j22750p2402j60492
$$ 38902817 38568516 38550823 38479633 38337505 38389915 38348698 38214432 38118355 37995605 37923203 37762711
1982.8C7762711j74984j72238j64669j39332j81781j59653k12444j75869j10692j04499
$$ 37762711 37587727 37415489 37250820 37111488 36929707 36770054 36557610 36381741 36271049 36166550
1992.4C6166550n7534l3859j02066j36692j50104k36546j04519O0783m5780l32382
$$ 36166550 36109016 36075157 35973091 35836399 35686295 35449749 35345230 35406013 35360233 35027851
2002.1C5027851k99759o6318J8932N1708k24148k72567j34606k16045j73565j26438
$$ 35027851 34728092 34661774 34680706 34732414 34508266 34235699 34101093 33885048 33711483 33585045
2011.7C3585045j48777j08437k491n8090p6805j61285k41196j33549j99154o4827k2644
$$ 33585045 33436268 33327831 33325340 33267250 33190445 33029160 32787964 32654415 32455261 32390434 32367790
2022.3C2367790j60385j45389N821k6936l93089j88847m5814j54423o7026j51739l8353
$$ 32367790 32207405 32062016 32067837 32040901 31647812 31458965 31413151 31258728 31191702 31039963 31001610
2032.9C1001610r7229j75566M850r5869k10537j08552m2828q4446p2752p9231j54591
$$ 31001610 30904381 30728815 30733665 30637796 30427259 30318707 30275879 30191433 30118681 30039450 29884859
2043.5B9884859k33263r6237n09j68190k13780j98084l0727J3338j84513q8984L6894
$$ 29884859 29651596 29555359 29554850 29386660 29172880 28974796 28944069 28957407 28772894 28683910 28720804
2054.1B8720804q6855k35435q7355J66542o1k46998j02379p5874j30760k2362j31649
$$ 28720804 28633949 28398514 28311159 28477701 28477640 28230642 28128263 28052389 27921629 27899267 27767618
2064.7B7767618q1243L976j26447j09867o1261q7787q9747k9073q5537p5142j13812
$$ 27767618 27686375 27690351 27563904 27454037 27392776 27304989 27215242 27186169 27100632 27025490 26911678
2075.4B6911678j43528j6576j47955p7248l5347j63919m8829l2924j2573j5881l7968
$$ 26911678 26768150 26751574 26603619 26526371 26491024 26327105 26278276 26245352 26232779 26216898 26178930
2086B6178930n1311j00956o7562M909P7696o5254j50726j18903j31485J6636J04769
$$ 26178930 26127619 26026663 25959101 25964010 26041706 25976452 25825726 25706823 25575338 25591974 25696743
2096.6B5696743l4769j42344K06J6066k07645j45224R275J04073J01055k54999j96209
$$ 25696743 25661974 25519630 25519836 25535902 25328257 25183033 25192308 25296381 25397436 25142437 24946228
2107.2B4946228J41827P7970K6169q2546q185N7103j46048k6596N3148n0997j53717
$$ 24946228 25088055 25166025 25192194 25109648 25101463 25158566 25012518 24985922 25039070 24988073 24834356
2117.8B4834356k1564J10866k7565O4051P004o1505K85p8587K4450Q3630j3969n1169
$$ 24834356 24812792 24923658 24896093 24960144 24967148 24905643 24905928 24827341 24851791 24935421 24921452 24870283
2129.4B4870283o348p5572N4674J85802q7747M583M578k12737P2798K63140P6763j41769
$$ 24870283 24863935 24788363 24843037 25028839 24941092 24945675 24950253 24737516 24810314 25073454 25150217 25008448
2140.9B5008448l1895N4661q9340O0791J65208J03197K8948r4492q16N3505Q0471J08917
$$ 25008448 24976553 25031214 24941874 25002665 25167873 25271070 25300018 25205526 25204710 25258215 25338686 25447603
2152.5B5447603J8049O814j10484k9869J45405O9691L0824l0971Q5115J97945O5441
$$ 25447603 25465652 25472466 25361982 25332113 25477518 25547209 25578033 25547062 25632177 25830122 25895563
2163.1B5895563l992j1967o0171p4692M7387O3593J33663K12198R8690L7193q3595
$$ 25895563 25891571 25879604 25819433 25744741 25792128 25855721 25989384 26201582 26300272 26337465 26253870
2173.7B6253870k2200J69936J74339M7447m9986K2337Q8743J20692P6894J20245O9926
$$ 26253870 26231670 26401606 26575945 26623392 26573406 26595743 26684486 26805178 26882072 27002317 27072243
2184.3B7072243o5962O9496K1589J25016K21433k0540J50106K23488l2062k5093J54043
$$ 27072243 27006281 27075777 27097366 27222382 27443815 27423275 27573381 27796869 27764807 27739714 27893757
2194.9B7893757J55798J1930J19328J18925j8236P7238N7030L1486J7630M8771J99401
$$ 27893757 28049555 28061485 28180813 28299738 28281502 28358740 28415770 28447256 28464886 28513657 28713058
2205.5B8713058J36549O2050m0729Q0244L07430J28554Q9628J37821J15425J01753
$$ 28713058 28849607 28911657 28870928 28951172 29258602 29387156 29476784 29614605 29730030 29831783
2215.2B9831783R6659J18656p0051J5169K93968K44530Q4410m3679k317K20989K64527
$$ 29831783 29928442 30047098 29977047 29992216 30286184 30530714 30615124 30571445 30569128 30790117 31054644
2225.8C1054644J19812J2655j4450J30575Q3670L7611K81133J70185l2215P9640J96277
$$ 31054644 31174456 31187111 31172661 31303236 31386906 31424517 31705650 31875835 31843620 31923260 32119537
2236.4C2119537J07720L1570J23528K03705Q9733q8044Q2886J33049R3075J48132K6898
$$ 32119537 32227257 32258827 32382355 32586060 32675793 32587749 32670635 32803684 32896759 33044891 33071789
2247C3071789J43280K60227K43431Q2497l7369K26768L27530J09387r2812l647J32222
$$ 33071789 33215069 33475296 33718727 33801224 33763855 33990623 34318153 34427540 34334728 34331081 34463303
2257.6C4463303J49303J23550Q8746N4317N4047K35607K02667J24855L2814M1592K47799
$$ 34463303 34612606 34736156 34824902 34879219 34933266 35168873 35371540 35496395 35529209 35570801 35818600
2268.2C5818600P7617J24310K00897P679J8665J45882K41421J52469J08593L2917K015
$$ 35818600 35896217 36020527 36221424 36229103 36247768 36393650 36635071 36787540 36896133 36929050 36931065
2278.8C6931065J95400L00632K21176J33355O7066M1591J75168J25221J35429J27487
$$ 36931065 37126465 37427097 37648273 37781628 37848694 37890285 38065453 38190674 38326103 38453590
2288.5C8453590N6004L36670K47074p6149q3672Q0380J41663J71840Q2848j06487J79454
$$ 38453590 38509594 38846264 39093338 39017189 38933517 39013897 39155560 39327400 39410248 39303761 39483215
2299.1C9483215K95754J70006k5288K9533M29406L03443R0989o5930N4875J66553J3252
$$ 39483215 39778969 39948975 39923687 39953220 40382626 40686069 40777058 40711128 40766003 40932556 40945808
2309.7D0945808J82785J38169O3389M5719J13373J19373J06914K53285Q0608J09741
$$ 40945808 41128593 41266762 41330151 41375870 41489243 41608616 41715530 41968815 42049423 42159164
2319.3D2159164K64401K79594N4570K7488l5827k87114K7859o8607M1458M68937M32815
$$ 42159164 42423565 42703159 42757729 42785217 42749390 42462276 42490135 42421528 42462986 42931923 43364738
2329.9D3364738P6107J2623M02523J54427q9558k22522J48544N21259K19147j1124
$$ 43364738 43440845 43453468 43855991 44010418 43920860 43698338 43846882 44368141 44587288 44576164
2339.6D4576164j51340J56887k97760p2884P82658N23975K76898J28883J44089O633
$$ 44576164 44424824 44581711 44283951 44211067 44993725 45517700 45794598 45923481 46067570 46074203
2349.2D6074203q8260j90708k69841K92069N11684K51450L3169J97681m6314l90385
$$ 46074203 45985943 45795235 45525394 45817463 46329147 46580597 46613766 46811447 46765133 46374748
2358.9D6374748M64680P73258J034k36363l0899j28318M77733N87403j1078k32628
$$ 46374748 46839428 47612686 47613720 47377357 47346458 47218140 47695873 48283276 48272198 48039570
2368.5D8039570p4024L66497J47182Q8703J36677M643K53631L48423P3826R4704L63014
$$ 48039570 47965546 48332043 48479225 48567928 48704605 48709248 48962879 49311302 49385128 49479832 49842846
2379.1D9842846J71009J50848J37913J5572J43123J67626J75693o9553p172K82795
$$ 49842846 50013855 50164703 50302616 50318188 50461311 50628937 50804630 50735077 50727905 51010700
2388.8E1010700K39395K48234J27152N8281K6134L5427N6618J18450J95976O638O0902
$$ 51010700 51250095 51498329 51625481 51683762 51709896 51745323 51801941 51920391 52116367 52123005 52183907
2399.4E2183907J42032J46717J15288O3065J31076J17215J65931J02414K30319K10587
$$ 52183907 52325939 52472656 52587944 52651009 52782085 52899300 53065231 53167645 53397964 53608551
2409E3608551j13975K0977J38050J20620J01048R9701K25498K06711J61873J69258
$$ 53608551 53494576 53515553 53653603 53774223 53875271 53974972 54200470 54407181 54569054 54738312
2418.7E4738312N9467L0880J08204J60858J40610j08246n0545K03263K81555K80681
$$ 54738312 54797779 54828659 54936863 55097721 55238331 55130085 55079540 55282803 55564358 55845039
2428.3E5845039J4977M5982J88187Q7589j9150J1120K26902K25144K03975R9228K205
$$ 55845039 55860016 55905998 56094185 56181774 56162624 56173744 56400646 56625790 56829765 56928993 56931198
2438.9E6931198M1454L4951J76284J74984J59661P3887j1750J59035J66241P2330M8333
$$ 56931198 56972652 57007603 57183887 57358871 57518532 57592419 57580669 57739704 57905945 57978275 58026608
2449.5E8026608J33853J67164J25820M0005j0631J08615M7989M6006J80881J89457
$$ 58026608 58160461 58327625 58453445 58493450 58482819 58591434 58639423 58685429 58866310 59055767
2459.2E9055767J70910O6093J8223K777J1177J26591N2261N3441K24998K40765K06443
$$ 59055767 59226677 59292770 59310993 59313770 59324947 59451538 59503799 59557240 59782238 60023003 60229446
2469.8F0229446M7295L6140K02107J48113P7938K941j10031k0008L19489L36384L5614
$$ 60229446 60276741 60312881 60514988 60663101 60741039 60743980 60633949 60613941 60933430 61269814 61305428
2480.4F1305428n9384P1827L01617J47354J8417J9737l0780K18422J75468K3754Q1536
$$ 61305428 61246044 61317871 61619488 61766842 61785259 61804996 61774216 61992638 62168106 62191860 62273396
2491F2273396J97967K31602M4624l4489l6956Q5708K08275J69060L0521J4931J32030
$$ 62273396 62471363 62702965 62747589 62713100 62676144 62761852 62970127 63139187 63169708 63184639 63316669
2501.6F3316669J03909J34289J19957Q2920K7275M6398Q2481k5676J56303J74271N7747
$$ 63316669 63420578 63554867 63674824 63757744 63785019 63831417 63913898 63888222 64044525 64218796 64276543
2512.2F4276543J41014J50306j815j70372J30233L91808J64719K700O3149R8381P5142
$$ 64276543 64417557 64567863 64566048 64395676 64525909 64917717 65082436 65085136 65148285 65246666 65321808
2522.8F5321808j13777j32195K65877K92107N4176l3722O9916K16690J72638J12518
$$ 65321808 65208031 65075836 65341713 65633820 65687996 65654274 65724190 65940880 66113518 66226036
2532.5F6226036j4755L9032O9473J11801J33873l7926J41716R8221M43R5764l746M3350
$$ 66226036 66211281 66250313 66319786 66431587 66565460 66527534 66669250 66767471 66767914 66863678 66859932 66903282
2544F6903282J23978J17523j2367l388J77155K88956K44339p7843j03989J12229P9750
$$ 66903282 67027260 67144783 67132416 67129028 67306183 67595139 67839478 67761635 67657646 67769875 67849625
2554.6F7849625O2271Q3999N4291J28891K01264J33033o2133l8887M9903n3085J36078
$$ 67849625 67911896 67995895 68050186 68179077 68380341 68513374 68451241 68412354 68462257 68409172 68545250
2565.2F8545250J42815l4890k0630r38R9403J07392J48704m417N3612K53723K9373
$$ 68545250 68688065 68653175 68632545 68631607 68731010 68838402 68987106 68982689 69036301 69290024 69319397
2575.9F9319397N7808o18p8850L220K6680P5271L6072J40953J35094m5281q8432Q7135
$$ 69319397 69377205 69376587 69297737 69300957 69327637 69402908 69438980 69579933 69715027 69669746 69581314 69668449
2587.4F9668449K7611q5289L9894O0959J88843N3741o2683P317Q9668J99715L5721
$$ 69668449 69696060 69610771 69650665 69711624 69900467 69954208 69891525 69898842 69988510 70188225 70223946
2598G0223946J9256o8825l9154n256j45424M028J19301P5806j69342r6932J9432p3333
$$ 70223946 70243202 70174377 70135223 70129967 69984543 69988571 70107872 70183678 70014336 69917404 69936836 69863503
2609.6F9863503j549Q9256J92482L9291q0940r0904O2157k8000j58448K04888J4839
$$ 69863503 69861954 69951210 70143692 70182983 70102043 70011139 70073296 70045296 69886848 70091736 70106575
2620.2G0106575j17973M3686O2072L090q8745O7696l3844j45531r9373k754p7782j56562
$$ 70106575 69988602 70032288 70094360 70097450 70008705 70076401 70042557 69897026 69797653 69794899 69717117 69560555
2631.8F9560555R147K4140J63856M9530j35269j13701j4297P4058o3339q4396j84563
$$ 69560555 69569702 69593842 69757698 69807228 69671959 69558258 69543961 69618019 69554680 69470284 69285721
2642.4F9285721m1016J03356J3054j49910k58790K9458L4370J25595J0498k31216K8907
$$ 69285721 69244705 69348061 69361115 69211205 68952415 68981873 69016243 69141838 69152336 68921120 68950027
2653F8950027p3333O86J73455r5185j75117k8916j13319j80504j05423p3746L1609
$$ 68950027 68876694 68877380 69050835 68955650 68780533 68751617 68638298 68457794 68352371 68278625 68310234
2663.6F8310234j20048j54000k8526k3453l6842j53092j65954p6889J22406K6794j43692
$$ 68310234 68190186 68036186 68007660 67984207 67947365 67794273 67628319 67551430 67673836 67700630 67556938
2674.2F7556938j24550o0920l5447j77253j3954q5137j33682k6337j63292j991J01631
$$ 67556938 67432388 67371468 67336021 67158768 67144814 67059677 66925995 66899658 66736366 66734375 66836006
2684.8F6836006m4205l03459j07330K9785k02118r2262r0569j35360k62955j72874
$$ 66836006 66791801 66488342 66381012 66410797 66208679 66116417 66025848 65890488 65627533 65454659
2694.5F5454659j2589j0574K1614k40746j15349k6069j49613j03553j44486p3616r2110
$$ 65454659 65442070 65431496 65453110 65212364 65097015 65070946 64921333 64817780 64673294 64599678 64507568
2705.1F4507568j56440j23864j2588o1936j80103j69113j75732j31275p2159m8256
$$ 64507568 64351128 64227264 64214676 64152740 63972637 63803524 63627792 63496517 63424358 63376102
2714.7F3376102k03689k26505k25411k46967j22368j11198p4097j33362p4146r9106
$$ 63376102 63172413 62945908 62720497 62473530 62351162 62239964 62165867 62032505 61958359 61859253
2724.4F1859253j90517j18241k14596k29984k47013j33015r1190q0624l013j78612
$$ 61859253 61668736 61550495 61335899 61105915 60858902 60725887 60634697 60554073 60551060 60372448
2734F0372448j64406k21470k49840j12754o4061o4540k71405l53477m8710R2529k87914
$$ 60372448 60208042 59986572 59736732 59623978 59559917 59495377 59223972 58870495 58821785 58914314 58626400
2744.6E8626400l65368j35166j44341k71766k50942p4708j63410j82029k44164k94662
$$ 58626400 58261032 58125866 57981525 57709759 57458817 57384109 57220699 57038670 56794506 56499844
2754.3E6499844j18206j38558j76838k06238j39846j67439j77990j22669k67250l25192
$$ 56499844 56381638 56243080 56066242 55860004 55720158 55552719 55374729 55252060 54984810 54659618
2763.9E4659618l00792j54545j26640r7855j66977l04302q9493j20789k89135k00492
$$ 54659618 54358826 54204281 54077641 53979786 53812809 53508507 53419014 53298225 53009090 52808598
2773.5E2808598j16162l97693l81363r6867k62295j57470k5628j56284l36899k81734
$$ 52808598 52692436 52294743 51913380 51816513 51554218 51396748 51371120 51214836 50877937 50596203
2783.2E0596203j25736l23670k10354p1327n1815j77528m31588k75688k48424l90187
$$ 50596203 50470467 50146797 49936443 49865116 49813301 49635773 49204185 48928497 48680073 48289886
2792.8D8289886l92639j73092r9544k71546j82918j27953k19673k79056k83135k47581
$$ 48289886 47897247 47724155 47624611 47353065 47170147 47042194 46822521 46543465 46260330 46012749
2802.5D6012749j69396k58243m09828k35592j37371j59073k16835m82601m88881k01412
$$ 46012749 45843353 45585110 45175282 44939690 44802319 44643246 44426411 43943810 43454929 43253517
2812.1D3253517r6157r8209k00058l30365k78381k74620l10738l06812j57055j32858
$$ 43253517 43157360 43059151 42859093 42528728 42250347 41975727 41664989 41358177 41201122 41068264
2821.8D1068264m01733m31778k38041j43399l18313m45000l28285k8584N3372l66142
$$ 41068264 40666531 40234753 39996712 39853313 39535000 39090000 38761715 38733131 38786503 38420361
2831.4C8420361n02888m13994l21327l07713l85353k24838j05747j30612l43288m34464
$$ 38420361 37917473 37503479 37182152 36874439 36489086 36264248 36158501 36027889 35684601 35250137
2841.1C5250137l98945k56252j66054l35048k12750k90382k92919j69941k77691j84399
$$ 35250137 34851192 34594940 34428886 34093838 33881088 33590706 33297787 33127846 32850155 32665756
2850.7C2665756k01320k56756m70696l91084j10386j85292j78339j82676j22602k32294
$$ 32665756 32464436 32207680 31736984 31345900 31235514 31050222 30871883 30689207 30566605 30334311
2860.3C0334311l14295k16408k25386k17954k99305k83753j71964k16742m26250k49794
$$ 30334311 30020016 29803608 29578222 29360268 29060963 28777210 28605246 28388504 27962254 27712460
2870B7712460j15399l67136l15983k18219q7456j40789k77991l15156l05155j99000
$$ 27712460 27597061 27229925 26913942 26695723 26608267 26467478 26189487 25874331 25569176 25370176
2879.6B5370176l19200j65625j99892l26656k69377l86089j38567k57078m16544j29822
$$ 25370176 25050976 24885351 24685459 24358803 24089426 23703337 23564770 23307692 22891148 22761326
2889.3B2761326j19204j76672j89432k18468k62928j90294j86161l45461m05006k92797
$$ 22761326 22642122 22465450 22276018 22057550 21794622 21604328 21418167 21072706 20667700 20374903
2898.9B0374903k00018l16765l42333k84077j30378L675k04910m43743k80290r4119
$$ 20374903 20174885 19858120 19515787 19231710 19101332 19105007 18900097 18456354 18176064 18081945
2908.6A8081945k28160k51185k64780k55667l06148m05924k71341k78286k59081k10694
$$ 18081945 17853785 17602600 17337820 17082153 16776005 16370081 16098740 15820454 15561373 15350679
2918.2A5350679j67691j28279k13207k31275q6138K8915k33188j41391l3112k26320
$$ 15350679 15182988 15054709 14841502 14610227 14524089 14553004 14319816 14178425 14145313 13918993
2927.8A3918993n3697j33453k92012j86426j60372k61069j91557j9387r4616k80558
$$ 13918993 13865296 13731843 13439831 13253405 13093033 12831964 12640407 12621020 12526404 12245846
2937.5A2245846l62805j06894j4990k17050k05011n3293q4489k50997l33419l23741
$$ 12245846 11883041 11776147 11761157 11544107 11339096 11285803 11201314 10950317 10616898 10293157
2947.1A0293157J1452o3233k55030m104j21522j15156k4597O8672r7068l16416J76802
$$ 10293157 10304609 10241376 9986346 9982242 9860720 9745564 9720967 9789639 9692571 9376155 9552957
2957.7I552957o7012m27813M2817J25605o8978l5983p671q9611j79577k21359p8971
$$ 9552957 9485945 9058132 9100949 9226554 9157576 9121593 9113922 9024311 8844734 8623375 8544404
2968.3H544404J331L505K2291K9064J7536k93022l26276M2343J00000k06172l36259
$$ 8544404 8545735 8549240 8571531 8600595 8618131 8325109 7998833 8041176 8141176 7935004 7598745
2979G598745j06280J54553J12747k13575k07180j32582j6674K3893m02764k29461J78609
$$ 7598745 7492465 7647018 7759765 7546190 7339010 7206428 7189754 7213647 6810883 6581422 6760031
2989.6F760031O0913j57711j49670j28075l08105j07427J25400P989q6029j103n3844
$$ 6760031 6820944 6663233 6513563 6385488 6077383 5969956 6095356 6103345 6017316 6016213 5962369
3000.2E962369k91275k47632j25675J3330J53230R0228j50511j31458p9399k07896
$$ 5962369 5671094 5423462 5297787 5311117 5464347 5554575 5404064 5272606 5193207 4985311
3009.8D985311R1660m5686k87528p0063M349J37590l4750j26070r8301q1309O8768
$$ 4985311 5076971 5031285 4743757 4673694 4678043 4815633 4780883 4654813 4556512 4475203 4543971
3020.4D543971j48658j87563m9520K2031M1218j67603j35495Q3127P4093m068j29447
$$ 4543971 4395313 4207750 4158230 4180261 4221479 4053876 3918381 4001508 4075601 4071533 3942086
3031C942086k40437m8229m9129j20432L2482p7609j52733m7608o6546N991J29567o4090
$$ 3942086 3701649 3653420 3604291 3483859 3516341 3438732 3285999 3238391 3171845 3177836 3307403 3243313
3042.6C243313r7457M6197m6636r1135j29841m6664m6641K429J69353j51295j88991
$$ 3243313 3145856 3192053 3145417 3054282 2924441 2877777 2831136 2833565 3002918 2851623 2662632
3053.2B662632J42009L2142k83328k43911q527J04940K44822J86444j41786m11737
$$ 2662632 2804641 2836783 2553455 2309544 2301017 2405957 2650779 2837223 2695437 2283700
3062.9B283700k17600J09750J07351o6466j92488k4979m4504p9516J51385O9894j25318
$$ 2283700 2066100 2175850 2283201 2216735 2024247 1999268 1954764 1875248 2026633 2096527 1971209
3073.5A971209k0373O2726j21483q3855O4190M6870P8360M8343k04209l16386N8997
$$ 1971209 1950836 2013562 1892079 1808224 1872414 1919284 1997644 2045987 1841778 1525392 1584389
3084.1A584389K66299J54640k8692j25277n1445n7927j48186j97268J12404P2142j17554
$$ 1584389 1850688 2005328 1976636 1851359 1799914 1741987 1593801 1396533 1508937 1581079 1463525
3094.7A463525N6284j26561j11937L9694J08255J26596N9259O2950r5490l5137r4119
$$ 1463525 1519809 1393248 1281311 1321005 1429260 1555856 1615115 1678065 1582575 1547438 1453319
3105.3A453319k46305p7212J45452J49419j3524m0541k33855j72103j6291l1812K03177
$$ 1453319 1207014 1129802 1275254 1424673 1411149 1370608 1136753 964650 948359 916547 1119724
3115.9A119724N9741j23285K8363N0948l5866l9890J8691k7995j64899J2692K72836
$$ 1119724 1179465 1056180 1084543 1135491 1099625 1059735 1078426 1050431 885532 898224 1171060
3126.5A171060L2606p6733M725N8721k9408k23460m4888M4512P1091L1598L9257J14429
$$ 1171060 1203666 1126933 1131658 1190379 1160971 937511 892623 937135 1008226 1039824 1079081 1193510
3138.1A193510o7148r5266j01661K4822j4299j54414j2396K7808N057o2696R1847J2699
$$ 1193510 1126362 1031096 929435 954257 939958 785544 773148 800956 806013 743317 835164 847863
3149.6H47863j55365l4816q3422m8583K9225J90301J66485m1072j23245m0049K09571
$$ 847863 692498 657682 574260 525677 554902 745203 911688 870616 747371 707322 916893
3160.3I16893J30864m5184p0999J4903k51040m07081J30832J99452P0291N3492p7107
$$ 916893 1047757 1002573 931574 946477 695437 288356 419188 618640 688931 742423 665316
3170.9F65316q4891l4095J46638J58242j9689j60990j61650q0215L843J9872N1732
$$ 665316 580425 546330 692968 851210 831521 670531 508881 428666 432509 452381 504113
3181.5E04113J43227P138m9126O907R0563J52989Q1724r0477k27762J0543m7975j77808
$$ 504113 647340 654478 605352 612259 702822 855811 937535 847058 619296 629839 581864 404056
3193D04056J3670M1177K17653J34709j62678j11658k2541R0735R7391q139O7840N6963
$$ 404056 417726 458903 676556 811265 648587 536929 514388 605123 702514 694375 762215 819178
3204.6H19178j08130k41290l1810L03931j1991j37675J11273j4142q0856J8296Q5059
$$ 819178 711048 469758 437948 741879 729888 592213 703486 689344 608488 626784 711843
3215.2G11843j56428j02878J11465j25698j5182J28468j05901j61821J21770J02978
$$ 711843 555415 452537 564002 438304 423122 551590 445689 283868 405638 508616
3224.9E08616m4799J03106K7025J5167l4732R518J33596j23187k07728n1496k0436
$$ 508616 463817 566923 593948 609115 574383 583901 717497 594310 386582 335086 314650
3235.5C14650o6063K11918J60325p6651P3279p1942j98881n1577J85757R8615L1383
$$ 314650 248587 460505 620830 544179 617458 545516 346635 295058 480815 579430 610813
3246.1F10813P7039j52998J4354j1792r3722Q2556J3270K4274l278j45200q7516Q1926
$$ 610813 687852 534854 549208 537416 443694 526250 539520 563794 560516 415316 327800 409726
3257.7D09726n2907j25591n6736J16136J44763j12619K01949K70754J41480r4784n29195
$$ 409726 356819 231228 174492 290628 435391 322772 524721 795475 936955 842171 312976
3268.3C12976p1224K20512J94481Q3062j73973O225P7963J0122l4099p5655p9411O2190
$$ 312976 241752 462264 656745 739807 565834 572059 650022 660144 626045 550390 470979 533169
3279.8E33169N9801k01786k1420J93870L9809j43939j32410R2763K32866J9465k21289
$$ 533169 592970 391184 369764 563634 603443 459504 327094 419857 652723 672188 450899
3290.4D50899j50628L3735K89685J73067k26896k16913j936J65047J78649Q8768M4376
$$ 450899 300271 334006 623691 796758 569862 352949 351013 516060 694709 783477 827853
3301H27853k14570k96686J36573K03523k3163o7000r4128k8277Q3674J64083j57019
$$ 827853 613283 316597 453170 656693 633530 566530 472402 444125 527799 691882 534863
3311.7E34863k19503J20571l6224K6406K18215M8977k14692j92891P4355q5474j54514
$$ 534863 315360 435931 399707 426113 644328 693305 478613 285722 360077 274603 120089
3322.3A20089J47204K76151J30886n207N4050O944j69338n1440J36021l6114j50088
$$ 120089 267293 543444 674330 669123 723173 730117 560779 509339 645360 609246 459158
3332.9D59158j14385L3339J01373j111o6758j64978K18600K95877r4713j2979k6156
$$ 459158 344773 378112 479485 478374 411616 246638 465238 761115 666402 653423 627267
3343.5F27267n0915J24217J56238l7048j29206j39456q9826L4741l7029J97349K48673
$$ 627267 576352 700569 856807 819759 690553 551097 461271 496012 458983 656332 905005
3354.1I05005j63232l92285r0121K53894M002Q738K1565l3768O6744j5378J497j57731
$$ 905005 741773 349488 259367 513261 517263 526001 547566 513798 580542 565164 566661 408930
3365.7D08930j81581J1316K51933K26995r7470j2268N8057o2595j28831M9730J51399
$$ 408930 227349 238665 490598 717593 620123 607855 665912 603317 474486 524216 675615
3376.3F75615q8099j50682m8075N4571L1683O922Q9134J83402P450j73895J1080l4818
$$ 675615 587516 436834 388759 443330 475013 481935 571069 754471 761921 588026 599106 564288
3387.8E64288j50826j3911J56286j7331j55677Q8002K4487J6443r453M359K19035P148
$$ 564288 413462 399551 555837 538506 382829 470831 495318 511761 502308 506667 725702 732850
3399.4G32850m3760j47871j79103K84490J34977r1267p710j70906O2984J76894j63098
$$ 732850 689090 541219 362116 646606 781583 690316 682606 511700 574684 751578 588480
3410E88480k13702r9019l0435R5220K61043M2905j71054j33244k1890J08571j94128
$$ 588480 374778 275759 245324 340544 601587 644492 473438 340194 318304 426875 232747
3420.6B32747P5924L53948q0260j16645n4364L8214J28667K2989j43713m8500M1789
$$ 232747 308671 662619 582359 465714 411350 449564 578231 601220 457507 409007 450796
3431.2D50796j735J77994l4353m5663n5454r8978K41008J00612J09080p2821k51254
$$ 450796 449061 627055 592702 547039 491585 392607 633615 734227 843307 770486 519232
3441.8E19232Q7574n283l6797J38810K13367L09502N8102m04163m83406j53170Q2240
$$ 519232 606806 601523 564726 703536 916903 1226405 1284507 880344 396938 243768 326008
3452.5C26008R7934J26423K45026Q5762q2913n1763L1208O7719K4925l1755j36691
$$ 326008 423942 550365 795391 881153 798240 746477 777685 845404 870329 838574 701883
3463.1G01883j21095n9136j2774j34270Q1316K56557L9748J16774k03117k52892m0738
$$ 701883 580788 521652 508878 374608 455924 712481 752229 869003 665886 412994 372256
3473.7C72256l1255K14924P3085j22751j59050J45349J38503k76439j85607K46452
$$ 372256 341001 555925 629010 506259 347209 492558 631061 354622 169015 415467
3483.3D15467K99508r7452P1234n0406j46456Q8706j09260K07713K29880k3739j47861
$$ 415467 714975 617523 688757 638351 491895 580601 471341 679054 908934 885195 737334
3493.9G37334j92268j03904J6963R1020k20003K27691L75222k01971k33098m9831P3249
$$ 737334 545066 441162 458125 549145 329142 556833 932055 730084 496986 447155 520404
3504.5E20404j09400J84536L17374q1944j5282J47694j22574q2790K34401j62822k05909
$$ 520404 411004 595540 912914 830970 815688 963382 840808 758018 992419 829597 623688
3515.1F23688n7966j98946J14298J22693k1136j95853k5898K79766n7797n7831j70
$$ 623688 565722 366776 481074 603767 582631 386778 360880 640646 582849 525018 524848
3525.7E24848m0704J52336Q6733O9298K45913J02533m9367o4380k62471k99401J99656
$$ 524848 484144 636480 723213 792511 1038424 1140957 1091590 1027210 764739 465338 664994
3536.4F64994M36720j67143j68623K3589k1914J08493m6292k19545j96301J59415K73386
$$ 664994 1101714 934571 765948 789537 767623 876116 829824 610279 413978 573393 846779
3547H46779J01559j49307k58780m6696j46882J36225L12128M4467k13383k79542J41698
$$ 846779 948338 799031 540251 493555 346673 482898 795026 839493 626110 346568 488266
3557.6D88266K02099J84400j98180p049M53517M9407j12020l07161P8051J21125j98199
$$ 488266 690365 874765 676585 669536 1123053 1172460 1060440 753279 831330 952455 754256
3568.2G54256L59324j77289l60428J4046K42065J52637N5094m00752k14280M90058
$$ 754256 1113580 936291 575863 589909 831974 984611 1039705 638953 424673 914731
3577.8I14731J41042j39022k35031Q7494L1964r0491P0384l32433J49132K38027j62833
$$ 914731 1055773 916751 681720 769214 801178 710687 781071 448638 597770 835797 672964
3588.4F72964N29301K64936j22654m45359k63509K2525j57231k66967L40190N16008
$$ 672964 1202265 1467201 1344547 899188 635679 658204 500973 234006 574196 1090204
3598.1A090204K26565L1452j73565j82031j22937o1792j88006q414K42554k6150N2966
$$ 1090204 1316769 1348221 1174656 992625 869688 807896 619890 611476 854030 827880 880846
3608.7H80846J93027R1826k51440K88323K58141o35636L49931K69494n210j40755j37928
$$ 880846 1073873 1165699 914259 1202582 1460723 825087 1175018 1444512 1439302 1298547 1160619
3619.3A160619M21186j49049j20511L3318j7237l27130k35498J69970l14886o20781
$$ 1160619 1581805 1432756 1312245 1345563 1328326 1001196 765698 935668 620782 1
3628.9AJ613489P38744m54702m11132k19576J70417K70997o8342o2805r4132O1849
$$ 1 1613490 2352234 1897532 1486400 1266824 1437241 1708238 1639896 1577091 1482959 1544808
3639.5A544808m0655j14398J59139K55518J15425l94200o55788k29955R63200J75795
$$ 1544808 1504153 1389755 1548894 1804412 1919837 1525637 869849 639894 1603094 1778889
3649.2A778889N28995J038409m52033k44701k57368j43133M92431J073840k29649m62686
$$ 1778889 2307884 3346293 2894260 2649559 2392191 2249058 2741489 3815329 3585680 3122994
3658.8C122994n2816k603R6348j13573R3159J88866r783P0628l78220m5393J54129
$$ 3122994 3070178 3067575 3163923 3050350 3143509 3332375 3322592 3393220 3015000 2969607 3123736
3669.4C123736L1192J315889O24629j81802n34027J217056K969478j222269q90551
$$ 3123736 3154928 4470817 5095446 4913644 4379617 5596673 8566151 7343882 6453331
3678.1F453331j65817O14944L15367M14307J61161p9373L45800N25531J05494p28341
$$ 6453331 6287514 6902458 7217825 7632132 7793293 7713920 8059720 8585251 8690745 7962404
3687.8G962404J07135J746858N09824J199081Q45464L18043P20474K40581l0600N94292
$$ 7962404 8069539 9816397 10326221 11525302 12370766 12688809 13409283 13649864 13619264 14213556
3697.4A4213556P09109P12600L41253K51370J274035J283554M08363L38499P38907
$$ 14213556 14922665 15635265 15976518 16227888 17501923 18785477 19193840 19532339 20271246
3706.1B0271246P45726K94006n21576J19953J685309O49595J558887Q23708L25548
$$ 20271246 21016972 21310978 20789402 20909355 22594664 23244259 24803146 25626854 25952402
3714.8B5952402Q35615N86546M06441M22415P26711R39157K41503L32747J333513M57088
$$ 25952402 26788017 27374563 27781004 28203419 28930130 29869287 30110790 30443537 31777050 32234138
3724.4C2234138J29223P60586Q89813N44948O42369O27738P7229J58157J108712L39172
$$ 32234138 32363361 33123947 34013760 34558708 35201077 35828815 35906044 36064201 37172913 37512085
3734C7512085p19128J015789K390957K71137J49830N24655J71947K77405L95279j42887
$$ 37512085 36792957 37808746 40199703 40470840 40620670 41145325 41317272 41594677 41989956 41847069
3743.7D1847069j420994J957397J330399O70204J32744k09633J012444N6217L76392
$$ 41847069 40426075 42383472 43713871 44384075 44516819 44307186 45319630 45375847 45752239
3752.4D5752239J162026N6766J3596K7065O73794O63967K66201L57498K01595L30243
$$ 45752239 46914265 46971031 46984627 47011692 47685486 48349453 48615654 48973152 49174747 49504990
3762D9504990J40663K29866L01990K12654P10690K80479L39924K37370j56567O75701
$$ 49504990 49645653 49875519 50177509 50390163 51100853 51381332 51721256 51958626 51802059 52477760
3771.7E2477760K00966M574K86446M55818M53445O0322K85984N22377M41555J91177
$$ 52477760 52678726 52683300 52969746 53425564 53879009 53939331 54225315 54747692 55189247 55380424
3781.3E5380424R5047L66601J84047J28708L34091J09047L31627L73905N1316K33223
$$ 55380424 55475471 55842072 56026119 56154827 56488918 56597965 56929592 57303497 57354813 57588036
3790.9E7588036K09301k7619L22693N60677N9234o11866M97509Q72433K77763K29103
$$ 57588036 57797337 57769718 58092411 58653088 58712322 58100456 58597965 59470398 59748161 59977264
3800.6E9977264m43718j7478Q13652M43489J7761p17320L5725J535526M28196J92890
$$ 59977264 59533546 59516068 60329720 60773209 60790970 60073650 60109375 61644901 62073097 62265987
3810.2F2265987J57124m4529L8891K08134j43216n70198L09380R50794L63575k73136
$$ 62265987 62423111 62378582 62417473 62625607 62482391 61912193 62221573 63172367 63535942 63262806
3819.9F3262806l55465J59840Q93013O06754L03574J12632J24840P7812Q3618M24820
$$ 63262806 62907341 63067181 63960194 64566948 64870522 64983154 65107994 65185806 65269424 65694244
3829.5F5694244L43743K34413K74048j21407o02646n83358N82397n42168n64926J700516
$$ 65694244 66037987 66272400 66546448 66425041 65822395 65239037 65821434 65279266 64714340 66414856
3839.2F6414856K3918n7426N47645K14890K47673L51928N5863l3119N1368j8013r3032
$$ 66414856 66438774 66381348 66928993 67143883 67391556 67743484 67799347 67766228 67817596 67799583 67706551
3849.8F7706551J701O2439l08510n0987J49315K17209K40913L49022N79681M36768
$$ 67706551 67708252 67770691 67462181 67411194 67560509 67777718 68018631 68367653 68947334 69384102
3859.4F9384102J68777l37593j13754L26179m31465m40139O23443O78467K10281o13609
$$ 69384102 69552879 69215286 69101532 69427711 68996246 68556107 69179550 69858017 70068298 69454689
3869.1F9454689p14355P77732O26358K04773j02623J77918M31808j4312k37252m14055
$$ 69454689 68740334 69518066 70144424 70349197 70246574 70424492 70856300 70841988 70604736 70190681
3878.7G0190681m91294l59795L60702R53248K95661j31179K36862l29117J52672K00142
$$ 70190681 69699387 69339592 69700294 70653542 70949203 70818024 71054886 70725769 70878441 71078583
3888.3G1078583J40045O7696m51668k2301L47740K9877k30980L3333J41434l06511
$$ 71078583 71218628 71286324 70834656 70812355 71160095 71189972 70958992 70992325 71133759 70827248
3898G0827248p22069J24626Q46344L838N1818O989j39465L60946L4561j04454M8203
$$ 70827248 70105179 70229805 71076149 71079987 71131805 71138794 70999329 71360275 71394836 71290382 71338585
3908.6G1338585J00510L067j5954k20039o4491o4736k11944L93753J52214J8364n4581
$$ 71338585 71439095 71442162 71426208 71206169 71141678 71076942 70864998 71258751 71410965 71429329 71374748
3919.2G1374748j94114M66575N4909M8279L1524m73320j95068L76946K21107j79565
$$ 71374748 71180634 71647209 71702118 71750397 71781921 71308601 71113533 71490479 71711586 71532021
3928.8G1532021K20718j95343p17957l05839M24087Q42278K62588k32505j57685j13487
$$ 71532021 71752739 71557396 70839439 70533600 70957687 71799965 72062553 71830048 71672363 71558876
3938.5G1558876J0559j6189j22437j64009n0377L46161L60405J01890m9537k91702
$$ 71558876 71569435 71553246 71430809 71266800 71216423 71562584 71922989 72024879 71975342 71683640
3948.1G1683640j63796O8932L87634L08281k77962N6717L51425J0308k43882j32278
$$ 71683640 71519844 71588776 71976410 72284691 72006729 72063446 72414871 72425179 72181297 72049019
3957.8G2049019J69815N6335J52825M2557k80297k02804K59529K52586l06541j12854
$$ 72049019 72218834 72275169 72427994 72470551 72190254 71987450 72246979 72499565 72193024 72080170
3967.4G2080170O0768K21893J08482k7168r4467m09355K58209K08969j10298J75331
$$ 72080170 72140938 72362831 72471313 72444145 72349678 71940323 72198532 72407501 72297203 72472534
3977.1G2472534K36870J84029m6357L8353k22587J04370O82663L42926n9189m12720
$$ 72472534 72709404 72893433 72847076 72885429 72662842 72767212 73449875 73792801 73733612 73320892
3986.7G3320892j28898O7550K70783L20068k67578r0568K10372o0318j73820K09320
$$ 73320892 73191994 73259544 73530327 73850395 73582817 73492249 73702621 73642303 73468483 73677803
3996.3G3677803J92299N2147J92413K04964
$$ 73677803 73870102 73922249 74114662 74319626
4000.2G4319626
$$ 74319626
##END=$$ End of the data block
