##TITLE=PVA $$ Begin of the data block
##JCAMP-DX=5.00 $$ ACD/SpecManager v 10.08
##SPECTROMETER/DATA SYSTEM=Alpha
##DATE=17 Apr 2014 09:51:36
##DATA TYPE=INFRARED SPECTRUM
##DATA CLASS=XYDATA
##ORIGIN=
##OWNER=
##NPOINTS=1667
##FIRSTX=599.57470703
##LASTX=3997.16503906
##MAXX=3997.16503906
##MINX=599.57470703
##MAXY=0.98944283
##MINY=0.31437606
##XFACTOR=1.0000000000
##YFACTOR=1.000000000000000e-9
##FIRSTY=0.31437606
##DELTAX=2.03937006
##XUNITS=1/CM
##YUNITS=ARBITRARY UNITS
##XYDATA=(X++(Y..Y))
599.6C14376056K103806K058059K571642L291726K988845K399445K572209K798706
615.9C35160494K937198L243088L427595L523380L206372K413928J873315K124011
632.2C57909381K440960J963168J403123J537681J866847K046645K221703K372355
648.5C73761863K450466K540290K760440K910674L073483L255994L116220K631992
664.8C96501422K731234L571361L166854K846778L178775L440440L475338L378868
681.1D22291070L402770L582746L649383L515125L442228L566801L741920L692478
697.5D50884521L546864L592998L862559L825874L428190L399939L590107L549963
713.8D79681015L385961L345251L557146L853857L889442L718018L524065L509939
$$ y = [314376056, 316479862, 318537921, 321109563, 324401289, 327390134, 329789579, 332361788, 335160494, 338097692, 341340780, 344768375, 348291755, 351498127, 353912055, 355785370, 357909381, 360350341, 362313509, 363716632, 365254313, 367121160, 369167805, 371389508, 373761863, 376212329, 378752619, 381513059, 384423733, 387497216, 390753210, 393869430, 396501422, 399232656, 402804017, 405970871, 408817649, 411996424, 415436864, 418912202, 422291070, 425693840, 429276586, 432925969, 436441094, 439883322, 443450123, 447192043, 450884521, 454431385, 458024383, 461886942, 465712816, 469141006, 472540945, 476131052, 479681015, 483066976, 486412227, 489969373, 493823230, 497712672, 501430690, 504954755, 508464694]
730.1E08464694L696442L816187L851771L864050L724516L461718L492534L727556
746.4E38099468L824651L765345L595531L341853L180266L380358L597021L492713
762.7E66277206L370285L304839L225684L349960L348887L162921L192126L157795
779E92389703K857625K342284J774013J444757J093864N08607p5221q98242k125979
797.4E99311411l486931n012572o945908q971512j0589898j1958122j2983918j2967944
813.7E26394606j1626304r228348o457657m288167k855748j813769j184404p80403
830D88159806k38359L80277Q59231J245648J641482K033561K395302K917856L806979
848.4E03201783N224228P488548J0864914J5458226K0921290K6140332K9777289L0992210
$$ y = [508464694, 512161136, 515977323, 519829094, 523693144, 527417660, 530879378, 534371912, 538099468, 541924119, 545689464, 549284995, 552626848, 555807114, 559187472, 562784493, 566277206, 569647491, 572952330, 576178014, 579527974, 582876861, 586039782, 589231908, 592389703, 595247328, 597589612, 599363625, 600808382, 601902246, 602410853, 602335632, 601437390, 599311411, 595824480, 590811908, 583866000, 574894488, 564304590, 552346468, 539362550, 526394606, 514768302, 505539954, 499082297, 494794130, 491938382, 490124613, 488940209, 488159806, 487921447, 488301724, 489160955, 490406603, 492048085, 494081646, 496476948, 499394804, 503201783, 508426011, 515914559, 526779473, 542237699, 563158989, 589299321, 619076610, 650068820]
864.7F50068820K9507696K5590062K0049334J4008582Q438408L717542j8478k680421
881G48681545m488349n735159o287217o043970n332709m462897l688932l343701l424943
899.4G05873668l746629m489421n878985p893443j0177494j1624753j0260344n058646
915.7F46743953J734376O416261P979334P936060P479429P029176O665230O372750
932F98356569O052017N467773M784286M112899L298819K533436J946091J434982Q51393
950.3G28838265J48714m14193p97510j144111j461804j768291j955390k065361k353668
968.7G17026651k752781l029943l208696l426969l675700l857314l917217l948570
985F89209461m077792m312813m700482n214512n784750o474674p195890p847130q571983
$$ y = [650068820, 679576516, 705166578, 725215912, 739224494, 747662902, 751380444, 751361966, 748681545, 744193196, 738458037, 732170820, 726126850, 720794141, 716331244, 712642312, 709298611, 705873668, 702127039, 697637618, 691758633, 683865190, 673687696, 662062943, 651802599, 646743953, 648478329, 654894590, 662873924, 670809984, 678289413, 685318589, 691983819, 698356569, 704408586, 709876359, 714660645, 718773544, 722072363, 724605799, 726551890, 727986872, 728838265, 728986979, 728572786, 727775276, 726631165, 725169361, 723401070, 721445680, 719380319, 717026651, 714273870, 711243927, 708035231, 704608262, 700932562, 697075248, 693158031, 689209461, 685131669, 680818856, 676118374, 670903862, 665119112, 658644438, 651448548, 643601418, 635029435]
1003.4F35029435r417951j0320902j1280596j2214661j2867093j3046384j2750148
1017.6E53131700j1939586j0681450r344995q403540q055389q069396q198648q450777
1034D79987919q754611q765578q189797p175893o191879n435497m670888l945112l594995
1052.3D23263669l630102m008680m609674n182356n597562n540520m766971l784507
1068.6C86143297l386349l896057n199105o817430p897675p464349n256087k084642
1084.9C44141603J152068M311412P475585J0460913J3274521J6162336J9210189K2264869
1101.3D38453496K4747401K5631845K4215192K0690620J6183614J2058079Q917273
1115.5E70897520O748735N475045M817605M535913M645348M905939M780650L602982
$$ y = [635029435, 625611484, 615290582, 604009986, 591795325, 578928232, 565881848, 553131700, 541192114, 530510664, 521165669, 512762129, 504706740, 496637344, 488438696, 479987919, 471233308, 462467730, 454277933, 447102040, 440910161, 435474664, 430803776, 426858664, 423263669, 419633567, 415624887, 411015213, 405832857, 400235295, 394694775, 389927804, 386143297, 382756948, 378860891, 373661786, 366844356, 358946681, 351482332, 346226245, 344141603, 345293671, 349605083, 357080668, 367541581, 380816102, 396978438, 416188627, 438453496, 463200897, 488832742, 513047934, 533738554, 549922168, 561980247, 570897520, 577646255, 583121300, 587938905, 592474818, 597120166, 602026105, 606806755, 610409737]
1131.9F10409737M56094n425036j2747585j5763700o893576J4167190L7178755N0900161
1148.2F72282040N1967025M3630242L0842245J7911315P816493J513958j764357l157973
1164.5H21040988l531516l406524k998948k535344k201855k022624j902282j770496
1180.8H00671399j682043j620114j606047j630247j642644j765192j901627j853406
1197.1G86970079j775026j818717j912534j959503j952767j975060k004981k022743
1213.4G71548748k054036k075970k202987k509058k930462l525913m204273m546523
1229.7G47499526m270018l205120j284063J051605L104388M410863M821539M433394
1246.1G56562114L538966K425373J251578J42515q40068j652599k260863k714754l011047
$$ y = [610409737, 610865831, 605440795, 592693210, 576929510, 570035934, 584203124, 621381879, 672282040, 724249065, 767879307, 798721552, 816632867, 824449360, 825963318, 824198961, 821040988, 817509472, 814102948, 811104000, 808568656, 806366801, 804344177, 802441895, 800671399, 798989356, 797369242, 795763195, 794132948, 792490304, 790725112, 788823485, 786970079, 785195053, 783376336, 781463802, 779504299, 777551532, 775576472, 773571491, 771548748, 769494712, 767418742, 765215755, 762706697, 759776235, 756250322, 752046049, 747499526, 743229508, 740024388, 738740325, 739791930, 742896318, 747307181, 752128720, 756562114, 760101080, 762526453, 763778031, 763920546, 763080478, 761427879, 759167016, 756452262, 753441215]
1264.4G53441215l218651l508747l906846m244208m412592m503369m542828m544496
1280.7G20559478m569471m626811m710793m803062m900395m987598n048335n133271
1297F81779742n259812n292594n271256n303443n334198n353928n404710n439103n247533
1315.4F33873165m907489m395366l592074k677798j615167l96430Q19683K023160L237188
1333.8F22368872M340232N542337O936551P776975P854343P775902P641912P372081
1350.1F77609205O911397O305635N732477N049705M173935L278911K158403N92947
1366.4G11812615j024782k277673k948164k654851r81569J353800L741562N444646
1382.7G12465584N645395M434406J434148k852321p755816j2969911j5903056j7114877
$$ y = [753441215, 750222564, 746713817, 742806971, 738562763, 734150171, 729646802, 725103974, 720559478, 715990007, 711363196, 706652403, 701849341, 696948946, 691961348, 686913013, 681779742, 676519930, 671227336, 665956080, 660652637, 655318439, 649964511, 644559801, 639120698, 633873165, 628965676, 624570310, 620978236, 618300438, 616685271, 616288841, 617108524, 619131684, 622368872, 626709104, 632251441, 639187992, 646964967, 654819310, 662595212, 670237124, 677609205, 684520602, 690826237, 696558714, 701608419, 705782354, 709061265, 711219668, 711812615, 710787833, 708510160, 705561996, 702907145, 701925576, 703279376, 707020938, 712465584, 718110979, 722545385, 723979533, 721127212, 713371396, 700401485, 684498429, 667383552]
1399F67383552j6646922j4742196j3401508j0681450p326722m711807k364815n29825
1415.3E96978307Q79407K618134L666758L999889M425049M326761M017055L571808
1431.6F24483168K892792K606273K874434K834976L037631L559113M207790N253851
1448F51750028O187141O460369O453395Q031964J0840356R901881Q778215J0263741
1464.3G18667090J1513352J0492623J0231853J2494027J3704658J2613237J1767089
1478.6H01483929J1323571J1117936J0139346R133696R017289R181678P692993O052911
1494.9H75143349N776406N369126M364491L283202K478064K432465K687454K419949
1511.2I03954506J927793J257181R43959Q72075P18594O02424K94388J81972Q9884
$$ y = [667383552, 650736630, 635994434, 622592926, 611911476, 604584754, 599872947, 597508132, 596978307, 597857714, 600475848, 604142606, 608142495, 612567544, 616894305, 620911360, 624483168, 627375960, 629982233, 632856667, 635691643, 638729274, 642288387, 646496177, 651750028, 657937169, 664397538, 670850933, 678882897, 689723253, 699625134, 708403349, 718667090, 730180442, 740673065, 750904918, 763398945, 777103603, 789716840, 801483929, 812807500, 823925436, 834064782, 843198478, 852215767, 861397445, 869090438, 875143349, 880919755, 886288881, 890653372, 893936574, 896414638, 898847103, 901534557, 903954506, 905882299, 907139480, 908083439, 908955514, 909674108, 910276532, 910570920, 910752892, 910842776]
1529.5I10842776l79622q36253o80625q25525j864850k337873j767218j473725j757324
1547.9H98919761k293408k389192k357483k296865k675355k544164o98924j04905r298
1566.3H83550167M71294J426578K146184K506554L447354L833175L519058L530800
1582.6I04431164L503800L218233K824843K545417K275347J998127J751363J502991
1598.9I24051285J254082J026570Q02458O00099L39449Q225k43664n89788r81450q71956
1619.3I25395310r68158j496375j492858j289368j351237j291334j478911k197564
1635.6I13829505j926660j105964j031339j179934j515031j259506m20630p58111j120806
1653.9I03511524K22683N82934L11970L19660O90818R09388R67681J380205J784087
$$ y = [910842776, 910463154, 909626901, 908946276, 908120751, 906255901, 903918028, 902150810, 900677085, 898919761, 896626353, 894237161, 891879678, 889582813, 886907458, 884363294, 883664370, 883559465, 883550167, 884021461, 885448039, 887594223, 890100777, 893548131, 897381306, 900900364, 904431164, 907934964, 911153197, 913978040, 916523457, 918798804, 920796931, 922548294, 924051285, 925305367, 926331937, 927134395, 927734494, 928073943, 928082168, 927838504, 927248716, 926267266, 925395310, 924427152, 922930777, 921437919, 920148551, 918797314, 917505980, 916027069, 913829505, 911902845, 910796881, 909765542, 908585608, 907070577, 905811071, 905390441, 904632330, 903511524, 903734207, 904317141, 904629111, 904948771, 905639589, 906548977, 907516658, 908896863, 910680950]
1672.3I10680950J998305K240121K102971J797438J805604K640843K916336K353430
1688.6I28535998K274036J970947J396179J083613J067877J289844J298368J074195
1704.9I39991057J078427J158118J159966J034498R74417J535892K237797K004326
1721.2I51174498J589357J423240J100660O98268M38392O02603J376212J507342J197278
1739.6I61107850R88364Q59022P87378O77645P23422J170933J161396N94914L55244
1758I68426168L58403M19378O16670M25577R6142L9220J57237M49479N13732K71797
1778.4I71773803J27971J45376J22726K15352J81317j61171p2420M00186M22597J16587
1798.7I73272324n3108K09749L69846J22488j14679m7446J59264J53422L5763M1843
$$ y = [910680950, 912679255, 914919376, 917022347, 918819785, 920625389, 923266232, 926182568, 928535998, 930810034, 932780981, 934177160, 935260773, 936328650, 937618494, 938916862, 939991057, 941069484, 942227602, 943387568, 944422066, 945396483, 946932375, 949170172, 951174498, 952763855, 954187095, 955287755, 955986023, 956424415, 957027018, 958403230, 959910572, 961107850, 962096214, 962955236, 963742614, 964420259, 965143681, 966314614, 967476010, 968070924, 968426168, 968784571, 969203949, 969820619, 970246196, 970342338, 970381558, 970538795, 970988274, 971502006, 971773803, 971901774, 972047150, 972169876, 972385228, 972566545, 972405374, 972332954, 972733140, 973155737, 973272324, 973219216, 973428965, 973798811, 973921299, 973806620, 973759174, 973918438, 974071860, 974107623, 974149466]
1819.1I74149466K1219j52469k26080j21296k7299K10166L25978J07527m6790n5492
1839.5I74184930j58310k08079J08659L11553J82927J11461J22964O4850l2663m4704
1859.9I74643588j788o6638k63572k92241J01387M28677L23236O1333q4400q4698k5869
1882.4I74739015L6359M2438j9013K1696N5432l6359L994R8347O4552J4842K5868R54
1906.8I75048125p0095k2292O8664m8637k09213l8683R7513M0770J78575K31684O9916
1929.3I75346327J788N4657Q5593M9174m9830j74761p6294J70231K21551J55389Q7440
1951.7I75871265N2690J09911J28985O8784J03831J31845L6180M2677J16885R2089
1972.1I76755142P9036Q4877O7651P4029J00196J13129Q3387J9789k2948K8968J25885
$$ y = [974149466, 974170685, 974018216, 973792136, 973670840, 973643541, 973853707, 974179685, 974287212, 974240422, 974184930, 974026620, 973818541, 973927200, 974238753, 974421680, 974533141, 974656105, 974720955, 974688292, 974643588, 974641800, 974575162, 974311590, 974019349, 974120736, 974549413, 974872649, 974933982, 974849582, 974764884, 974739015, 974775374, 974817812, 974798799, 974820495, 974875927, 974839568, 974843562, 974941909, 975006461, 975021303, 975047171, 975048125, 974978030, 974955738, 975024402, 974975765, 974766552, 974727869, 974825382, 974866152, 975044727, 975276411, 975346327, 975348115, 975402772, 975488365, 975537539, 975487709, 975312948, 975236654, 975406885, 975628436, 975783825, 975871265, 975923955, 976033866, 976162851, 976231635, 976335466, 976467311, 976503491, 976546168, 976663053, 976755142, 976834178, 976919055, 976986706, 977060735, 977160931, 977274060, 977357447, 977377236, 977354288, 977383256, 977509141]
1994.5I77509141J25825P7367P8023Q7380J03593J26362Q0049J1980l9458q8572o4016
2017I78007674p331k0981m1127J5735N3049n365p3194p3314k2769l1769o0797m470
2041.4I77735341J5676m2558p0751p8440r6857p7248l8862m4286n6029n8114r2983
2063.9I77094889p6771L9697O3419p3135j69098j22309l0279k9087n9307l2663p4029
2086.3I76531327j47760j07467n9367j06692j25289n7578m5895r8467r2924o4850j03950
2108.7I75521088j14739j2756K8432o6400j23501j08957r5904n9962l3140r7394j45495
2131.2I74691272q2195l2961m7148p7366p6056m9531n5552n7578l6657j0133j1384
2153.6I74154711m3333q8453j06633m2379k3424o1393l338Q3983N3883j7524j9074
$$ y = [977509141, 977634966, 977712333, 977790356, 977877736, 977981329, 978107691, 978187740, 978199720, 978160262, 978071690, 978007674, 978000343, 977979362, 977938235, 977953970, 978007019, 978001654, 977928460, 977855146, 977832377, 977800608, 977739811, 977735341, 977751017, 977708459, 977637708, 977559268, 977462411, 977385163, 977346301, 977302015, 977245986, 977187872, 977094889, 977018118, 977057815, 977121234, 977048099, 976879001, 976756692, 976726413, 976697326, 976638019, 976605356, 976531327, 976383567, 976276100, 976216733, 976110041, 975984752, 975927174, 975881279, 975782812, 975689888, 975625038, 975521088, 975406349, 975393593, 975422025, 975355625, 975232124, 975123167, 975027263, 974967301, 974934161, 974836767, 974691272, 974609077, 974576116, 974528968, 974451602, 974375546, 974326015, 974270463, 974212885, 974176228, 974166095, 974154711, 974111378, 974022925, 973916292, 973873913, 973850489, 973789096, 973785758, 973869741, 973923624, 973906100, 973887026]
2176I73887026q166j4364N841L4869R417j7106o259O914N1976J02281R3758O8605P2241
2202.5I74287033J1146m9114L7610O5268l0399j2934O7770Q5891N6982K2411N6386
2225I74598050R1434L5882n6804o5565m3809n3406M470J1743n5612k5033N8054N7400
2249.4I74556804J7285K1160j6570r3997n7459N0724K0206r3222n7697L6597P987j788
2273.9I74390030P4148O1274k4319q4698p2658L4213O1810l3200o3241n8591q8513
2296.4I74196255p8559o2585p3969q7619r4831m2975J2636o258J3113J10507J37031
2318.8I74022746n484q4161J36494L54171K72811O8187k9504K1577J32441J44422L6479
2341.2I75070179k83361o40392m34816K0742K11656J65582J38819J78039K1756j75059
$$ y = [973887026, 973878860, 973864496, 973870337, 973905206, 973914623, 973897517, 973891258, 973898172, 973950148, 974052429, 974146187, 974214792, 974287033, 974298179, 974249065, 974286675, 974351943, 974321544, 974308610, 974376380, 974462271, 974519253, 974541664, 974598050, 974689484, 974725366, 974668562, 974602997, 974559188, 974505782, 974510252, 974521995, 974466383, 974441350, 974499404, 974556804, 974574089, 974595249, 974578679, 974484682, 974427223, 974477947, 974498153, 974404931, 974347234, 974383831, 974391818, 974390030, 974464178, 974525452, 974501133, 974416435, 974343777, 974377990, 974439800, 974406600, 974343359, 974284768, 974196255, 974117696, 974055111, 973981142, 973893523, 973798692, 973755717, 973768353, 973762095, 973775208, 973885715, 974022746, 974017262, 973933101, 974069595, 974423766, 974696577, 974764764, 974735260, 974756837, 974889278, 975033700, 975070179, 974786818, 974146426, 973711610, 973732352, 973944008, 974109590, 974248409, 974426448, 974448204, 974273145]
2361.6I74273145j94549k54691m49061n75006m85242l40521k24650j15931j07110j15811
2382I71410573j9193O7949j132j36257j60932j01805l2902j0728j02103j73748j25348
2404.4I70614374r5249j37031j71840j48237q8095q4639j23918j30176j52648k00748
2424.8I69281793j46926l1590m6611j06514r0479j06037j49727j30653o9142j8000
2445.2I68386114o2466k17497k66850j23382n6207j18077p9095l4571j27673k26915
2465.6I67073381k43008j99378k22444k71201k37406k47597l16322l43681l13699k67684
2486I64410961k87116l39627l30031l41475l95954l28004k30730k80440l87549m32968
2506.4I61057067l72708k72751k55227k83599k87056k93195k74003k18451k50935l13521
$$ y = [974273145, 974078596, 973823905, 973374844, 972799838, 972314596, 971974075, 971749425, 971633494, 971526384, 971410573, 971391380, 971459329, 971458197, 971321940, 971161008, 971059203, 971026301, 971015573, 970913470, 970739722, 970614374, 970519125, 970382094, 970210254, 970062017, 969973922, 969889283, 969765365, 969635189, 969482541, 969281793, 969134867, 969103277, 969056666, 968950152, 968859673, 968753636, 968603909, 968473256, 968404114, 968386114, 968323648, 968106151, 967839301, 967715919, 967659712, 967541635, 967462540, 967427969, 967300296, 967073381, 966830373, 966630995, 966408551, 966137350, 965899944, 965652347, 965336025, 964992344, 964678645, 964410961, 964123845, 963784218, 963454187, 963112712, 962716758, 962388754, 962158024, 961877584, 961490035, 961057067, 960684359, 960411608, 960156381, 959872782, 959585726, 959292531, 959018528, 958800077, 958549142, 958235621]
2526.8I58235621k57909j95741k29657k16961j04487n9962j23442k06053k40803j59859
2547.2I56440747j1206K6941j00851j84953r7513l4094j18315k23935k39253j64926
2567.6I55292642j18732j81198k35796k10643j88291k39015l47793m25398m08948m13120
2588I52523708n29527n77212n21064n16653n03420n03540n68092n92053o45578p09355
2608.4I46857214p01666p17938p34627p04348p06494p92623q47399p60734o70552p06971
2628.8I39513862p57992p18415p05779p56263p51436o92606o69777o63877n85556n05090
2649.2I32707071n16474n56111n85258n75006n25296m83513m28975m42504n22018m77373
2669.5I27594543l31224k81333l38257l80397l59118k95281k78235k82824k71081k62499
$$ y = [958235621, 957977712, 957781971, 957552314, 957335353, 957230866, 957170904, 957047462, 956841409, 956600606, 956440747, 956429541, 956456482, 956355631, 956170678, 956073165, 956039071, 955920756, 955696821, 955457568, 955292642, 955173910, 954992712, 954756916, 954546273, 954357982, 954118967, 953771174, 953345776, 952936828, 952523708, 951994181, 951416969, 950895905, 950379252, 949875832, 949372292, 948804200, 948212147, 947566569, 946857214, 946155548, 945437610, 944702983, 943998635, 943292141, 942499518, 941652119, 940891385, 940220833, 939513862, 938755870, 938037455, 937331676, 936575413, 935823977, 935131371, 934461594, 933797717, 933212161, 932707071, 932190597, 931634486, 931049228, 930474222, 929948926, 929465413, 929036438, 928593934, 928071916, 927594543, 927263319, 926981986, 926643729, 926263332, 925904214, 925608933, 925330698, 925047874, 924776793, 924514294]
2689.9I24514294j93119j63854k54154k80261j87099j74045k58506k89201k96593l59953
2710.3I22057509l85940l11553l29614m79102n89251o55413o81520o48200o51777p18236
2730.7I16606903p38382o87897o39856o47784o66618o53267o40869o08444n67317n01752
2751.1I10254717m22895m68791n11288l85106k74658k83063l02732l51071m33445m96685
2771.5I06324983o05524p33614p48634p10130q11815j024127j173616j213193j283824
2789.9H98020506j493692j729727j925290k033651k092957k322138k704024l036797
2806.2H80682230l205597l227294l225922l242255l204047l087283k897799k732217
2822.5H55859816k701759k711535k700031k753436k874553l011406l090918l035009
$$ y = [924514294, 924321175, 924157321, 923903167, 923622906, 923435807, 923261762, 923003256, 922714055, 922417462, 922057509, 921671569, 921360016, 921030402, 920551300, 919962049, 919306636, 918625116, 917976916, 917325139, 916606903, 915868521, 915180624, 914540768, 913892984, 913226366, 912573099, 911932230, 911323786, 910756469, 910254717, 909831822, 909363031, 908851743, 908466637, 908191979, 907908916, 907606184, 907255113, 906821668, 906324983, 905719459, 904985845, 904237211, 903527081, 902715266, 901691139, 900517523, 899304330, 898020506, 896526814, 894797087, 892871797, 890838146, 888745189, 886423051, 883719027, 880682230, 877476633, 874249339, 871023417, 867781162, 864577115, 861489832, 858592033, 855859816, 853158057, 850446522, 847746491, 844993055, 842118502, 839107096, 836016178, 832981169]
2838.8H32981169k958357k992749l087938l087342k780795k268136j869380j603663
2855.1H12332809j366019j176656j129090j238883j397848j619220j915812k200485
2871.4H00288796k460181k717793l141284l945291n078972o413459p912100r536803
2887.8G59082913j1128068j2479305j3398051j3484836j2468874j0601700q245527
2902F77276552n602539k947450o03556J285374K585888L266990L466964L166199K303958
2920.4F84198380R57250o20842k118111l372550m206419m416644l991783l021359j442790
2938.7F61965132Q59260L919125P725775J1935353J5827239J8723249K0352483K0855248
2955G62162864K0410001J9015074J6924858J4659346J2466073J0511457Q773387O986201
$$ y = [832981169, 830022812, 827030063, 823942125, 820854783, 818073988, 815805852, 813936472, 812332809, 810966790, 809790134, 808661044, 807422161, 806024313, 804405093, 802489281, 800288796, 797828615, 795110822, 791969538, 788024247, 782945275, 776531816, 768619716, 759082913, 747954845, 735475540, 722077489, 708592653, 696123779, 685522079, 677276552, 671674013, 668726563, 668123007, 669408381, 671994269, 675261259, 678728223, 681894422, 684198380, 685155630, 684534788, 682416677, 679044127, 674837708, 670421064, 666429281, 663407922, 661965132, 662824392, 666743517, 674469292, 686404645, 702231884, 720955133, 741307616, 762162864, 782572865, 801587939, 818512797, 833172143, 845638216, 856149673, 864923060, 871909261]
2971.4H71909261N281687L996849L051519K216041J531184R50634M03166L5942j96398
2989.7H89179885m75645p59124r48549j067161j144588j201868j286984j362979j467407
3008.1H79465580j737773j948059j891136j862169j953840j962363j927794k017557
3024.4H64164889k189100k242804k200424k241552k332568k400518k525448k677024
3040.7H45355451k714515k685308k686739k713442k788603k851427k885163k962768
3057H23067486l059625l193319l235221l167570l210723l271818l280044l368020l514111
3075.4G93767035l610492l604889Tl707408l752172l719867l805578l939330l939986
3093.7G60082424l891826l915191l989219m033804m037440m130185m216313m165232
$$ y = [871909261, 877190948, 881187797, 884239316, 886455357, 887986541, 888937175, 889340341, 889376283, 889179885, 888704240, 887945116, 886996567, 885929406, 884784818, 883582950, 882295966, 880932987, 879465580, 877727807, 875779748, 873888612, 872026443, 870072603, 868110240, 866182446, 864164889, 861975789, 859732985, 857532561, 855291009, 852958441, 850557923, 848032475, 845355451, 842640936, 839955628, 837268889, 834555447, 831766844, 828915417, 826030254, 823067486, 820007861, 816814542, 813579321, 810411751, 807201028, 803929210, 800649166, 797281146, 793767035, 790156543, 786551654, 782946765, 779239357, 775487185, 771767318, 767961740, 764022410, 760082424, 756190598, 752275407, 748286188, 744252384, 740214944, 736084759, 731868446, 727703214]
3110G27703214m093945m116893m275978m390836m341185m309058m357278m358232m287243
3128.4F89172566m226029m267693m347145m349589m361034m346669m219532m134535
3144.7F54920340m164041m252135m316330m276633m214228m157185m087150m068077
3161F21384561m088461m023373l831804l716827l797352l882647l775596l574670l485798
3179.4E87208033l495098l414213l295303l275156l189206l010571k967596l039360
3195.7E61521530k947211k721965k602399k510488k354383k284885k256691k163112
3212E41680396k098263k058565j919210j688659j590074j610159j489461j236379j118362
3230.4E26871264j177430j177550j050889q84473p62701o95825o32286n49793m59791
$$ y = [727703214, 723609269, 719492376, 715216398, 710825562, 706484377, 702175319, 697818041, 693459809, 689172566, 684946537, 680678844, 676331699, 671982110, 667621076, 663274407, 659054875, 654920340, 650756299, 646504164, 642187834, 637911201, 633696973, 629539788, 625452638, 621384561, 617296100, 613272727, 609440923, 605724096, 601926744, 598044097, 594268501, 590693831, 587208033, 583712935, 580298722, 577003419, 573728263, 570539057, 567528486, 564560890, 561521530, 558574319, 555852354, 553249955, 550739467, 548385084, 546100199, 543843508, 541680396, 539582133, 537523568, 535604358, 533915699, 532325625, 530715466, 529226005, 527989626, 526871264, 525693834, 524516284, 523465395, 522580922, 521818221, 521122396, 520490110, 519940317, 519480526]
3248.7E19480526l91066l15308k10405j66654j41859k2829J31548K27332K61724L37302
3269.1E19190311M03226L95536M51088N51045O09338O77228P59006Q31425Q62479Q87812
3289.5E25618494R78231J030564J014650J071990J178026J221061J236260J221418
3305.8E34570694J235723J344562J402974J412511J514256J603067J593709J626968
3322.1E46304464J680553J664877J654625J702786J763522J803816J831948J917720
3338.4E60324311K061963K137661K117157K123654K190709K157390K083540K161086
3354.8E77357471K315819K389610K395928K428532K587974K799391K806724K710640
3371.1E97792089K732396K767444K770781K882421L034950L095924L107489L202974
$$ y = [519480526, 519089460, 518774152, 518563747, 518397093, 518255234, 518232405, 518363953, 518591285, 518853009, 519190311, 519593537, 519989073, 520440161, 520991206, 521600544, 522277772, 523036778, 523868203, 524730682, 525618494, 526596725, 527627289, 528641939, 529713929, 530891955, 532113016, 533349276, 534570694, 535806417, 537150979, 538553953, 539966464, 541480720, 543083787, 544677496, 546304464, 547985017, 549649894, 551304519, 553007305, 554770827, 556574643, 558406591, 560324311, 562386274, 564523935, 566641092, 568764746, 570955455, 573112845, 575196385, 577357471, 579673290, 582062900, 584458828, 586887360, 589475334, 592274725, 595081449, 597792089, 600524485, 603291929, 606062710, 608945131, 611980081, 615076005, 618183494, 621386468]
3387.4F21386468L381670L418684L213882L136516L391623L590704L565251L401697
3403.7F48486495L323376L511250L740430L736734L582895L534437L624439L723979
3420F77264035L716886L716349L794194L807783L740728L812372L930211L889323L807366
3438.4G11479247L722071L713012L819048L975928M099488M088283M013360M002988
3454.7G42913425L977954L850520L770769L890991L992557L908813L848613L756225
3471G73909867L682434L774822L816605L691673L662765L787696L760815L683508L772258
3489.3H07542443L819406L631473L451526L427148L396928L409744L631651L737509
3505.7H36047828L560364L493488L510118L420591L359735L394008L298104L136873
$$ y = [621386468, 624768138, 628186822, 631400704, 634537220, 637928843, 641519547, 645084798, 648486495, 651809871, 655321121, 659061551, 662798285, 666381180, 669915617, 673540056, 677264035, 680980921, 684697270, 688491464, 692299247, 696039975, 699852347, 703782558, 707671881, 711479247, 715201318, 718914330, 722733378, 726709306, 730808794, 734897077, 738910437, 742913425, 746891379, 750741899, 754512668, 758403659, 762396216, 766305029, 770153642, 773909867, 777592301, 781367123, 785183728, 788875401, 792538166, 796325862, 800086677, 803770185, 807542443, 811361849, 814993322, 818444848, 821871996, 825268924, 828678668, 832310319, 836047828, 839608192, 843101680, 846611798, 850032389, 853392124, 856786132, 860084236, 863221109]
3522H63221109L196478L260016L255606L370583L334522L102124K977788K959133K864599
3540.3H91541958K625465K494633K709687K946377K797961K595663K605021K522290
3556.6I12839055K361655K288759K019048J481652J664877K664030K834856K370477
3573I30524409K145290J975000J749754J732349J623333J207709J315832K037585J984537
3591.3I46295798J524269J464546J575172J538932J395703J263201J129031J001954
3607.6I57188606R79901J001179J005828R21369P27594J112640J782477J740217J237154
3626I67696965Q12232J182378J612663J434743J079321P60257O75857P49290O72818
3644.3I76676524K53498j29640N36621J332760J024127O18815P58469P44760M94957
$$ y = [863221109, 866417587, 869677603, 872933209, 876303792, 879638314, 882740438, 885718226, 888677359, 891541958, 894167423, 896662056, 899371743, 902318120, 905116081, 907711744, 910316765, 912839055, 915200710, 917489469, 919508517, 920990169, 922655046, 925319076, 928153932, 930524409, 932669699, 934644699, 936394453, 938126802, 939750135, 940957844, 942273676, 944311261, 946295798, 947820067, 949284613, 950859785, 952398717, 953794420, 955057621, 956186652, 957188606, 958168507, 959169686, 960175514, 961096883, 961824477, 962937117, 964719594, 966459811, 967696965, 968509197, 969691575, 971304238, 972738981, 973818302, 974578559, 975254416, 976003706, 976676524, 976930022, 976800382, 977337003, 978669763, 979693890, 980312705, 981071174, 981815934, 982310891]
3662.7I82310891L96490K07186q0824K25127N31673K08020L95537Q96275Q17478N48839
3683.1I86456692L65973K98l95477R6202P27475N64634R0659j58370l7789K30491J80185
3705.5I88120973j33872l28422j69992K46823M66287K30670k62320m49240k48194Q3029
3725.9I87555742M63248M33683l07024r50872k05398P89761N89431j83404o39558q7201
3746.3I87458408K28047j00374J03056M42505J08362j43707K70664L93630L5703j8895
3766.7I88777399l7014P2360M06921J75535l35395l80933M2259J95980N5552J55091
3787.1I89127755K41041M4227j28746j80304p7486k6047k45631j00076J35481J46031
3807.5I88936245K74003K32577j09553l31521l4928L9518j07825K8193O3598J40607
$$ y = [982310891, 982707381, 982914567, 982833743, 983058870, 983590543, 983798563, 984194100, 985090375, 985907853, 986456692, 986822665, 986822963, 986427486, 986523688, 987251163, 987815797, 987906456, 987748086, 987710297, 987940788, 988120973, 987987101, 987658679, 987488687, 987735510, 988201797, 988432467, 988170147, 987720907, 987472713, 987555742, 988018990, 988452673, 988145649, 987194777, 986989379, 987779140, 988368571, 988185167, 987545609, 987458408, 987686455, 987586081, 987689137, 988131642, 988240004, 988096297, 988366961, 988760591, 988796294, 988777399, 988740385, 988812745, 989219666, 989395201, 989059806, 988678873, 988721132, 988917112, 988972664, 989127755, 989368796, 989413023, 989284277, 989103973, 989026487, 989000440, 988754809, 988654733, 988790214, 988936245, 989210248, 989442825, 989333272, 989001751, 988966823, 989006341, 988898516, 988926709, 988990307, 989130914]
3827.9I89130914J70589J3172n3942k49266n49019l09467J67548L44217K88129J21892
3848.3I89074767k82526q35181m16934N31614N64277K57432m0650j03116p0751l64840
3868.7I88314092m28021N4181M25935M14073j42217n42402j75536K81156N03957J74105
3889.1I88879323k27571M1485J21177l48986o33895n10514j22726M83096Q13007N03242
3909.4I88997638Q3506o7532j98006k13325r4355j60157q9407K87831K26617k80142
3929.8I88492668k69056K14100K86639k0385k47717j93476Q4817R1255j11103L4451
3950.2I88362193K03848N5432n126P7069m77q9109J1981J30951J16170L7491j09613
3972.7I88790810k90573k34603l6121N6088K4557k6464k7895k0027K3543m172j36494
$$ y = [989130914, 989301503, 989314675, 989260733, 989011467, 988462448, 988152981, 988320529, 988664746, 988952875, 989074767, 988792241, 987957060, 987540126, 988071740, 988636017, 988893449, 988852799, 988749683, 988678932, 988314092, 987886071, 987940252, 988366187, 988780260, 988638043, 988095641, 987920105, 988201261, 988705218, 988879323, 988651752, 988693237, 988814414, 988465428, 987831533, 987321019, 987198293, 987681389, 988494396, 988997638, 989081144, 989013612, 988815606, 988602281, 988507926, 988347769, 988258362, 988546193, 988772810, 988492668, 988223612, 988437712, 988724351, 988703966, 988456249, 988262773, 988347590, 988438845, 988327742, 988362193, 988566041, 988621473, 988616347, 988693416, 988692939, 988603830, 988615811, 988746762, 988862932, 988900423, 988790810, 988500237, 988265634, 988229513, 988285601, 988310158, 988283694, 988255799, 988235772, 988259315, 988255143, 988118649]
3995.1I88118649j05620
3997.1I88013029
$$ y = [988118649, 988013029]
##END=$$ End of the data block
