##TITLE=PSHII $$ Begin of the data block
##JCAMP-DX=5.00 $$ ACD/SpecManager v 10.08
##SPECTROMETER/DATA SYSTEM=Alpha
##DATE=01 Apr 2015 08:53:30
##DATA TYPE=INFRARED SPECTRUM
##DATA CLASS=XYDATA
##ORIGIN=
##OWNER=
##NPOINTS=1765
##FIRSTX=399.76428223
##LASTX=3997.64306641
##MAXX=3997.64306641
##MINX=399.76428223
##MAXY=1.00066698
##MINY=0.49925786
##XFACTOR=1.0000000000
##YFACTOR=0.000000010000000
##FIRSTY=1.00000000
##DELTAX=2.03961372
##XUNITS=1/CM
##YUNITS=ARBITRARY UNITS
##XYDATA=(X++(Y..Y))
399.8 100000000 100000000 99797237 99629378 99637657 99610168 99392551 99100596 98802537 98567456 98555857 98575902
422.2 98575902 98577279 98679829 98714072 98534828 98277962 98141825 98142177 98081690 97860187 97652853 97606725
444.6 97606725 97620946 97512788 97253847 97027785 96893102 96712458 96463281 96232021 96096998 96025294
465 96025294 95845908 95513028 95202035 95091677 95043308 94813895 94470924 94193262 93995184 93765336
485.4 93765336 93422890 93056118 92830926 92698449 92435449 92010593 91592628 91316229 91116178 90818751
505.8 90818751 90456849 90204716 90072185 89905584 89636052 89420086 89408177 89469320 89426756 89355683 89421630
528.3 89421630 89625227 89857918 90017843 90131950 90318757 90577757 90757746 90768319 90727443 90773863
548.7 90773863 90841073 90796906 90668160 90589345 90613025 90632564 90524137 90333110 90194064 90124059 90006596
571.1 90006596 89792007 89614904 89608777 89712477 89779890 89784968 89840132 89984757 90091324 90066731 89976883
593.5 89976883 89940822 89969766 89973772 89902228 89816272 89805496 89863402 89899647 89867520 89856505 89984244 90194625
618 90194625 90328807 90383589 90483040 90670550 90839672 90903294 90926594 91012549 91166282 91297990 91369814
640.4 91369814 91440803 91571516 91751111 91899037 91974467 92060548 92215019 92355621 92408746 92419386 92444664
662.9 92444664 92498147 92739427 93048996 92986190 92906296 92997968 93103111 93146026 93195456 93308175 93436331
685.3 93436331 93496025 93494469 93516964 93587887 93628663 93572927 93475747 93442744 93494719 93571091 93636334 93741477
709.8 93741477 93944502 94210899 94448459 94642019 94862616 95131809 95382321 95556176 95676428 95818532
730.2 95818532 95996988 96135432 96180552 96186358 96232414 96289039 96261162 96120816 95939773 95802534 95710409
752.6 95710409 95602959 95471424 95388901 95393419 95424283 95412958 95379794 95399970 95500040 95620501 95712453
775.1 95712453 95830613 96065152 96419054 96801305 97135967 97437763 97753763 98055291 98272598 98418331
795.4 98418331 98587656 98834026 99088514 99243015 99295080 99342942 99430108 99494129 99486685 99460417 99498522
817.9 99498522 99592960 99654150 99637777 99594605 99589735 99601299 99540454 99386144 99215847 99096113 99004465
840.3 99004465 98878896 98721147 98596466 98528707 98460972 98328924 98142684 97974181 97850949 97729266
860.7 97729266 97591394 97492087 97492963 97586131 97696728 97774684 97854632 97980678 98117465 98185647 98165345
883.2 98165345 98111045 98063552 97997677 97866017 97677481 97491491 97326916 97131914 96862781 96547079
903.5 96547079 96232325 95914429 95555866 95148343 94733536 94365215 94047624 93733788 93407732 93114978
923.9 93114978 92891294 92706507 92498380 92257893 92037982 91869801 91729516 91586208 91447723 91339332
944.3 91339332 91241860 91091341 90845066 90526545 90180880 89808160 89375407 88870388 88313687 87719154
964.7 87719154 87072533 86352336 85561520 84732217 83875895 82951111 81916434 80786788 79616791
983.1 79616791 78448504 77295339 76175392 75128394 74190462 73364305 72619689 71925378 71262503
1001.4 71262503 70610917 69941723 69228160 68465877 67682374 66914952 66187751 65526628 64962089 64522123
1021.8 64522123 64220411 64043093 63963813 63956201 63994300 64056665 64132810 64224243 64345109 64512980 64735186
1044.3 64735186 65001571 65299392 65630192 65998477 66401047 66833508 67288452 67737073 68129921 68406290
1064.7 68406290 68503737 68382156 68054044 67589647 67104810 66734040 66585803 66720051 67134976 67773098
1085.1 67773098 68550456 69378507 70178145 70891035 71479362 71931529 72271454 72547489 72811294 73105007
1105.5 73105007 73461747 73897576 74405122 74957740 75518388 76046950 76515520 76919705 77262276 77547020
1125.9 77547020 77789432 78012538 78215802 78366959 78437400 78420889 78323901 78161609 77957219 77745193
1146.3 77745193 77570897 77477443 77502084 77675724 78023499 78562003 79287148 80159211 81116909 82103920
1166.7 82103920 83073211 83987796 84814632 85524082 86101973 86549670 86868751 87057763 87125516 87094927
1187.1 87094927 86985713 86806273 86568266 86296952 86028516 85794014 85605717 85462469 85358769 85285616
1207.5 85285616 85233438 85185003 85115570 85014933 84891087 84751755 84593362 84418011 84242505 84083945
1227.9 84083945 83947670 83831269 83733726 83654284 83591950 83544570 83501488 83455038 83408260 83358568 83301240
1250.3 83301240 83234137 83154768 83064240 82974815 82906294 82857490 82812065 82761526 82699627 82622683 82532161 82422918
1274.8 82422918 82287729 82131392 81965697 81795424 81617618 81436712 81261110 81089741 80916369 80740088
1295.2 80740088 80567020 80401599 80244154 80099094 79974699 79878098 79804790 79749173 79720092 79708844 79708773
1317.6 79708773 79736698 79777330 79802036 79805309 79783571 79738742 79673404 79567856 79405808 79237449 79146791
1340 79146791 79094642 78986543 78825104 78645080 78460377 78267342 78063554 77842247 77559215 77213585
1360.4 77213585 76909828 76669407 76380390 76040262 75686687 75348139 75118113 74980712 74842906 74680585
1380.8 74680585 74474245 74259323 74163318 74143523 73980105 73694789 73454732 73303372 73229504 73174483
1401.2 73174483 73088861 73087102 73162401 73229629 73319513 73403758 73401809 73465872 73838204 74217820 74474865
1423.7 74474865 74737525 74943286 75148004 75331539 75362027 75469393 75802803 76011515 76068944 76070780
1444.1 76070780 76049769 76110077 76203084 76151288 75951666 75985903 76587814 77074474 77288288 77634501 78155541
1466.5 78155541 78485155 78700835 79263175 80149156 80952102 81589222 82115418 82560593 82824987 82928646
1486.9 82928646 83123493 83504945 83716106 83697188 83736700 83876026 83840793 83476096 82892907 82588786
1507.3 82588786 82600564 82433504 82038325 81510168 80991673 80532271 80195445 79978108 79739916 79489458
1527.7 79489458 79149985 78713959 78363496 77980787 77380067 76882130 76807028 76786023 76645911 76356781
1548.1 76356781 75992739 75609016 75118876 74471229 74046046 74231982 74187475 73835295 73403698 73005515
1568.5 73005515 72735971 72385967 71930039 71662104 71481770 71168911 70807493 70444947 70071751 69698977
1588.9 69698977 69335836 68986952 68667477 68376827 68089521 67813027 67560375 67307734 67054403 66835690
1609.3 66835690 66590869 66210806 65846097 65722018 65551090 65240896 65048552 64935696 64814496 64708579
1629.7 64708579 64490819 64291066 64566433 65068418 65290886 65329331 65258336 65370661 65711886 65710014
1650.1 65710014 65778971 66631377 67181015 67279357 67370421 67658126 68028790 68172336 68356955 68855256
1670.5 68855256 69300807 69770503 70406163 70837951 71015698 71323645 72300917 73269355 73861957 74405462
1690.9 74405462 74756759 75082076 75536662 76084912 76929438 77514529 77870989 78362918 78783453 79005742
1711.3 79005742 79079819 79189491 79738098 80531526 81044209 81426704 81834692 82189327 82457751 82676321
1731.7 82676321 83215708 84013432 84512919 84968227 85497046 85931689 86282307 86621171 87109596 87703991
1752 87703991 88106871 88383001 88660949 88882035 89139116 89391589 89525777 89597493 89670569 89941502
1772.4 89941502 90401810 90782207 91081643 91405725 91775763 92206895 92665899 92992991 93263549 93750012
1792.8 93750012 94323063 94753176 95097095 95468152 95881009 96252102 96538204 96758789 96986520 97247303
1813.2 97247303 97497123 97720766 97892076 97965264 97996801 98095775 98199052 98300254 98496199 98689032
1833.6 98689032 98820466 98923343 98939329 98845088 98835987 99029720 99216294 99305737 99359637 99429667 99508017
1856.1 99508017 99546963 99547315 99550587 99542648 99472141 99426395 99529159 99683541 99793744 99852735 99854726 99831164
1880.5 99831164 99838167 99876589 99870008 99812138 99807835 99864870 99926603 99968576 99963176 99944723 99967152 100000000
1905 100000000 99981552 99930537 99936736 99987972 99985534 99924141 99884027 99887425 99952137 100039423 100050354 100010717
1929.5 100010717 100006962 100047112 100066698 100019991 99927789 99882722 99938583 99995315 99983466 99961913 99982005 100012565
1954 100012565 100000000 99960840 99947125 99982578 100002348 99965566 99935400 99963623 100022364 100055647 100030208 99987191
1978.5 99987191 99992025 100038016 100051570 99999547 99932957 99921739 99975914 100013363 99982077 99947077 99967659 100000000
2002.9 100000000 99992871 99943113 99923056 99958837 99985570 99943638 99880177 99873412 99903440 99887508 99809676 99762028
2027.4 99762028 99798667 99860448 99874347 99832642 99789315 99791163 99821234 99822223 99781305 99750698 99768472 99797910
2051.9 99797910 99781966 99732327 99711949 99737537 99752104 99717915 99677473 99683833 99722576 99737704 99704760 99665982
2076.4 99665982 99672484 99709994 99719542 99684054 99651831 99663186 99696344 99697018 99658555 99634171 99655032 99683952
2100.8 99683952 99671984 99630094 99611980 99634153 99651235 99625909 99584931 99578989 99604905 99612224 99577957 99539453
2125.3 99539453 99541056 99567574 99567801 99530596 99501157 99510783 99530351 99517757 99480128 99461317 99476755 99490446
2149.8 99490446 99469328 99434358 99427098 99448502 99459428 99437290 99405307 99397904 99411845 99413347 99390209 99367619
2174.3 99367619 99371010 99386507 99380624 99350858 99329412 99336398 99347210 99329227 99293351 99276644 99285352 99287617 99261528
2200.8 99261528 99225396 99212885 99223548 99219948 99185896 99150908 99142396 99144763 99125576 99083918 99048734 99040461
2225.2 99040461 99039835 99011505 98960805 98924065 98911303 98896074 98857242 98807138 98774570 98762947 98742330 98695153
2249.7 98695153 98642063 98609507 98591429 98560470 98510116 98462921 98433918 98406845 98358279 98293996 98244089 98216838
2274.2 98216838 98183638 98123670 98053730 98003894 97977221 97945166 97891837 97836274 97801393 97782725 97754383 97706616
2298.7 97706616 97659510 97633308 97620958 97600657 97569549 97546649 97538424 97527659 97504997 97483408 97478801 97480768
2323.1 97480768 97462201 97417313 97346377 97195089 96891612 96517944 96308327 96399653 96678561 96926183
2343.5 96926183 96969104 96812570 96665734 96688831 96855915 97018719 97106576 97123468 97078598 96970677 96802866
2366 96802866 96592486 96370298 96156180 95942938 95720512 95501572 95305401 95134592 94982648 94847971
2386.4 94847971 94739383 94661689 94599193 94527012 94439024 94354928 94289237 94229001 94153160 94063157 93979537
2408.8 93979537 93910098 93841225 93760866 93674594 93598849 93535143 93465668 93379933 93287843 93206447 93135941 93061054
2433.3 93061054 92974913 92887676 92810619 92740512 92664272 92575502 92485136 92407072 92336458 92257231 92167151 92081523
2457.8 92081523 92011064 91944456 91864431 91772830 91685593 91611511 91541326 91460907 91373080 91293716 91226465 91156149
2482.2 91156149 91071481 90983355 90905583 90833807 90758860 90679204 90600675 90528965 90460759 90386915 90304649 90224075
2506.7 90224075 90154576 90090430 90019548 89938939 89857823 89786136 89718598 89643979 89564884 89490819 89423382 89355797
2531.2 89355797 89281499 89202493 89129359 89065689 88999516 88922030 88840753 88766593 88699883 88632572 88558513 88482356
2555.6 88482356 88413811 88351148 88281381 88203233 88128227 88060099 87993515 87919754 87837887 87755716 87678456 87604630
2580.1 87604630 87525576 87436956 87346762 87264264 87187070 87104875 87014824 86925054 86840105 86753720 86659455 86559439
2604.6 86559439 86461300 86368531 86276400 86179078 86077112 85977048 85882199 85784101 85676074 85566813 85464960
2627 85464960 85366601 85262686 85150963 85040605 84939045 84838647 84729987 84617162 84509653 84409112
2647.4 84409112 84309149 84204125 84094334 83985847 83885163 83790463 83692539 83591014 83496487 83410817 83323395
2669.9 83323395 83227706 83130133 83039743 82955092 82866794 82772243 82679218 82593757 82513511 82430869 82343310 82256699
2694.3 82256699 82175428 82095736 82009906 81919408 81833529 81753343 81671178 81584048 81497890 81418091 81340945 81258106
2718.8 81258106 81170076 81086802 81013471 80940551 80857569 80770892 80692011 80622441 80554545 80479741 80399299 80323160
2743.3 80323160 80254418 80185574 80108082 80023146 79942578 79869753 79792511 79703176 79611588 79527819 79445624 79356974
2767.8 79356974 79263783 79172218 79083610 78990364 78886420 78775710 78666610 78564447 78464383 78356135
2788.2 78356135 78238750 78119439 78002834 77887517 77766877 77638519 77508676 77381295 77253813 77122575
2808.6 77122575 76988333 76855451 76723212 76587957 76449323 76307589 76165360 76023722 75877887 75726229
2828.9 75726229 75572813 75419605 75261194 75090933 74906570 74709898 74504870 74289978 74063629 73841149
2849.3 73841149 73647904 73493016 73361176 73232716 73097187 72949308 72788578 72612464 72424185 72244686
2869.7 72244686 72088730 71948725 71816128 71700299 71609539 71537787 71475804 71418369 71365529 71317571 71271014
2892.2 71271014 71218520 71153098 71076471 70995861 70909131 70805210 70679259 70535165 70378160 70202589 69999325
2914.6 69999325 69787514 69602931 69460529 69356304 69288564 69264477 69283342 69332075 69407469 69515103 69653076
2937 69653076 69813710 69990182 70169795 70331627 70466900 70588034 70703328 70801473 70882475 70969594 71077514
2959.5 71077514 71200645 71328765 71462280 71608281 71763933 71917999 72061914 72191954 72313613 72427845
2979.9 72427845 72518128 72581041 72630835 72675574 72715408 72735679 72724670 72695601 72652608 72587675 72507781 72421622
3004.4 72421622 72332668 72247165 72164458 72067720 71948701 71820194 71688628 71549535 71406728 71268898
3024.7 71268898 71132815 70994401 70862627 70741475 70615476 70478559 70348769 70225292 70088816 69940621
3045.1 69940621 69795609 69660497 69522780 69374609 69234937 69109559 68981069 68845338 68715924 68603498
3065.5 68603498 68495756 68372273 68240321 68119895 68017900 67925590 67823219 67706871 67589694 67476815
3085.9 67476815 67365593 67247510 67117822 66994035 66887051 66783112 66674042 66560334 66447240 66342682
3106.3 66342682 66237175 66116524 65994692 65890223 65791279 65677452 65543687 65401065 65266651 65143037
3126.7 65143037 65016472 64880067 64743632 64616787 64497930 64374018 64234066 64087498 63946170 63807666
3147.1 63807666 63672119 63540047 63401580 63253522 63103801 62953490 62804341 62662119 62522101 62377232
3167.5 62377232 62230355 62086374 61942309 61797547 61658490 61520863 61378342 61240858 61110801 60976511
3187.9 60976511 60837305 60696906 60553372 60411566 60278857 60152310 60027170 59901798 59773719 59643948
3208.3 59643948 59515250 59391731 59276819 59163272 59048229 58936656 58824390 58708036 58591032 58479589
3228.7 58479589 58378649 58281976 58174503 58055520 57938629 57825363 57716769 57620525 57525057 57415426
3249.1 57415426 57301623 57201022 57112384 57020605 56923443 56829023 56739557 56654370 56573480 56495875 56414735
3271.5 56414735 56329465 56245989 56162477 56078118 55996525 55916500 55834311 55754566 55687082 55629200 55564272 55484223
3296 55484223 55394959 55305713 55227745 55157316 55075324 54976487 54868227 54759240 54652864 54544109 54434139
3318.4 54434139 54328346 54225504 54120505 54006422 53881747 53751856 53622466 53505099 53402054 53290337
3338.8 53290337 53159112 53019696 52875400 52737665 52616054 52487278 52337509 52188689 52055800 51929945
3359.2 51929945 51799339 51667041 51553869 51456869 51343381 51201159 51056707 50935566 50831938 50731689
3379.6 50731689 50631422 50545967 50483429 50431758 50386977 50343680 50280523 50215721 50191021 50182569 50144488 50084245
3404.1 50084245 50038284 50015253 50002301 49991101 49971798 49941084 49925786 49949339 49984515 50011307 50050783 50111198
3428.6 50111198 50176966 50248682 50331622 50405562 50454283 50505263 50575924 50673312 50826597 50989622 51115507
3451 51115507 51239139 51380765 51536155 51705945 51884294 52065229 52264893 52485263 52679724 52831811
3471.4 52831811 52991790 53181183 53380013 53587639 53809851 54027754 54243565 54475659 54707152 54926622
3491.8 54926622 55157930 55414534 55651468 55859470 56116819 56408262 56640047 56869167 57171202 57487404
3512.2 57487404 57763654 58015317 58264357 58522284 58822656 59146321 59461379 59806949 60168296 60495353
3532.6 60495353 60828894 61201745 61549801 61847359 62154299 62547189 62991637 63369024 63732237 64166594
3553 64166594 64586854 64957476 65339088 65694731 65952718 66290814 66962320 67689592 68179631 68594140
3573.4 68594140 69061255 69564843 70083308 70556366 70921379 71338701 72026956 72730756 73213184 73697376
3593.8 73697376 74293566 74894023 75491655 76071650 76520389 76906049 77435207 78051031 78623271 79156440
3614.2 79156440 79628402 80230451 81039464 81672657 81972641 82187587 82794636 83685106 84314442 84826154
3634.6 84826154 85337573 85808879 86242360 86564642 86699629 86822909 87370175 88232875 88801014 89195246
3655 89195246 89721364 90233797 90599972 90875250 91029078 91079646 91247803 91527247 91695172 92031217
3675.4 92031217 92599326 93033242 93320733 93474561 93495864 93556589 93844122 94239765 94549417 94753510
3695.8 94753510 94869870 94954258 95117134 95304972 95349056 95261258 95243293 95487720 95811856 95984602
3716.2 95984602 96035057 96047366 96079552 96177602 96329361 96400201 96297419 96124512 96139556 96441507 96692240
3738.6 96692240 96655369 96505994 96517491 96580106 96565551 96730840 97078592 97291791 97364819 97468466 97624487
3761 97624487 97706890 97715658 97728407 97818810 97998101 98138535 98158091 98124886 98158431 98250204 98323971 98406011
3785.5 98406011 98502737 98567301 98565084 98487151 98384261 98283988 98217946 98291558 98428047 98551506 98735470
3807.9 98735470 98856580 98802197 98661542 98563051 98494929 98497808 98692983 98886853 98958951 98971438 98938304
3830.4 98938304 98869151 98775363 98698127 98727632 98871952 99069309 99250042 99284196 99086142 98746717 98647135
3852.8 98647135 99006617 99288827 99324358 99242389 99173379 99178028 99156183 99123794 99205244 99350798 99456656
3875.2 99456656 99448639 99370801 99353492 99395233 99480629 99554974 99545819 99573034 99656284 99620861 99450600 99291778
3899.7 99291778 99273163 99416381 99636155 99805701 99884844 99879414 99795735 99699056 99684662 99732405 99752909
3922.1 99752909 99755251 99771470 99761838 99740493 99785495 99870795 99902439 99864227 99806911 99788320 99804050 99811620
3946.6 99811620 99827856 99874878 99915498 99922127 99913621 99912995 99920207 99926662 99927229 99925739 99924433 99919194 99914855 99921161
3975.2 99921161 99939531 99958092 99970168 99982524 99990457 99982673 99969310 99967402 99976021 99987799 100000000
3997.6 100000000
##END=$$ End of the data block
