##TITLE=PSGPO $$ Begin of the data block
##JCAMP-DX=5.00 $$ ACD/SpecManager v 10.08
##SPECTROMETER/DATA SYSTEM=Alpha
##DATE=01 Apr 2015 08:53:30
##DATA TYPE=INFRARED SPECTRUM
##DATA CLASS=XYDATA
##ORIGIN=
##OWNER=
##NPOINTS=1765
##FIRSTX=399.76428223
##LASTX=3997.64306641
##MAXX=3997.64306641
##MINX=399.76428223
##MAXY=1.00057077
##MINY=0.33298072
##XFACTOR=1.0000000000
##YFACTOR=0.000000010000000
##FIRSTY=1.00000000
##DELTAX=2.03961372
##XUNITS=1/CM
##YUNITS=ARBITRARY UNITS
##XYDATA=(X++(Y..Y))
$$ plain form
399.8 100000000 99538672 99003327 98500890 98055732 97559392 96981555 96433461 95977294 95442939 94770759
420.2 94770759 94265074 93950784 93624777 93177295 92707199 92312515 91954178 91549271 91061205 90544134
440.6 90544134 90078062 89683831 89296669 88855290 88391382 87971210 87561870 87067753 86569530 86210829
461 86210829 85928291 85636944 85352075 85156304 85102767 85130870 85171461 85287738 85558081 85921383 86255592
483.4 86255592 86531270 86807942 87111336 87391728 87600726 87766105 87929988 88046569 88046616 87944531 87818187
505.8 87818187 87691146 87509274 87245512 86945713 86685586 86484200 86270136 86011559 85772723 85616535
526.2 85616535 85541159 85492796 85448015 85433602 85437125 85402578 85309559 85182381 85040736 84868377 84638882
548.7 84638882 84361720 84106082 83901560 83670104 83362192 83025253 82700139 82345879 81910050 81435710
$$ packed form
399.8A00000000m61328n35345n02437m45158m96340n77837n48094m56167n34355o72180
420.2I4770759n05685l14290l26007m47482m70096l94684l58337m04907m88066n17071
440.6I0544134m66072l94231l87162m41379m63908m20172m09340m94117m98223l58701
461H6210829k82538k91347k84869j95771n3537K8103M0591J16277K70343L63302L34209
483.4H6255592K75678K76672L03394K80392K08998J65379J63883J16581M7j02085j26344
505.8H7818187j27041j81872k63762k99799k60127k01386k14064k58577k38836j56188
526.2H5616535p5376m8363m4781j4413L523l4547r3019j27178j41645j72359k29495
548.7H4638882k77162k55638k04522k31456l07912l36939l25114l54260m35829m74340
$$ plain form
569.1 81435710 81001335 80643803 80367756 80145121 79958129 79814851 79676098 79436576 78998005 78268069
589.4 78268069 77141786 75623971 73941112 72507077 71795481 72063822 73145640 74636590 76160038
607.8 76160038 77484882 78551674 79435074 80194575 80817306 81314963 81748563 82154316 82516229 82814127
628.2 82814127 83098698 83460712 83913225 84360445 84686643 84879541 85002816 85050476 84923810 84592247
648.6 84592247 84162313 83739185 83325422 82925206 82634372 82553518 82643318 82755750 82706869 82317835
669 82317835 82013452 82084173 82499844 83251715 84366882 85760945 87150747 88271654 89113832 89820272
689.4 89820272 90423954 90801936 90925241 90963489 91082960 91237849 91296512 91287470 91391671 91670078 91955090
711.8 91955090 92105979 92212534 92453349 92796946 93049353 93177235 93362832 93720740 94127238 94395083
$$ packed form
569.1H1435710m34375l57532k76047k22635j86992j43278j38753k39522m38571p29936
589.4G8268069j126283j517815j682859j434035p11596K68341J081818J490950J523448
607.8G6160038J324844J066792Q83400P59501O22731M97657M33600M05753L61913K97898
628.2H2814127K84571L62014M52513M47220L26198J92898J23275M7660j26666l31563
648.6H4592247m29934m23128m13763m00216k90834q0854Q9800J12432m8881l89034
669H2317835l04383P0721M15671P51871J115167J394063J389802J120907Q42178P06440
689.4H9820272O03682L77982J23305L8248J19471J54889N8663r042J04201K78407K85012
711.8I1955090J50889J06555K40815L43597K52407J27882J85597L57908M06498K67845
$$ plain form
732.2 94395083 94550139 94780076 95107412 95330179 95325667 95246297 95264578 95302153 95159799 94845188 94585276
754.7 94585276 94490004 94413549 94225138 94038171 94044751 94218796 94311202 94202405 94063681 94069088 94120443
777.1 94120443 94011712 93774563 93671405 93838787 94096023 94230527 94297892 94486141 94777519 94969594
797.5 94969594 95012802 95097870 95361274 95666999 95814872 95862770 96048045 96411812 96744680 96914399
817.9 96914399 97068590 97397417 97811699 98062193 98104787 98154736 98351383 98547059 98568404 98541880 98718566
840.3 98718566 99092734 99413091 99544686 99631149 99823803 100016809 100000000 99865645 99772692 99810714 99805290
862.8 99805290 99607283 99335122 99184710 99120110 98929960 98569793 98252922 98131883 98057455 97800022
883.2 97800022 97374696 96975571 96651596 96235919 95656103 95099658 94747639 94514340 94189769 93744320
$$ packed form
732.2I4395083J55056K29937L27336K22767m512p9370J8281L7575j42354l14611k59912
754.7I4585276r5272p6455j88411j86967O580J74045R2406j08797j38724N407N1355
777.1I4120443j08731k37149j03158J67382K57236J34504O7365J88249K91378J92075
797.5I4969594M3208Q5068K63404L05725J47873M7898J85275L63767L32868J69719
817.9I6914399J54191L28827M14282K50494M2594M9949J96647J95676K1345k6524J76686
840.3I8718566L74168L20357J31595Q6463J92654J93006j6809j34355r2953L8022n424
862.8I9805290j98007k72161j50412o4600j90150l60167l16871j21039p4428k57433
883.2I7800022m25326l99125l23975m15677n79816n56445l52019k33299l24571m45449
$$ plain form
903.5 93744320 93339652 93057579 92763495 92304415 91733116 91217536 90777302 90261930 89608169 88950884
923.9 88950884 88409925 87907267 87301034 86602253 85950130 85399187 84836173 84163308 83451378 82815367
944.3 82815367 82218975 81516510 80661988 79761136 78903246 78040761 77091712 76092404 75144100 74249679
964.7 74249679 73307455 72260702 71169418 70100415 69018704 67846584 66584074 65308195 64070022
983.1 64070022 62843025 61590433 60350764 59207988 58188581 57247263 56353921 55532444 54802203
1001.4 54802203 54142058 53502017 52826595 52098513 51332980 50544292 49755907 49022934 48406294 47916454
1021.8 47916454 47521195 47205174 46981022 46843308 46736318 46594602 46417707 46260896 46161094 46113506
1042.2 46113506 46112707 46174461 46314782 46518695 46738082 46935800 47112149 47269285 47368568 47351709 47176448
$$ packed form
903.5I3744320m04668k82073k94084m59080n71299n15580m40234n15372o53761o57285
923.9H8950884n40959n02658o06233o98781o52123n50943n63014o72865p11930o36011
944.3H2815367n96392p02465q54522r00852q57890q62485r49049r99308r48304q94421
964.7G4249679r42224j046753j091284j069003j081711j172120j262510j275879j238173
983.1F4070022j226997j252592j239669j142776j019407r41318q93342q21477p30241
1001.4E4802203o60145o40041o75422p28082p65533p88688p88385p32973o16640m89840
1021.8D7916454l95259l16021k24152j37714j06990j41716j76895j56811r9802m7588
1042.2D6113506p99O1754J40321K03913K19387J97718J76349J57136R9283j6859j75261
$$ plain form
1064.7 47176448 46825626 46294287 45599243 44820145 44091138 43532172 43179846 42996430 42927855 42929459
1085.1 42929459 42957291 42961353 42904872 42790401 42640802 42462936 42248365 41993177 41714871 41442901
1105.5 41442901 41190645 40956542 40769145 40675753 40688041 40782601 40932757 41127378 41365418 41644153
1125.9 41644153 41948935 42266890 42588264 42883876 43112332 43250003 43305713 43314770 43314266 43314457 43325692
1148.3 43325692 43393540 43564379 43843859 44215551 44672784 45218211 45838612 46499237 47167432 47833595
1168.7 47833595 48514605 49223059 49942660 50652075 51367754 52127248 52929711 53738302 54536915 55344248
1189.1 55344248 56169099 56983417 57754576 58487791 59217668 59959817 60687214 61379576 62064606 62775546
1209.5 62775546 63495117 64170510 64783359 65366507 65942448 66481602 66942716 67336124 67711157 68077648
$$ packed form
1064.7D7176448l50822n31339o95044p79098p29007n58966l52326j83416o8575J604
1085.1D2929459K7832M062n6481j14471j49599j77866k14571k55188k78306k71970
1105.5D1442901k52256k34103j87397r3392J2288R4560J50156J94621K38040K78735
1125.9D1644153L04782L17955L21374K95612K28456J37671N5710R057n04J91J1235
1148.3D3325692O7848J70839K79480L71692M57233N45427O20401O60625O68195O66163
1168.7D7833595O81010P08454P19601P09415P15679P59494Q02463Q08591P98613Q07333
1189.1E5344248Q24851Q14318P71159P33215P29877P42149P27397O92362O85030P10940
1209.5F2775546P19571O75393O12849N83148N75941N39154M61114L93408L75033L66491
$$ plain form
1229.9 68077648 68397772 68661201 68911844 69193035 69494951 69777584 70042330 70339477 70689034 71047246
1250.3 71047246 71371001 71678203 72011960 72368401 72698754 72978711 73244703 73539329 73848027 74126619
1270.7 74126619 74378669 74649429 74949735 75229108 75443918 75621694 75809938 75997204 76126766 76179338
1291.1 76179338 76199877 76231360 76252222 76215678 76130438 76048303 75977200 75860637 75649047 75346750 74990034
1313.5 74990034 74587125 74114519 73611492 73189348 72903401 72708362 72522801 72315311 72117311 71945733
1333.9 71945733 71771842 71584815 71446347 71388811 71323341 71154749 70869392 70510191 70110339 69660097
1354.3 69660097 69152731 68616951 68070275 67521459 67030382 66602743 66202104 65864754 65572166 65286309
1374.7 65286309 65047550 64857519 64679164 64515018 64392102 64324766 64308083 64292318 64194453 64005643
$$ packed form
1229.9F8077648L20124K63429K50643K81191L01916K82633K64746K97147L49557L58212
1250.3G1047246L23755L07202L33757L56441L30353K79957K65992K94626L08698K78592
1270.7G4126619K52050K70760L00306K79373K14810J77776J88244J87266J29562N2572
1291.1G6179338K0539L1483K0862l6544q5240q2135p1103j16563k11590l02297l56716
1313.5G4990034m02909m72606n03027m22144k85947j95039j85561k07490j98000j71578
1333.9G1945733j73891j87027j38468n7536o5470j68592k85357l59201l99852m50242
1354.3F9660097n07366n35780n46676n48816m91077m27639m00639l37350k92588k85857
1374.7F5286309k38759j90031j78355j64146j22916o7336j6683j5765r7865j88810
$$ plain form
1395.1 64005643 63821089 63671875 63546205 63401234 63216978 63057947 62939304 62830973 62734008 62653798
1415.5 62653798 62585801 62590492 62705106 62868136 63061905 63288283 63542217 63824916 64096504 64362520
1435.9 64362520 64688998 65030271 65332949 65588707 65814269 66046607 66306055 66558766 66789389 67067903
1456.3 67067903 67542899 68103397 68647218 69305652 70140177 71007210 71908474 73051172 74371117
1474.7 74371117 75633293 76770133 77782929 78691339 79453164 80068821 80588508 81064594 81431675
1493 81431675 81614947 81610972 81518227 81405532 81236207 80842465 80189455 79802066 79584092 79278618 78839195
1515.4 78839195 78325135 77784449 77116811 76442516 75799149 75063670 74352866 73571444 72594208 71752918
1535.8 71752918 70972627 69760495 68510723 67637205 66854107 66060054 65189683 64313346 63459414
$$ packed form
1395.1F4005643j84554j49214j25670j44971j84256j59031j18643j08331r6965q0210
1415.5F2653798o7997M691J14614J63030J93769K26378K53934K82699K71588K66016
1435.9F4362520L26478L41273L02678K55758K25562K32338K59448K52711K30623K78514
1456.3F7067903M74996N60498N43821O58434Q34525Q67033R01264J142698J319945
1474.7G4371117J262176J136840J012796R08410P61825O15657N19687M76086L67081
1493H1431675J83272l975r2745j12695j69325l93742o53010l87389k17974l05474m39423
1515.4G8839195n14060n40686o67638o74295o43367p35479p10804p81422r77236q41290
1535.8G1752918p80291j212132j249772q73518p83098p94053q70371q76337q53932
$$ plain form
1554.2 63459414 62610692 61459273 60221857 59569299 58960998 58212501 57376069 56485039 55779213
1572.6 55779213 55088294 54193699 53457022 52889556 52280825 51651686 51047748 50459343 49878627 49312830
1593 49312830 48767453 48261371 47789952 47330719 46890414 46498549 46139753 45785043 45437127 45096242
1613.4 45096242 44676602 44198251 43926111 43843418 43900940 44113952 44402492 44698620 44968194 45204860
1633.7 45204860 45468524 45796159 46114227 46405303 46665615 46927732 47258580 47584140 47876006 48294964
1654.1 48294964 48765489 49171969 49544612 49933147 50365496 50769895 51148438 51573664 52018833 52466369
1674.5 52466369 52931368 53356683 53724289 54087073 54606563 55244994 55871260 56523097 57134110 57722712
1694.9 57722712 58316237 58886427 59530199 60123640 60608006 61060518 61475915 61844236 62164056 62438005
$$ packed form
1554.2F3459414q48722j151419j237416o52558o08301p48497q36432q91030p05826
1572.6E5779213o90919q94595p36677n67466o08731o29139o03938n88405n80716n65797
1593D9312830n45377n06082m71419m59233m40305l91865l58796l54710l47916l40885
1613.4D5096242m19640m78351k72140q2693N7522K13012K88540K96128K69574K36666
1633.7D5204860K63664L27635L18068K91076K60312K62117L30848L25560K91866M18958
1654.1D8294964M70525M06480L72643L88535M32349M04399L78543M25226M45169M47536
1674.5E2466369M64999M25315L67606L62784N19490O38431O26266O51837O11013N88602
1694.9E7722712N93525N70190O43772N93441M84366M52512M15397L68321L19820K73949
$$ plain form
1715.3 62438005 62752390 63190109 63663912 64121544 64575499 65022278 65473825 65924734 66427684 67024732
1735.7 67024732 67591417 68157202 68756837 69338769 69885647 70413983 70986056 71622294 72220695 72758049
1756.1 72758049 73293263 73826438 74376696 74929684 75444293 75943989 76444650 76997578 77624512 78251582
1776.5 78251582 78864390 79491967 80123430 80751598 81397754 82026672 82622516 83257025 83926052 84564793
1796.9 84564793 85171950 85768741 86358416 86917287 87442905 87938577 88410848 88863188 89295495 89717817
1817.3 89717817 90123409 90477294 90773112 91076070 91394049 91688216 91993922 92310810 92597723 92866212
1837.7 92866212 93115127 93298858 93441868 93662965 93944454 94185513 94380921 94567859 94761872 94942671
1858.1 94942671 95100278 95249540 95399922 95528090 95628947 95773470 95966130 96151483 96311653 96444780
$$ packed form
1715.3F2438005L14385M37719M73803M57632M53955M46779M51547M50909N02950N97048
1735.7F7024732N66685N65785N99635N81932N46878N28336N72073O36238N98401N37354
1756.1G2758049N35214N33175N50258N52988N14609M99696N00661N52928O26934O27070
1776.5G8251582O12808O27577O31463O28168O46156O28918N95844O34509O69027O38741
1796.9H4564793O07157N96791N89675N58871N25618M95672M72271M52340M32307M22322
1817.3H9717817M05592L53885K95818L02958L17979K94167L05706L16888K86913K68489
1837.7I2866212K48915J83731J43010K21097K81489K41059J95408J86938J94013J80799
1858.1I4942671J57607J49262J50382J28168J00857J44523J92660J85353J60170J33127
$$ plain form
1878.5 96444780 96554101 96666938 96801764 96927607 97014356 97104824 97232628 97361398 97477996 97579962
1898.9 97579962 97671199 97771698 97880781 97967851 98026896 98103368 98209858 98299831 98343927 98390716 98469144
1921.3 98469144 98568666 98680913 98767942 98823923 98886859 98967439 99036926 99083537 99115479 99148375 99205804
1943.8 99205804 99275458 99327326 99375415 99435109 99487704 99520564 99544597 99582690 99634725 99672055 99679893 99695289
1968.3 99695289 99745893 99803287 99837136 99848634 99864608 99898827 99936008 99952686 99952567 99957758 99972641 99990141
1992.7 99990141 100006878 100019515 100034261 100052989 100057077 100043011 100029850 100031185 100035501 100026023 100000000 99993342 100001323
2019.2 100001323 99997973 99953789 99899614 99907488 99965400 100001967 100002623 99996442 100000715 100007200 100004029 99993360 99986351
2045.8 99986351 99987280 99990094 99984461 99973083 99969941 99976605 99978834 99967599 99949324 99937755 99936497 99930686 99913412
$$ packed form
1878.5I6444780J09321J12837J34826J25843Q6749R0468J27804J28770J16598J01966
1898.9I7579962R1237J00499J09083Q7070N9045P6472J06490Q9973M4096M6789P8428
1921.3I8469144R9522J12247Q7029N5981O2936Q0580O9487M6611L1942L2896N7429
1943.8I9205804O9654N1868M8089N9694N2595L2860K4033L8093N2035L7330P838J5396
1968.3I9695289N0604N7394L3849J1498J5974L4219L7181J6678j19N191J4883J7500
1992.7I9990141J6737J2637J4746J8728M088j4066j3161J335M316r478k6023o658P981
2019.2A00001323l350m4184n4175P874N7912L6567O56o181M273O485l171j0669p009
2045.8I9986351R29K814n633j1378l142O664K229j1235j8275j1569j258n811j7274
$$ plain form
2072.3 99913412 99893677 99880642 99870372 99852538 99826288 99799997 99777675 99753076 99723375 99689204 99653614 99616367
2096.8 99616367 99572122 99519742 99464405 99411154 99359989 99310660 99262500 99220616 99194306 99183655 99175793 99161893
2121.2 99161893 99146456 99134898 99128491 99122840 99111652 99097663 99091470 99092948 99091625 99084890 99080431 99086326 99100643
2147.7 99100643 99109966 99109727 99114215 99128777 99141139 99142641 99138379 99138957 99144900 99144661 99137956 99136096 99138421 99138868 99128592
2178.3 99128592 99103725 99078059 99061710 99043900 99013674 98977715 98947978 98928714 98909926 98880106 98847485 98831075
2202.8 98831075 98830330 98825753 98808569 98790383 98788351 98796880 98795056 98779529 98767656 98772097 98781443 98776585 98761630
2229.3 98761630 98756951 98764962 98768568 98757917 98745143 98748082 98763186 98769593 98761791 98757976 98770094 98786515 98792171
2255.8 98792171 98792237 98804688 98834562 98859489 98861891 98859334 98875809 98903406 98913705 98903590 98899221 98915815 98938996
$$ packed form
2072.3I9913412j9735j3035j0270j7834k6250k6291k2322k4599k9701l4171l5590l7247
2096.8I9616367m4245n2380n5337n3251n1165m9329m8160m1884k6310j0651p862j3900
2121.2I9161893j5437j1558o407n651j1188j3989o193J478j323o735m459N895J4317
2147.7I9100643R323k39M488J4562J2362J502m262N78N943k39o705j860K325M47j0276
2178.3I9128592k4867k5666j6349j7810l0226l5959k9737j9264j8788k9820l2621j6410
2202.8I8831075p45m577j7184j8186k032Q529j824j5527j1873M441R346m858j4955
2229.3I8761630m679Q011L606j0651j2774K939J5104O407p802l815J2118J6421N656
2255.8I8792171O6J2451K9874K4927K402k557J6475K7597J0299j0115m369J6594K3181
$$ plain form
2282.3 98938996 98946875 98941761 98952228 98986495 99015832 99022740 99024367 99045753 99085993 99121588 99144113 99175876
2306.8 99175876 99234319 99300671 99340725 99361056 99407935 99494940 99579042 99619722 99641031 99685442 99741203 99752271
2331.3 99752271 99695897 99623781 99593478 99607229 99617738 99567491 99446529 99366176 99417561 99567777 99734509
2353.7 99734509 99878848 99983114 100000000 99965322 99881482 99781704 99659723 99497992 99317670 99165910
2374.1 99165910 99054748 98952973 98841941 98744982 98695147 98686010 98673785 98636466 98603773 98603582 98612225 98592126
2398.6 98592126 98549193 98518729 98512024 98502362 98462939 98409653 98380315 98375779 98357999 98307210 98251796 98225147
2423.1 98225147 98211765 98171693 98104048 98046857 98020899 97998261 97943968 97871631 97821802 97795963 97753787 97677743
2447.6 97677743 97601324 97556061 97523612 97467273 97385782 97315782 97277302 97240263 97172195 97088039 97026920 96991587
$$ packed form
2282.3I8938996P879n114J0467L4267K9337O908J627K1386M0240L5595K2525L1763
2306.8I9175876N8443O6352M0054K0331M6879Q7005Q4102M0680K1309M4411N5761J1068
2331.3I9752271n6374p2116l0303J3751J0509n0247j20962q0353N1385J50216J66732
2353.7I9734509J44339J04266J6886l4678q3840r9778j21981j61731j80322j51760
2374.1I9165910j11162j01775j11032r6959m9835r137j2225l7319l2693j91Q643k0099
2398.6I8592126m2933l0464o705r662l9423n3286k9338m536j7780n0789n5414k6649
2423.1I8225147j3382m0072o7645n7191k5958k2638n4293p2337m9829k5839m2176p6044
2447.6I7677743p6419m5263l2449n6339q1491p0000l8480l7039o8068q4156o1119l5333
$$ plain form
2472 96991587 96942806 96861106 96777672 96725291 96689343 96631306 96547055 96471792 96425879 96385610 96319187 96235973
2496.5 96235973 96170825 96130836 96085608 96010882 95927417 95870358 95834410 95781797 95703393 95629764 95580465 95536882
2521 95536882 95471591 95392650 95331073 95290267 95239991 95163476 95082223 95024276 94983214 94925988 94843841 94766778
2545.5 94766778 94716805 94674903 94612175 94533187 94466996 94420934 94369578 94296646 94218379 94155699 94105619 94046223
2569.9 94046223 93966109 93884873 93824363 93771172 93697780 93608105 93530226 93471831 93408805 93323857 93232501 93155748
2594.4 93155748 93089956 93013030 92915106 92814237 92728841 92648160 92551875 92442292 92338455 92247123 92151183
2616.8 92151183 92034894 91907591 91790384 91687500 91580099 91454786 91323370 91201061 91083020 90956539
2637.2 90956539 90822005 90690982 90569746 90447474 90311539 90172303 90045822 89927703 89803451 89668202
$$ packed form
2472I6991587m8781q1700q3434n2381l5948n8037q4251p5263m5913m0269o6423q3214
2496.5I6235973o5148l9989m5228p4726q3465n7059l5948n2613p8404p3629m9299m3583
2521I5536882o5291p8941o1577m0806n0276p6515q1253n7947m1062n7226q2147p7063
2545.5I4766778m9973m1902o2728p8988o6191m6062n1356p2932p8267o2680n0080n9396
2569.9I4046223q0114q1236o0510n3191p3392q9675p7879n8395o3026q4948r1356p6753
2594.4I3155748o5792p6926r7924j00869q5396q0681r6285j09583j03837r1332r5940
2616.8I2151183j16289j27303j17207j02884j07401j25313j31416j22309j18041j26481
2637.2I0956539j34534j31023j21236j22272j35935j39236j26481j18119j24252j35249
$$ plain form
2657.6 89668202 89532369 89406645 89287251 89161462 89027381 88897794 88779116 88661796 88536125 88405859
2678 88405859 88280910 88164192 88050228 87934148 87817258 87703103 87592918 87483132 87367713 87248445
2698.4 87248445 87133467 87020051 86900318 86778212 86659420 86544979 86433715 86319304 86199784 86081010
2718.8 86081010 85965067 85849375 85734802 85622430 85510010 85400075 85296357 85195208 85091537 84985608
2739.2 84985608 84880269 84776390 84669256 84555691 84445113 84343237 84240943 84134245 84027141 83918631
2759.6 83918631 83805346 83687681 83565724 83441561 83319318 83197200 83072734 82944661 82809514 82668144
2780 82668144 82526278 82383764 82233977 82076949 81920111 81764019 81600189 81423944 81242263 81062871
2800.4 81062871 80882549 80693614 80495089 80293930 80093819 79889309 79675376 79454726 79229593 78995889
$$ packed form
2657.6H9668202j35833j25724j19394j25789j34081j29587j18678j17320j25671j30266
2678H8405859j24949j16718j13964j16080j16890j14155j10185j09786j15419j19268
2698.4H7248445j14978j13416j19733j22106j18792j14441j11264j14411j19520j18774
2718.8H6081010j15943j15692j14573j12372j12420j09935j03718j01149j03671j05929
2739.2H4985608j05339j03879j07134j13565j10578j01876j02294j06698j07104j08510
2759.6H3918631j13285j17665j21957j24163j22243j22118j24466j28073j35147j41370
2780H2668144j41866j42514j49787j57028j56838j56092j63830j76245j81681j79392
2800.4H1062871j80322j88935j98525k01159k00111k04510k13933k20650k25133k33704
$$ plain form
2820.8 78995889 78750491 78493977 78226835 77950275 77665120 77363330 77035630 76683879 76307082 75884998
2841.2 75884998 75384712 74793363 74177569 73686928 73410952 73282176 73181546 73047793 72869575 72646558
2861.6 72646558 72381806 72087967 71779853 71465445 71154022 70861930 70599288 70363295 70142043 69927746
2882 69927746 69724381 69534069 69349760 69163620 68976271 68792826 68612492 68430519 68242103 68042856
2902.4 68042856 67828405 67586410 67293018 66922134 66464925 65966767 65531009 65240455 65089309 65022844
2922.8 65022844 65000993 65005934 65034783 65092665 65183914 65312940 65480959 65683901 65917116 66171712 66432232
2945.2 66432232 66680205 66904962 67108333 67289668 67446548 67585254 67714179 67838049 67955530 68062496
2965.6 68062496 68166101 68280458 68414038 68565691 68727475 68901944 69094867 69291133 69471818 69635254
$$ packed form
2820.8G8995889k45398k56514k67142k76560k85155l01790l27700l51751l76797m22084
2841.2G5884998n00286n91349o15794m90641k75976j28776j00630j33753j78218k23017
2861.6G2646558k64752k93839l08114l14408l11423k92092k62642k35993k21252k14297
2882F9927746k03365j90312j84309j86140j87349j83445j80334j81973j88416j99247
2902.4F8042856k14451k41995k93392l70884m57209m98158m35758k90554j51146o6465
2922.8F5022844k1851M941K8849N7882R1249J29026J68019K02942K33215K54596K60520
2945.2F6432232K47973K24757K03371J81335J56880J38706J28925J23870J17481J06966
2965.6F8062496J03605J14357J33580J51653J61784J74469J92923J96266J80685J63436
$$ plain form
2986 69635254 69783676 69913173 70015353 70083755 70120382 70125699 70101833 70056939 69990760 69901574 69799328
3008.4 69799328 69689316 69560498 69406539 69236904 69061756 68881536 68691260 68488371 68276465 68064451
3028.8 68064451 67854607 67641962 67422682 67197597 66973424 66747546 66514415 66278619 66040170 65799010
3049.2 65799010 65559399 65321279 65083945 64845890 64606225 64370579 64141393 63914722 63690186 63465136
3069.6 63465136 63237596 63015544 62807524 62607986 62399143 62178981 61963528 61758292 61557293 61353892
3090 61353892 61144269 60932475 60722923 60516530 60311592 60104638 59897584 59692961 59487545 59276038
3110.4 59276038 59063607 58855277 58640975 58420956 58204138 57987690 57768506 57545865 57321513 57099724
3130.8 57099724 56878585 56654501 56427944 56202793 55978519 55750203 55519062 55289936 55065715 54845268
$$ packed form
2986F9635254J48422J29497J02180O8402L6627N317k3866m4894o6179q9186j02246
3008.4F9799328j10012j28818j53959j69635j75148j80220j90276k02889k11906k12014
3028.8F8064451k09844k12645k19280k25085k24173k25878k33131k35796k38449k41160
3049.2F5799010k39611k38120k37334k38055k39665k35646k29186k26671k24536k25050
3069.6F3465136k27540k22052k08020j99538k08843k20162k15453k05236k00999k03401
3090F1353892k09623k11794k09552k06393k04938k06954k07054k04623k05416k11507
3110.4E9276038k12431k08330k14302k20019k16818k16448k19184k22641k24352k21789
3130.8E7099724k21139k24084k26557k25151k24274k28316k31141k29126k24221k20447
$$ plain form
3151.2 54845268 54620391 54386187 54151630 53923726 53698999 53472638 53242671 53009385 52777785 52553707
3171.6 52553707 52333033 52109069 51884329 51665246 51445121 51218551 50994867 50779861 50570565 50357366
3192 50357366 50136554 49917072 49706081 49502939 49301982 49098551 48897177 48700550 48505163 48309982
3212.4 48309982 48116818 47926581 47736472 47548112 47361612 47173306 46985191 46796888 46605253 46417198
3232.8 46417198 46236908 46059150 45884344 45714834 45554665 45411775 45284471 45159149 45030138 44904259
3253.2 44904259 44785133 44668576 44549149 44428116 44309360 44191951 44074515 43959704 43847466 43733200
3273.6 43733200 43616179 43498734 43383425 43270499 43155813 43036196 42914200 42795649 42680815 42561951
3294 42561951 42434335 42302969 42171133 42036036 41902041 41766700 41617602 41458157 41298243 41142938
$$ packed form
3151.2E4845268k24877k34204k34557k27904k24727k26361k29967k33286k31600k24078
3171.6E2553707k20674k23964k24740k19083k20125k26570k23684k15006k09296k13199
3192E0357366k20812k19482k10991k03142k00957k03431k01374j96627j95387j95181
3212.4D8309982j93164j90237j90109j88360j86500j88306j88115j88303j91635j88055
3232.8D6417198j80290j77758j74806j69510j60169j42890j27304j25322j29011j25879
3253.2D4904259j19126j16557j19427j21033j18756j17409j17436j14811j12238j14266
3273.6D3733200j17021j17445j15309j12926j14686j19617j21996j18551j14834j18864
3294D2561951j27616j31366j31836j35097j33995j35341j49098j59445j59914j55305
$$ plain form
3314.4 41142938 40991220 40833959 40671322 40510300 40345222 40166813 39982584 39806059 39636788 39467344
3334.8 39467344 39294776 39116773 38931635 38746232 38561395 38374376 38192019 38011059 37820354 37618625
3355.2 37618625 37415111 37216982 37020671 36822098 36622360 36423078 36220104 36004636 35782272 35567403
3375.5 35567403 35363546 35170731 34983784 34799680 34624687 34468582 34328794 34181622 34023041 33880195
3395.9 33880195 33768857 33679694 33590209 33493128 33414224 33365631 33333600 33313268 33303311 33298072 33303607 33327553
3420.4 33327553 33364531 33414364 33482930 33566949 33651429 33738068 33835420 33930072 34012640 34095338 34193653 34303543
3444.9 34303543 34409338 34514198 34632972 34758693 34884912 35020736 35163009 35293791 35419565 35560814
3465.3 35560814 35712135 35853520 35971019 36080551 36204422 36344451 36483705 36603522 36716226 36844847
$$ packed form
3314.4D1142938j51718j57261j62637j61022j65078j78409j84229j76525j69271j69444
3334.8C9467344j72568j78003j85138j85403j84837j87019j82357j80960j90705k01729
3355.2C7618625k03514j98129j96311j98573j99738j99282k02974k15468k22364k14869
3375.5C5567403k03857j92815j86947j84104j74993j56105j39788j47172j58581j42846
3395.9C3880195j11338q9163q9485r7081p8904m8593l2031k0332r957n239N535K3946
3420.4C3327553L6978M9833O8566Q4019Q4480Q6639R7352R4652Q2568Q2698R8315J09890
3444.9C4303543J05795J04860J18774J25721J26219J35824J42273J30782J25774J41249
3465.3C5560814J51321J41385J17499J09532J23871J40029J39254J19817J12704J28621
$$ plain form
3485.7 36844847 36983037 37121832 37267250 37417275 37569538 37719387 37866196 38008475 38135639 38251463
3506.1 38251463 38372645 38505006 38644302 38775006 38885018 38992214 39110604 39238444 39365557 39488187
3526.5 39488187 39624017 39789549 39976862 40178663 40395105 40618590 40857542 41122279 41405305 41695675
3546.9 41695675 42002514 42328641 42673737 43043190 43431813 43835199 44246072 44644710 45027837 45457679
3567.3 45457679 45962897 46478695 46972153 47462395 47958460 48460782 48972747 49475586 49953052 50432765
3587.7 50432765 50959742 51502234 52033371 52569014 53117532 53668165 54220819 54774547 55309141 55842745
3608.1 55842745 56407344 57001495 57620841 58241868 58860713 59543246 60269153 60961133 61595613 62236077
3628.5 62236077 62989217 63789225 64579540 65354192 66116434 66885817 67656171 68388265 69071978 69799727
$$ packed form
3485.7C6844847J38190J38795J45418J50025J52263J49849J46809J42279J27164J15824
3506.1C8251463J21182J32361J39296J30704J10012J07196J18390J27840J27113J22630
3526.5C9488187J35830J65532J87313K01801K16442K23485K38952K64737K83026K90370
3546.9D1695675L06839L26127L45096L69453L88623M03386M10873L98638L83127M29842
3567.3D5457679N05218N15798M93458M90242M96065N02322N11965N02839M77466M79713
3587.7E0432765N26977N42492N31137N35643N48518N50633N52654N53728N34594N33604
3608.1E5842745N64599N94151O19346O21027O18845O82533P25907O91980O34480O40464
3628.5F2236077P53140Q00008P90315P74652P62242P69383P70354P32094O83713P27749
$$ plain form
3648.8 69799727 70654374 71513218 72299623 73086441 73885202 74637473 75345987 76025921 76641279 77205944
3669.2 77205944 77823466 78439683 79001749 79627728 80296785 80926418 81508547 82024449 82457322 82865250
3689.6 82865250 83347905 83868176 84348595 84768468 85131097 85475338 85858577 86243087 86546046 86765444
3710 86765444 87013596 87382269 87770039 88087642 88346505 88588005 88819462 89042532 89298767 89536476
3730.4 89536476 89677173 89768714 89946049 90245932 90553099 90703142 90719181 90873814 91074628 91182983
3750.8 91182983 91384268 91693646 91937864 92096525 92286968 92501819 92656595 92775136 92897862 93058604
3771.2 93058604 93263233 93442118 93561441 93654555 93779469 93917465 94045717 94194877 94355839 94503558
3791.6 94503558 94610268 94669026 94738847 94790423 94815695 94947094 95091224 95203221 95377266 95547271
$$ packed form
3648.8F9799727Q54647Q58844P86405P86818P98761P52271P08514O79934O15358N64665
3669.2G7205944O17522O16217N62066O25979O69057O29633N82129N15902M32873M07928
3689.6H2865250M82655N20271M80419M19873L62629L44241L83239L84510L02959K19398
3710H6765444K48152L68673L87770L17603K58863K41500K31457K23070K56235K37709
3730.4H9536476J40697R1541J77335K99883L07167J50043J6039J54633K00814J08355
3750.8I1182983K01285L09378K44218J58661J90443K14851J54776J18541J22726J60742
3771.2I3058604K04629J78885J19323R3114J24914J37996J28252J49160J60962J47719
3791.6I4503558J06710N8758O9821N1576K5272J31399J44130J11997J74045J70005
$$ plain form
3812 95547271 95613039 95606720 95650780 95683199 95737326 95913726 96085989 96204603 96284121 96340293 96409005 96439546
3836.5 96439546 96425509 96487689 96628398 96791482 96953738 97074246 97068632 96884352 96833742 97062004 97285217
3858.9 97285217 97390759 97409636 97441196 97506112 97516817 97536230 97640103 97775847 97897393 97926599 97923416
3881.4 97923416 97979385 98023003 98082006 98148143 98172021 98248327 98362416 98391640 98334366 98280352 98290873
3903.8 98290873 98402727 98566353 98684162 98741484 98760873 98744208 98735493 98775822 98828632 98865026 98903382
3926.2 98903382 98941427 98953581 98968142 99029237 99101847 99141049 99149996 99152261 99178648 99217874 99244851 99278218
3950.7 99278218 99328202 99377358 99410748 99433953 99459457 99492908 99530095 99562567 99590659 99612892 99630201 99655300
3975.2 99655300 99692827 99729234 99764925 99807602 99843687 99862289 99873620 99892169 99922937 99962568 100000000
$$ packed form
3812I5547271O5768o319M4060L2419N4127J76400J72263J18614P9518N6172O8712L0541
3836.5I6439546j4037O2180J40709J63084J62256J20508n614j84280n0610K28262K23213
3858.9I7285217J05542J8877L1560O4916J0705J9413J03873J35744J21546K9206l183
3881.4I7923416N5969M3618N9003O6137K3878P6306J14089K9224n7274n4014J0521
3903.8I8290873J11854J63626J17809N7322J9389j6665q715M0329N2810L6394L8356
3926.2I8903382L8045J2154J4561O1095P2610L9202Q947K265K6387L9226K6977L3367
3950.7I9278218M9984M9156L3390K3205K5504L3451L7187L2472K8092K2233J7309K5099
3975.2I9655300L7527L6407L5691M2677L6085J8602J1331J8549L0768L9631L7432
$$ plain form
3997.6 100000000
$$ packed form
3997.6A00000000
##END=$$ End of the data block
