##TITLE=$$ Begin of the data block
##JCAMP-DX=5.00 $$ ACD/SpecManager v 10.08
##SPECTROMETER/DATA SYSTEM=16PC
##DATE=Mon Sep 02 17:49:21 2013
##DATA TYPE=INFRARED SPECTRUM
##DATA CLASS=XYDATA
##ORIGIN=
##OWNER=
##NPOINTS=3601
##FIRSTX=400.00000000
##LASTX=4000.00000000
##MAXX=4000.00000000
##MINX=400.00000000
##MAXY=584.00000000
##MINY=-19.46387291
##XFACTOR=1.0000000000
##YFACTOR=0.000001000000000
##FIRSTY=21.64380646
##DELTAX=1.00000000
##XUNITS=1/CM
##YUNITS=ARBITRARY UNITS
##XYDATA=(X++(Y..Y))
$$ plain form
400 21643806 11836219 26406908 58633064 97682098 135257217 157028107 115966866 101869156
408 101869156 258811890 376923065 207364700 11111093 19434093 72602722 70599510
415 70599510 65555550 74827744 102721069 184884720 244642853 180885574 102564095 99266884
423 99266884 127972008 198265579 241911743 148843414 54140114 92205048 155000000 169593460
431 169593460 165068481 141517944 112980743 88849213 83155632 121895599 178571411 256074860
439 256074860 292233002 183788757 56886219 23567295 22881340 29814934 48598122 87518166
447 87518166 109389664 55040455 -1282048 -19463873 43722939 342312195 584000000 420197754
455 420197754 173793106 86047745 53250767 59693527 82630684 90444328 94043304 92416855
$$ packed form
400B1643806r807587J4570689L2226156L9049034L7575119K1770890m1061241j4097710
408A01869156J56942734J18111175j69558365j96253607Q323000N3168629k003212
415G0599510n043960R272194K7893325Q2163651N9758133o3757279p8321479l297211
423I9266884K8705124P0293571M3646164r3068329r4703300L8064934O2794952J4593460
431A69593460m524979k3550537k8537201k4131530n693581L8739967N6675812P7503449
439B56074860L6158142j08444245j26902538l3318924o85955O933594J8783188L8920044
447H7518166K1871498n4349209n6322503j8181825O3186812K98589256K41687805j63802246
455D20197754k46404648q7745361l2796978O442760K2937157P813644L598976j626449
$$ plain form
463 92416855 89705872 90336777 92441849 96705391 99897621 97430206 94062950 93362091 94319847
472 94319847 98439217 101753876 98699333 95572784 98483467 102430534 104450371 104540230 100083778
481 100083778 95957878 98298286 100711800 96902992 92714142 92901634 94427750 95959381 97138855
490 97138855 96847221 96035294 95091629 94583748 95758392 96966263 96217873 95780472 98167946 100650833
500 100650833 100983498 100228096 98229050 96393654 96500610 97280075 98277596 98825409 97685120 96114113
510 96114113 94920227 94213608 94699623 95400307 95411255 95216896 95010353 94760941 94454147 94234398
520 94234398 94280434 94474648 94929359 95133499 94282600 93369057 93297600 93526649 93757698 94165970 95062347
531 95062347 95741150 95306870 94639565 94448853 94350174 94118645 93984749 94231125 94476173 94376083
$$ packed form
463I2416855k710983O30905K105072M263542L192230k467415l367256p00859R57756
472I4319847M119370L314659l054543l126549K910683L947067K019837Q9859m456452
481A00083778m125900K340408K413514l808808m188850J87492J526116J531631J179474
490I7138855k91634q11927r43665n07881J174644J207871p48390m37401K387474K482887
500A00650833L32665p55402j999046j835396J06956P79465R97521N47813j140289j571007
510I6114113j193886p06619M86015P00684J0948j94359k06543k49412l06794k19749
520I4234398M6036J94214M54711K04140q50899r13543p1457K29049K31049M08272Q96377
531I5062347O78803m34280o67305j90712r8679k31529j33896K46376K45048j00090
$$ plain form
541 94376083 94099854 93599106 93181923 93292427 93473816 93275307 93122932 93504311 93783806 93208359
551 93208359 92617752 92810081 93157104 93231750 93228218 93132065 93142105 93599869 94062469 94053337 94014999 94301270
563 94301270 94701363 95239212 95564316 95097015 94548561 94635155 94762207 94412323 94070030 94063637 94343994
574 94343994 95137573 95945671 96304008 96335693 95844177 95323921 95319008 95483757 95700478 95829155 95558807
585 95558807 95284439 95350266 95597313 96128418 96502213 96012543 95556450 96046829 96729706 97071144
595 97071144 97323921 97564056 97787766 98107460 98250511 97818253 97300934 97063683 97082855 97647713
605 97647713 98184631 98071983 97742821 97362663 97112465 97339539 97710297 97998573 98229385 98288704
615 98288704 98367264 98774696 99040199 98617744 98042465 97599648 97492599 98311111 99180817 99217056 99040291
$$ packed form
541I4376083k76229n00748m17183J10504J81389j98509j52375L81379K79495n75447
551I3208359n90607J92329L47023P4646l532r6153J0040M57764M62600r132l8338K86271
563I4301270M00093N37849L25104m67301n48454Q6594J27052l49884l42293o393K80357
574I4343994P93579Q08098L58337L1685m91516n20256m913J64749K16721J28677k70348
585I5558807k74368O5827K47047N31105L73795m89670m56093M90379O82877L41438
595I7071144K52777K40135K23710L19694J43051m32258n17319k37251J9172N64858
605I7647713N36918j12648l29162l80158k50198K27074L70758K88276K30812N9319
615I8288704P8560M07432K65503m22455n75279m42817j07049Q18512Q69706L6239j76765
$$ plain form
626 99040291 99007843 99024269 99168205 99274612 99109337 98958038 99066856 99319984 99778297 100157837 100121162
637 100121162 99889465 99548721 99167061 98750542 98571159 99039841 99745583 100528717 101045898 100665474
647 100665474 100092384 99876167 99851227 100067261 100427818 100947784 101342628 101191284 100918243 100840164
657 100840164 100859497 101029709 101214149 101280830 101269150 101164673 100996590 100685410 100542709 101116539 101617882
668 101617882 101201080 100583961 100215981 100056480 100316216 100690147 100938942 101076126 100985191 100816895
678 100816895 100676414 100583939 100612976 100708580 100873116 101008080 101037285 100896095 100306557 99832199 100166916
689 100166916 100641655 100715256 100697876 100741150 100779198 100788116 100793503 100824883 100846336 100827576 100780960 100725647
701 100725647 100610924 100335052 100070168 99993446 99988052 99993637 100017761 100112366 100083855 99640869 99128433
$$ packed form
626I9040291l2448J6426J43936J06407j65275j51299J08818K53128M58313L79540l6675
637A00121162k31697l40744l81660m16519j79383M68682P05742P83134N17181l80424
647A00665474n73090k16217k4940K16034L60557N19966L94844j51344k73041p8079
657A00840164J9333J70212J84440O6681j1680j04477j68083l11180j42701N73830N01343
668A01617882m16802o17119l67980j59501K59736L73931K48795J37184r0935j68296
678A00816895j40481r2475K9037R5604J64536J34964K9205j41190n89538m74358L34717
689A00166916M74739P3601j7380M3274L8048Q918N387L1380K1453j8760m6616n5313
701A00725647j14723k75872k64884p6722n394N585K4124R4605k8511m42986n12436
$$ plain form
712 99128433 98854088 98638748 98388527 98155281 97987152 97801086 97484253 97173904 96992020 96871521
722 96871521 96758583 96735191 96928978 97149017 97185539 97222687 97393990 97641228 97986053 98322227 98537704
733 98537704 98671341 98705292 98697212 98661446 98710014 99023529 99410156 99747940 100007439 100103851 100081207
744 100081207 99875832 99725655 99911903 100240829 100658966 101026657 101117851 101138161 101261116 101356697 101289246
755 101289246 101249100 101492599 101685974 101459244 101177261 101160049 101172112 101000526 100897476 101120781 101440407
766 101440407 101744270 101936195 101775169 101583313 101702454 101832321 101749062 101565292 101286026 101009987
776 101009987 100844482 100768730 100831863 100931313 100975395 100980232 100915718 100828766 100805405 100698181 100304962 99875854
788 99875854 99604156 99458023 99536179 99640106 99616714 99428322 98854759 98290039 98150375 98148750 98127457
$$ packed form
712I9128433k74345k15340k50221k33246j68129j86066l16833l10349j81884j20499
722I6871521j12938k3392J93787K20039L6522L7148J71303K47238L44825L36174K15477
733I8537704J33637L3951q080l5766M8568L13515L86627L37784K59499R6412k2644
744A00081207k05375j50177J86248L28926M18137L67691R1194K0310J22955R5581o7451
755A01289246m0146K43499J93375k26730k81983j7212J2063j71586j03050K23305L19626
766A01440407L03863J91925j61026j91856J19141J29867q3259j83770k79266k76039
776A01009987j65505p5752O3133R9450M4082M837o4514q6952k3361j07224l93219m29108
788I9875854k71698j46133P8156J03927k3392j88392n73563n64720j39664j625k1293
$$ plain form
799 98127457 98114540 98136093 98040131 97562050 97065445 96933655 96842621 96519760 96193817 96059013 95946121
810 95946121 95712997 95472313 95327164 95163872 94852020 94544861 94392441 94273903 94143867 93925835
820 93925835 93484543 92950508 92351509 91860153 91788170 91746017 91381165 90894104 90340736 89802002 89439651
831 89439651 89066910 88479233 87891365 87507507 87154411 86695053 86224792 85778976 85400482 85161331
841 85161331 85009506 84946991 84883667 84701988 84485863 84241272 84084251 84187386 84386803 84585167 84755066
852 84755066 84820679 84829834 84789635 84746361 84751320 84796356 84909988 85033417 85121246 85161469 85112785 85017517
864 85017517 84859322 84772873 84950729 85202576 85370041 85549591 85826515 86075928 86178879 86202667 86177635
875 86177635 86095764 85948563 85767578 85557983 85390381 85345551 85397720 85589340 85796310 85861755 85926125
$$ packed form
799I8127457j2917K1553r5962m78081m96605j31790r1034l22861l25943j34804j12892
810I5946121k33124k40684j45149j63292l11852l07159j52420j18538j30036k18032
820I3925835m41292n34035n98999m91356p1983m2153l64852m87061n53368n38734l62351
831H9439651l72741n87677n87868l83858l53096m59358m70261m45816l78494k39151
841H5161331j51825o2515o3324j81679k16125k44591j57021J03135J99417J98364J69899
852H4755066O5613R155m0199m3274M959M5036J13632J23429Q7829M0223m8684r5268
864H5017517j58195q6449J77856K51847J67465J79550K76924K49413J02951K3788k5032
875H6177635q1871j47201j80985k09595j67602m4830N2169J91620K06970O5445O4370
$$ plain form
886 85926125 86092995 86316040 86578011 86894989 87285019 87724899 88225128 88702583 89084412 89350174
896 89350174 89412071 89399292 89456268 89449379 89219688 88987328 89013336 89015770 88764214 88364838 87768219 87210655
908 87210655 86995651 86871841 86699745 86447144 85954712 85464050 85232117 85053207 84788536 84494232
918 84494232 84166763 83846115 83605385 83341621 82942581 82509109 82123657 81728836 81277107 80821396
928 80821396 80405426 80009247 79620071 79259918 78962585 78679634 78405258 78045036 77422020 76777740
938 76777740 76345566 75972916 75594566 75181725 74623848 74100586 73782753 73586296 73479774 73476028 73582863
949 73582863 73783730 74072525 74425720 74801231 75248482 75805641 76464203 77264404 78098106 78854843
959 78854843 79581573 80267380 80975029 81821182 82633018 83232521 83751801 84287094 84767868 85148529
$$ packed form
886H5926125J66870K23045K61971L16978L90030M39880N00229M77455L81829K65762
896H9350174O1897j2779N6976o889k29691k32360K6008K434k51556l99376n96619n57564
908H7210655k15004j23810j72096k52601m92432m90662k31933j78910k64671k94304
918H4494232l27469l20648k40730k63764l99040m33472l85452l94821m51729m55711
928H0821396m15970l96179l89176l60153k97333k82951k74376l60222o23016o44280
938G6777740m32174l72650l78350m12841n57877n23262l17833j96457j06522l746J06835
949G3582863K00867K88795L53195L75511M47251N57159O58562Q00201Q33702P56737
959G8854843P26730O85807P07649Q46153Q11836N99503N19280N35293M80774L80661
$$ plain form
969 85148529 85450317 85699104 85835434 85772995 85617996 85473160 85262421 84909081 84517578 84177948
979 84177948 83856293 83546425 83255150 82983543 82742432 82548019 82384964 82265182 82123039 81838417
989 81838417 81586525 81538818 81586456 81702164 81812355 81793335 81767868 81827286 81941963 82156281 82339241
1000 82339241 82302452 82262299 82423950 82632378 82822372 82929611 82829475 82637527 82457710 82200119
1010 82200119 81750992 81285545 80995087 80717445 80351875 79905174 79332756 78687737 77956512 77294586
1020 77294586 76980087 76631500 75845291 74965477 74246666 73553230 72815392 72089958 71410751 70776794
1030 70776794 70209839 69675301 69146393 68621513 68066048 67552185 67162994 66830971 66491486 66218826
1040 66218826 66087959 66032005 66002823 66018936 66104553 66194275 66215752 66213989 66235924 66203354 66035416 65787056
$$ packed form
969H5148529L01788K48787J36330o2439j54999j44836k10739l53340l91503l39630
979H4177948l21655l09868k91275k71607k41111j94413j63055j19782j42143k84622
989H1838417k51892m7707M7638J15708J10191j9020k5467N9418J14677K14318J82960
1000H2339241l6789m0153J61651K08428J89994J07239j00136j91948j79817k57591
1010H2200119m49127m65447k90458k77642l65570m46701n72418o45019p31225o61926
1020G7294586l14499l48587p86209q79814p18811o93436p37838p25434o79207o33957
1030G0776794n66955n34538n28908n24880n55465n13863l89191l32023l39485k72660
1040F6218826j30867n5954k9182J6113Q5617Q9722K1477j763K1935l2570j67938k48360
$$ plain form
1052 65787056 65492439 65132950 64696030 64197372 63658951 63049316 62326218 61543701 60709740 59920288
1062 59920288 59326912 58770607 58112644 57443737 56795692 56206490 55776859 55350327 54762794 54137634
1072 54137634 53556587 52980469 52388309 51807045 51288010 50736977 50031113 49307465 48677803 48094795
1082 48094795 47562695 47038364 46461128 45887711 45354797 44861748 44429565 44029881 43632744 43263794
1092 43263794 42957138 42657207 42289257 41944672 41714359 41524815 41327095 41138340 40955208 40789940
1102 40789940 40637421 40546322 40612675 40689232 40635109 40527058 40367867 40238262 40260841 40312767 40284134
1113 40284134 40258575 40297817 40357445 40406681 40466118 40550423 40646648 40745209 40850567 40976669 41085289
1124 41085289 41116119 41149044 41258549 41400242 41563679 41721226 41845680 41925026 41937447 41884972 41705799
$$ packed form
1052F5787056k94617l59489m36920m98658n38421o09635p23098p82517q33961p89452
1062E9920288n93376n56305o57963o68907o48045n89202m29631m26532n87533o25160
1072E4137634n81047n76118n92160n81264n19035n51033p05864p23648o29662n83008
1082D8094795n32100n24331n77236n73417n32914m93049m32183l99684l97137l68950
1092D3263794l06656k99931l67950l44585k30313j89544j97720j88755j83132j65268
1102D0789940j52519r1099O6353P6557n4123j08051j59191j29605K2579N1926k8633
1113D0284134k5559L9242N9628M9236N9437Q4305R6225R8561J05358J26102J08620
1124D1085289L0830L2925J09505J41693J63437J57547J24454P9346J2421n2475j79173
$$ plain form
1135 41705799 41569565 41672634 41872765 42126320 42333794 42306664 42268135 42423393 42637825 42815353
1145 42815353 43045403 43397785 43834949 44323444 44920685 45706604 46579861 47408749 48363899 49626205
1155 49626205 51032925 52469326 53972031 55549335 57171368 58854271 60468269 61851738 63116146
1164 63116146 64337181 65460442 66450165 67326141 68083122 68760132 69391487 69986084 70578766 71125748
1174 71125748 71570114 71985863 72427010 72896454 73436806 73982857 74462250 74938751 75472351 76002075
1184 76002075 76459099 76926659 77506325 78074196 78526428 78904274 79173233 79456734 79901840 80402969
1194 80402969 80898407 81403542 81930138 82427170 82826355 83190941 83594803 83937622 84106949 84213066
1204 84213066 84348152 84454132 84494377 84496376 84480927 84431244 84332535 84199287 84027573 83857491 83734512
$$ packed form
1135D1705799j36234J03069K00131K53555K07474k7130l8529J55258K14432J77528
1145D2815353K30050L52382M37164M88495N97241P85919Q73257Q28888R55150J262306
1155D9626205J406720J436401J502705J577304J622033J682903J613998J383469J264408
1164F3116146J221035J123261R89723Q75976P56981O77010O31355N94597N92682N46982
1174G1125748M44366M15749M41147M69444N40352N46051M79393M76501N33600N29724
1184G6002075M57024M67560N79666N67871M52232L77846K68959K83501M45106N01129
1194H0402969M95438N05135N26596M97032L99185L64586M03862L42819J69327J06117
1204H4213066J35086J05980M0245J999j5449m9683r8709j33248j71714j70082j22979
$$ plain form
1215 83734512 83638451 83573128 83511757 83437325 83324364 83112358 82889267 82764175 82612968 82334663 81968925
1226 81968925 81519699 80993034 80411026 79729439 78849960 77956841 77248123 76583885 75892662 75166870
1236 75166870 74344086 73517296 72778610 72068237 71318672 70644997 70180557 69802879 69401596 69073486
1246 69073486 68899918 68816589 68774887 68808838 68908646 69157051 69692398 70338150 70930481 71569489 72298073
1257 72298073 73123932 74125381 75133423 75979568 76740456 77463676 78067688 78467056 78721046 78822945
1267 78822945 78884865 79075836 79218201 79163742 78992844 78735641 78394386 77966095 77496552 77022484
1277 77022484 76568077 76178787 75827286 75492668 75201012 75001335 74803757 74500397 74194077 73976257
1287 73976257 73773148 73520996 73281075 73092033 72957901 72937653 72904732 72682907 72479866 72476456 72576782
$$ packed form
1215H3734512r6061o5323o1371p4432j12961k12006k23091j25092j51207k78305l65738
1226H1968925m49226n26665n82008o81587q79479q93119p08718o64238o91223p25792
1236G5166870q22784q26790p38686p10373p49565o73675m64440l77678m01283l28110
1246F9073486j73568q3329m1702L3951R9808K48405N35347O45752N92331O39008P28584
1257G2298073Q25859J001449J008042Q46145P60888P23220O04012L99368K53990J01899
1267G8822945O1920J90971J42365n4459j70898k57203l41255m28291m69543m74068
1277G7022484m54407l89290l51501l34618k91656j99677j97578l03360l06320k17820
1287G3976257k03109k52152k39921j89042j34132k0248l2921k21825k03041l410J00326
$$ plain form
1298 72576782 72758438 72981598 73147491 73410271 73942184 74590042 75239799 75946213 76746056 77578857
1308 77578857 78411224 79198502 79867981 80470253 81061295 81552032 81868271 82021095 81973907 81795380
1318 81795380 81535217 81213547 80820610 80495621 80383682 80457283 80769661 81223419 81748413 82316116
1328 82316116 82885216 83423759 83899902 84271957 84465836 84546829 84575775 84491776 84284782 83862778 83145454
1339 83145454 82087471 80590630 78733131 76420547 74072502 72051666 70434235 69466568 69000748
1348 69000748 69020126 69376968 69916702 70643089 71527412 72512558 73554970 74585152 75499535 76356415
1358 76356415 77153488 77968887 78960251 79886292 80510735 80976128 81313660 81621124 82036568 82470230
1368 82470230 82876923 83260941 83609009 83928345 84249832 84489037 84520340 84498123 84522675 84630516 84916756
$$ packed form
1298G2576782J81656K23160J65893K62780N31913O47858O49757P06414P99843Q32801
1308G7578857Q32367P87278O69479O02272N91042M90737L16239J52824m7188j78527
1318H1795380k60163l21670l92937l24989j11939P3601L12378M53758N24994N67703
1328H2316116N69100N38543M76143L72055J93879Q0993K8946q3999k06994m22004p17324
1339H3145454j057983j496841j857499k312584k348045k020836j617431r67667m65820
1348F9000748J9378L56842N39734P26387Q84323R85146J042412J030182R14383Q56880
1358G6356415P97073Q15399R91364R26041O24443M65393L37532L07464M15444M33662
1368H2470230M06693L84018L48068L19336L21487K39205L1303k2217K4552J07841K86240
$$ plain form
1379 84916756 85305832 85776543 86260559 86664223 87042236 87410042 87791679 88262917 88683792 88882492
1389 88882492 89030334 89226845 89515472 90064262 90598824 90826584 90969940 91170074 91377953 91618134
1399 91618134 91811012 91821144 91840408 92086174 92346504 92436028 92492226 92611221 92731544 92837784 92887878
1410 92887878 92805412 92677948 92578529 92474274 92314651 92225433 92372200 92584846 92767906 92862823 92701126
1421 92701126 92516731 92577385 92612839 92379234 92065140 91820190 91517044 91078331 90503738 89739037
1431 89739037 88868423 87909630 87007568 86427330 85826065 84857559 83796715 82774376 81876350 81317734
1441 81317734 80841255 80230377 79577927 78885963 78210045 77669884 77074791 76174400 75267220 74692627
1451 74692627 74077370 72823288 71944336 72713730 73755219 73967049 73798607 73238991 72567154 71963478
$$ packed form
1379H4916756L89076M70711M84016M03664L78013L67806L81637M71238M20875J98700
1389H8882492J47842J96511K88627N48790N34562K27760J43356K00134K07879K40181
1399I1618134J92878J0132J9264K45766K60330Q9524N6198J18995J20323J06240N0094
1410I2887878q2466j27464r9419j04255j59623q9218J46767K12646J83060R4917j61697
1421I2701126j84395O0654L5454k33605l14094k44950l03146m38713n74593p64701
1431H9739037q70614r58793r02062n80238o01265r68506j060844j022339q98026n58616
1441H1317734m76479o10878o52450o91964o75918n40161n95093r00391r07180n74593
1451G4692627o15257j254082q78952P69394J041489K11830j68442n59616o71837o03676
$$ plain form
1461 71963478 71712540 72431946 73302818 73537155 73659828 73909210 74356461 75035477 76296257 78908630
1471 78908630 81646988 83324860 84594414 85706139 86678604 87640762 88511948 89250824 89868233
1480 89868233 90357735 90729713 90934372 91145538 91551041 92058990 92615845 93294052 94211792 95178078
1490 95178078 95993446 96801399 97707680 98625900 99565552 100344589 100690369 100883820 101129028 101383636
1500 101383636 101693222 101997711 102196480 102456352 103038528 103559204 103634521 103525688 103331421 103155067
1510 103155067 103175880 103264687 103344086 103437874 103551125 103662399 103739738 103819633 103938606 104064346 104203125
1521 104203125 104275467 104159401 103988602 103854134 103761650 103761124 103810570 103886459 103983215 104102684 104199051
1532 104199051 104199814 104186798 104186203 104292343 104721977 105133728 105204369 105096222 104810074 104507233 104404541
$$ packed form
1461G1963478k50938P19406Q70872K34337J22673K49382M47251O79016J260780K612373
1471G8908630K738358J677872J269554J111725R72465R62158Q71186P38876O17409
1480H9868233M89502L71978K04659K11166M05503N07949N56855O78207R17740R66286
1490I5178078Q15368Q07953R06281R18220R39652P79037L45780J93451K45208K54608
1500A01383636L09586L04489J98769K59872N82176N20676P5317j08833j94267j76354
1510A03155067K0813Q8807P9399R3788J13251J11274P7339P9895J18973J25740J38779
1521A04203125P2342j16066j70799j34468r2484n26M9446P5889R6756J19469R6367
1532A04199051P63j3016n95J06140M29634M11751P0641j08147k86148l02841j02692
$$ plain form
1543 104404541 104336235 104165886 104022263 104017448 104064774 104129005 104167625 104073425 104004959 104109909 104313515
1554 104313515 104630974 104940102 105158493 105181816 104749420 104247597 104041267 103933647 103841278 103788925
1564 103788925 103777100 103794930 103868172 103887344 103688431 103460503 103347900 103320740 103437973 103577469 103616692
1575 103616692 103615692 103594254 103550339 103475357 103408501 103403305 103407928 103381279 103344437 103291443 103262238 103315140
1587 103315140 103388977 103445122 103474136 103439568 103383659 103344276 103298042 103224991 103152725 103111526 103073051 103004005
1599 103004005 102949142 102955627 102982903 103004166 103025078 103067993 103055931 102879456 102658226 102475166 102330902
1610 102330902 102284531 102243256 102091888 101956413 101989838 101995850 101755119 101489326 101383255 101328064 101288673
1621 101288673 101228333 101086189 100899147 100656418 100440071 100362587 100321838 100235771 100156693 100116394 100094315
$$ packed form
1543A04404541o8306j70349j43623m815M7326O4231L8620r4200o8466J04950K03606
1554A04313515L17459L09128K18391K3323m32396n01823k06330j07620r2369n2353
1564A03788925j1825J7830P3242J9172j98913k27928j12603k7160J17233J39496L9223
1575A03616692j000k1438m3915p4982o6856n196M623k6649l6842n2994k9205N2902
1587A03315140P3837N6145K9014l4568n5909l9383m6234p3051p2266m1199l8475o9046
1599A03004005n4863O485K7276K1263K0912M2915j2062j76475k21230j83060j44264
1610A02330902m6371m1275j51368j35475L3425O012k40731k65793j06071n5191l9391
1621A01288673o0340j42144j87042k42729k16347p7484m0749q6067p9078m0299k2079
$$ plain form
1632 100094315 100081657 100074768 100090431 100058533 99864624 99658180 99587227 99541306 99413658 99341057 99452591
1643 99452591 99664398 100006226 100266121 100146721 99933746 99767395 99786804 100351265 100940392 101051018
1653 101051018 100990768 100872826 100777100 100856903 101004936 101148514 101336960 101645042 101923729 101976463 102020386
1664 102020386 102246094 102536514 102880455 103150536 103154083 103075600 103038094 103033112 103143097 103218269 103073479
1675 103073479 102897003 102822685 102828598 102973221 103148911 103282761 103328873 103169777 102946945 102768394 102617027
1686 102617027 102524399 102452377 102385948 102287079 102047638 101862572 101970222 102132103 102156952 102141190 102124046
1697 102124046 102085785 102053925 101925896 101526260 101100853 100920845 100734543 100325584 99858925 99443672
1707 99443672 99030922 98616432 98175003 97681023 97131180 96487831 95828270 95320061 94654510 93507263
$$ packed form
1632A00094315j2658o889J5663l1898j93909k06444p0953m5921j27648p2601J11534
1643I9452591K11807L41828K59895j19400k12975j66351J9409N64461N89127J10626
1653A01051018o0250j17942r5726P9803J48033J43578J88446L08082K78687N2734M3923
1664A02020386K25708K90420L43941K70081L547p8483l7506m982J09985P5172j44790
1675A03073479j76476p4318N913J44623J75690J33850M6112j59096k22832j78551j51367
1686A02617027r2628p2022o6429r8869k39441j85066J07650J61881K4849j5762j7144
1697A02124046l8261l1860j28029l99636m25407j80008j86302m08959m66659m15253
1707I9443672m12750m14490m41429m93980n49843o43349o59561n08209o65551j147247
$$ plain form
1717 93507263 92092850 90493797 88781738 87085724 85315872 83443451 81414078 79050537 76692390
1726 76692390 74735352 72833588 70586945 68553925 67085960 66403938 67439079 68411568 67102455
1735 67102455 65760132 66231628 67502068 69288780 71242119 72716049 74316956 76590179 79072571
1744 79072571 81430367 83820511 86377548 88834694 90938255 92783333 94398407 95729424 96632004
1753 96632004 97405334 98401642 99317314 99914238 100348045 100672676 100954842 101318100 101645782 101825569
1763 101825569 101967834 102138428 102358536 102716377 103076408 103333496 103484657 103459190 103354935 103213928
1773 103213928 103132675 103293350 103480865 103488113 103473351 103537987 103645157 103821060 103977921 104008797 103997063
1784 103997063 103972198 103988937 104153778 104340576 104458145 104508118 104421738 104318977 104315277 104355431 104442123
$$ packed form
1717I3507263j414413j599053j712059j696014j769852j872421k029373k363541k358147
1726G6692390j957038j901764k246643k033020j467965o82022J035141R72489j309113
1735F7102455j342323M71496J270440J786712J953339J473930J600907K273223K482392
1744G9072571K357796K390144K557037K457146K103561J845078J615074J331017R02580
1753I6632004P73330R96308R15672N96924M33807L24631K82166L63258L27682J79787
1763A01825569J42265J70594K20108L57841L60031K57088J51161k5467j04255j41007
1773A03213928q1253J60675J87515P248j4762O4636J07170J75903J56861L0876j1734
1784A03997063k4865J6739J64841J86798J17569M9973q6380j02761l700M0154Q6692
$$ plain form
1795 104442123 104516747 104486153 104456398 104529526 104624176 104709602 104735733 104584053 104428841 104427483 104511978 104705383
1807 104705383 104891800 104937866 104918930 104837845 104778671 104869171 104981064 105016258 105011726 104958916 104896141 104856155
1819 104856155 104847000 104910973 104977966 104958176 104952789 105064537 105198883 105308891 105354431 105226608 105084610
1830 105084610 105085350 105126503 105156998 105179932 105183289 105161140 105072495 105010368 105081795 105203651 105353638 105456184
1842 105456184 105391647 105269913 105148552 105064560 105105591 105176880 105208298 105213425 105165817 105115128 105115822 105126930
1854 105126930 105118439 105111694 105116890 105137398 105184265 105244537 105315140 105377388 105409386 105417587 105400040 105360054 105308510
1867 105308510 105220604 105045700 104871918 104772903 104741409 104823372 104932716 104997276 105021095 104972244 104886368
1878 104886368 104776695 104678535 104653099 104635643 104540726 104491615 104641106 104815002 104871727 104866119 104795029
$$ packed form
1795A04442123P4624l0594k9755P3128R4650Q5426K6131j51680j55212j358Q4495J93405
1807A04705383J86417M6066j8936q1085n9174R0500J11893L5194m532n2810o2775l9986
1819A04856155r155O3973O6993j9790n387J11748J34346J10008M5540j27823j41998
1830A05084610P40M1153L0495K2934L357k2149q8645o2127P1427J21856J49987J02546
1842A05456184o4537j21734j21361q3992M1031P1289L1418N127m7608n0689O94J1108
1854A05126930q491o745N196K0508M6867O0272P0603O2248L1998Q201j7547l9986n1544
1867A05308510q7906j74904j73782r9015l1494Q1963J09344O4560K3819m8851q5876
1878A04886368j09673r8160k5436j7456r4917m9111J49491J73896N6725n608p1090
$$ plain form
1889 104795029 104690697 104583740 104475853 104365181 104292801 104325081 104384186 104396179 104415558 104504776 104565956
1900 104565956 104483818 104373001 104330276 104293846 104226448 104151245 104064941 104009628 104060959 104114769 104060722 103992630
1912 103992630 103985596 103985306 103962898 103916809 103820732 103720001 103658485 103614113 103581093 103554321 103533318 103498413
1924 103498413 103417847 103327370 103255417 103191971 103139786 103088882 103030731 102963470 102871964 102787422 102741692 102717445
1936 102717445 102710983 102713081 102719521 102711273 102664970 102589439 102466965 102353668 102308868 102305290 102355766 102399109
1948 102399109 102357224 102293709 102249405 102214172 102193329 102180954 102174164 102169037 102152657 102148964 102203629 102238441
1960 102238441 102158669 102059509 102006218 101993896 102066658 102142479 102128342 102101227 102116348 102145981 102190804 102220871
1972 102220871 102177361 102147552 102234909 102332092 102344582 102337311 102341148 102363564 102438713 102517105 102552437 102569077
$$ packed form
1889A04795029j04332j06957j07887j10672p2380L2280N9105J1993J9379Q9218O1180
1900A04565956q2138j10817m2725l6430o7398p5203q6304n5313N1331N3810n4047o8092
1912A03992630p034k90k2408m6089r6077j00731o1516m4372l3020k6772k1003l4905
1924A03498413q0566r0477p1953o3446n2185n0904n8151o7261r1506q4542m5730k4247
1936A02717445o462K098O440q248m6303p5531j22474j13297m4800l578N0476M3343
1948A02399109m1885o3515m4304l5233k0843j2375o790n127j6380l693N4665L4812
1960A02238441p9772r9160n3291j2322P2762P5821j4137k7115J5121K9633M4823L0067
1972A02220871m3510k9809Q7357R7183J2490p271L837K2416P5149P8392L5332J6640
$$ plain form
1984 102569077 102574707 102572823 102564713 102564407 102593567 102630302 102659103 102682373 102695175 102703835 102707291 102722458 102774574
1997 102774574 102837440 102894333 102941772 102969551 102981094 102965164 102955559 102996567 103045319 103064323 103081558 103109550
2009 103109550 103156952 103245949 103348396 103454018 103531097 103525139 103494240 103487442 103477409 103446701 103414513 103390816
2021 103390816 103385635 103428673 103470612 103451561 103432777 103466774 103519867 103581528 103634712 103647545 103653839 103689812
2033 103689812 103716446 103685715 103660561 103700516 103767563 103857132 103928307 103920219 103887917 103875610 103854607 103787758
2045 103787758 103744553 103808929 103900459 103968407 104007362 103981712 103931137 103870941 103838417 103900215 103983330 104037262
2057 104037262 104060936 104023598 103963539 103896759 103859283 103925415 103996017 103971191 103927109 103913948 103909683 103918144
2069 103918144 103911926 103844070 103776886 103766251 103784111 103835937 103876877 103849792 103796745 103737045 103681587 103652641
$$ packed form
1984A02569077N630j884q110l06K9160L6735K8801K3270J2802Q660L456J5167N2116
1997A02774574O2866N6893M7439K7779J1543j5930r605M1008M8752J9004J7235K7992
2009A03109550M7402Q8997J02447J05622P7079n958l0899o798j0033l0708l2188k3697
2021A03390816n181M3038M1939j9051j8784L3997N3093O1661N3184J2833O294L5973
2033A03689812K6634l0731k5154L9955O7047Q9569P1175q088l2302j2307k1003o6849
2045A03787758m3205O4376R1530O7948L8955k5650n0575o0196l2524O1798Q3115N3932
2057A04037262K3674l7338o0059o6780l7476O6132P0602k4826m4082j3161m265Q461
2069A03918144o218o7856o7184j0635J7860N1826M0940k7085n3047n9700n5458k8946
$$ plain form
2081 103652641 103635239 103612755 103612137 103668091 103740646 103808121 103850220 103828857 103775719 103696564 103630760 103637123
2093 103637123 103662804 103669930 103672119 103670097 103664352 103653763 103643921 103644730 103641960 103616760 103592773 103591278 103600502 103608322
2107 103608322 103637146 103737686 103812576 103734184 103643944 103667305 103724480 103783463 103826332 103812195 103777786 103739334
2119 103739334 103717300 103762268 103800179 103747223 103683067 103670212 103675964 103691055 103707504 103710007 103711197 103719376 103731941
2132 103731941 103753258 103770638 103767517 103759857 103762009 103762032 103744339 103734207 103758553 103796577 103851028 103877998 103808571
2145 103808571 103720184 103671555 103649712 103669022 103706192 103750107 103778503 103752541 103710510 103673363 103654007 103681183
2157 103681183 103728035 103785965 103828743 103806068 103781319 103814789 103865364 103917381 103954483 103955368 103918961 103812431
2169 103812431 103709747 103691673 103704857 103721931 103745697 103775047 103794388 103766014 103755096 103838730 103943298
$$ packed form
2081A03652641j7402k2484o18N5954P2555O7475M2099k1363n3138p9155o5804O363
2093A03637123K5681P126K189k022n745j0589r842Q09k770k5200k3987j495R224P820
2107A03608322K8824J00540P4890p8392r0240K3361N7175N8983M2869j4137l4409l8452
2119A03739334k2034M4968L7911n2956o4156j2855N752J5091J6449K503J190Q179J2565
2132A03731941K1317J7380l121p660K152K3j7693j0132K4346L8024N4451K6970o9427
2145A03808571q8387m8629k1843J9310L7170M3915K8396k5962m2031l7147j9356K7176
2157A03681183M6852N7930M2778k2675k4749L3470N0575N2017L7102Q85l6407j06530
2169A03812431j02684j8074J3184J7074K3766K9350J9341k8374j0918Q3634J04568
$$ plain form
2180 103943298 104032013 104071381 103974915 103864479 103853867 103880547 103923462 103971695 104000023 104030319 104088806 104137161
2192 104137161 104140495 104114487 104037430 103986526 104070351 104172897 104201767 104194351 104145218 104090332 104072762 104065659
2204 104065659 104062508 104045341 103980492 103908394 103851173 103830002 103898979 103981163 104002289 104008171 104023361 104037476
2216 104037476 104050323 104055809 104044006 104026154 104021980 103995705 103886482 103789070 103804687 103853035 103879929 103908112
2228 103908112 103944756 103982162 104022858 104043106 103999374 103953506 103957275 103997185 104102966 104196640 104188583 104143333
2240 104143333 104084328 104045059 104099510 104149460 104083656 104014969 104045273 104096199 104115677 104126480 104142288 104138229
2252 104138229 104071426 104009537 104035019 104060341 104001190 103930161 103880692 103885719 104039833 104191353 104168030 104126122
2264 104126122 104208878 104282761 104227234 104146240 104103043 104099152 104185822 104277107 104285957 104266830 104238319 104220894
$$ packed form
2180A03943298Q8715L9368r6466j10436j0612K6680M2915M8233K8328L0296N8487M8355
2192A04137161L334k6008p7057n0904Q3825J02546K8870p416m9133n4886j7570p103
2204A04065659l151j7167o4849p2098n7221k1171O8977Q2184K1126N882J5190J4115
2216A04037476J2847N486j1803j7852m174k6275j09223r7412J5617M8348K6894K8183
2228A03908112L6644L7406M0696K0248m3732m5868L769L9910J05781R3674q057m5250
2240A04143333n9005l9269N4451M9950o5804o8687L0304N0926J9478J0803J5808m059
2252A04138229o6803o1889K5482K5322n9151p1029m9469N027J54114J51520k3323m1908
2264A04126122Q2756P3883n5527q0994m3197l891Q6670R1285Q850j9127k8511j7425
$$ plain form
2276 104220894 104250572 104299255 104357407 104405022 104410408 104399063 104392433 104370735 104309105 104243874 104197624 104186699
2288 104186699 104268410 104342293 104285622 104222275 104270645 104324409 104284264 104247162 104294250 104373642 104461983 104554771
2300 104554771 104652855 104716805 104684425 104624557 104598167 104566574 104497002 104432487 104400108 104414627 104519104 104655746
2312 104655746 104809547 104894897 104764221 104588173 104517624 104464172 104374123 104293915 104244614 104248405 104373337
2323 104373337 104502846 104476379 104493713 104793694 105098412 105145195 105126999 105151558 105211594 105400848 105523727
2334 105523727 105274673 105077171 105395767 105801605 106040337 106052902 105561852 104968002 104586052 104396797
2344 104396797 104553673 104853180 105170731 105422592 105416634 105353455 105473373 105465027 104892586 104369446 104551575
2355 104551575 104875114 104995369 104910446 104310036 103774384 103996231 104327583 104262947 104067352 103776146
$$ packed form
2276A04220894K9678M8683N8152M7615N386j1345o630k1698o1630o5231m6250j0925
2288A04186699Q1711P3883n6671o3347M8370N3764m0145l7102M7088P9392Q8341R2788
2300A04554771R8084O3950l2380n9868k6390l1593o9572o4515l2379J4519J04477J36642
2312A04655746J53801Q5350j30676j76048p0549n3452r0049q0208m9301L791J24932
2323A04373337J29509k6467J7334K99981L04718M6783j8196K4559O0036J89254J22879
2334A05523727k49054j97502L18596M05838K38732J2565m91050n93850l81950j89255
2344A04396797J56876K99507L17551K51861n958o3179J19918q346n72441n23140J82129
2355A04551575L23539J20255q4923o00410n35652K21847L31352o4636j95595k91206
$$ plain form
2365 103776146 103572510 103735062 104012726 104256584 104438522 104444527 104383423 104309608 104272171 104375862 104508018
2376 104508018 104586815 104624153 104573654 104528091 104604675 104683350 104652740 104603813 104599716 104612442 104634407 104667282
2388 104667282 104718521 104763268 104776215 104765869 104718994 104675293 104694054 104703072 104624268 104534409 104491302 104473495
2400 104473495 104489471 104506943 104484818 104457924 104450294 104453255 104473831 104488663 104463409 104437706 104453537 104469154
2412 104469154 104445412 104416130 104406975 104402992 104392883 104391335 104417564 104446556 104460022 104457047 104419899 104380608 104372215
2425 104372215 104373810 104360649 104377220 104496262 104607986 104596832 104552483 104541138 104517532 104422119 104363632 104492523
2437 104492523 104624084 104579567 104491493 104435280 104403236 104422928 104463959 104509186 104546310 104548714 104542160 104553772
2449 104553772 104552719 104508301 104447220 104376076 104324104 104339432 104371765 104379990 104384590 104394081 104402992 104415009 104410980
$$ packed form
2365A03776146k03636J62552K77664K43858J81938O005o1104p3815l7437J03691J32156
2376A04508018P8797L7338n0499m5563P6584P8675l0610m8927m097J2726K1965L2875
2388A04667282N1239M4747J2947j0346m6875m3701J8761R018p8804q9859m3107j7807
2400A04473495J5976J7472k2125k6894p630K961K0576J4832k5254k5703J5831J5617
2412A04469154k3742k9282r155l983j0109j548K6229K8992J3466k975l7148l9291q393
2425A04372215J595j3161J6571J19042J11724j1154m4349j1345k3606r5413n8487J28891
2437A04492523J31561m4517q8074n6213l2044J9692M1031M5227L7124K404o554J1612
2449A04553772j053m4418o1081p1144n1972J5328L2333Q225M600R491Q911J2017m029
$$ plain form
2462 104410980 104365685 104300903 104221893 104152702 104122070 104121231 104169250 104211380 104180435 104132530 104099724 104087067
2474 104087067 104127052 104169083 104163864 104140045 104102516 104073143 104087471 104109337 104109024 104102661 104094887 104090210 104091408
2487 104091408 104108261 104168701 104220940 104222198 104173302 104013535 103884438 103958801 104081985 104166985 104183533
2498 104183533 104020546 103833458 103755447 103742073 103833298 103908989 103804398 103693245 103727814 103807709 103894020
2509 103894020 103954338 103915596 103860565 103863098 103876877 103869438 103872849 103923126 103975655 103995064 103989365 103947067 103891014
2522 103891014 103836227 103794525 103794312 103800842 103773758 103757980 103799484 103854439 103896355 103919006 103900383 103861168
2534 103861168 103811668 103760788 103722092 103691719 103662895 103657722 103705910 103777840 103866318 103933594 103925087 103883865
2546 103883865 103831627 103777908 103740547 103716347 103715347 103715607 103691574 103664062 103645447 103635498 103640488 103653267 103670761
$$ packed form
2462A04410980m5295o4782p9010o9191l0632q39M8019M2130l0945m7905l2806j2657
2474A04087067L9985M2031n219k3819l7529k9373J4328K1866l13o363p774m677J198
2487A04091408J6853O0440N2239J258m8896j59767j29097P4363J23184Q5000J6548
2498A04183533j62987j87088p8011j3374R1225P5691j04591j11153L4569P9895Q6311
2509A03894020O0318l8742n5031K533J3779p439L411N0277N2529J9409n699m2298n6053
2522A03891014n4787m1702k13O530k7084j5778M1504N4955M1916K2651j8623l9215
2534A03861168m9500n0880l8696l0373k8824n173M8188P1930Q8478O7276q507m1222
2546A03883865n2238n3719l7361k4200j000K60k4033k7512j8615r949M990J2779J7494
$$ plain form
2559 103670761 103687096 103695656 103695297 103680710 103657578 103628731 103597473 103569839 103540352 103499695 103465294 103455566 103457878
2572 103457878 103467537 103479095 103496597 103486725 103398659 103288651 103188347 103120682 103141380 103183701 103203392 103188446
2584 103188446 103073883 102974197 103027657 103097656 103064728 103015640 103005341 103009537 103035736 103043221 102964714 102887108
2596 102887108 102892899 102928040 102967690 103006531 103027084 103040672 103061607 103063156 103000732 102942230 102956726 102995773
2608 102995773 103039696 103071068 103062057 103024200 102939651 102868561 102893639 102928947 102905609 102854797 102774689 102695465
2620 102695465 102648232 102628181 102645996 102686050 102751732 102796745 102753899 102689148 102648903 102624420 102631187 102642677
2632 102642677 102629997 102615738 102611801 102621391 102675011 102702332 102606773 102497528 102465248 102468803 102511856 102550697
2644 102550697 102530457 102488113 102443550 102392838 102328873 102280899 102300354 102313469 102234940 102150490 102146439 102135727
$$ packed form
2559A03670761J6335Q560l59j4587k3132k8847l1258k7634k9487m0657l4401r728K312
2572A03457878R659J1558J7502r872q8066j10008j00304o7665K0698M2321J9691j4946
2584A03188446j14563r9686N3460O9999l2928m9088j0299M196K6199P485p8507p7606
2596A02887108N791L5141L9650L8841K0553J3588K0935J549o2424n8502J4496L9047
2608A02995773M3923L1372r011l7857q4549p1090K5078L5308k3338n0812q0108p9224
2620A02695465m7233k0051J7815M0054O5682M5013m2846o4751m0245k4483O767J1490
2632A02642677j2680j4259l937R590N3620K7321r5559j09245l2280L555M3053L8841
2644A02550697k0240m2344m4563n0712o3965m7974J9455J3115p8529q4450m051j0712
$$ plain form
2656 102135727 102034042 101919411 101849297 101800728 101768562 101756836 101780151 101801514 101779892 101742004 101704384
2667 101704384 101656410 101599571 101513863 101358727 101197006 101091385 101001740 100899956 100812485 100777077 100731537
2678 100731537 100615501 100460884 100259399 100071121 99978615 99905800 99792412 99673370 99579239 99462677
2688 99462677 99263023 99050522 98888275 98736809 98559570 98410728 98347832 98323990 98329857 98310257 98166725
2699 98166725 98019577 97988579 97976593 97918465 97837898 97741058 97615288 97424408 97244980 97167709 97113754
2710 97113754 97031570 96929741 96778488 96641228 96600914 96568871 96469070 96346329 96210648 96090317 96039009
2721 96039009 95990540 95868393 95757172 95742989 95744415 95696068 95635750 95587585 95526978 95427109 95318695 95231316
2733 95231316 95141556 95018478 94914154 94878242 94886925 94952515 95016167 95000366 94973160 94991539 95011017 95001007
$$ packed form
2656A02135727j01685j14631p0114m8569l2166j1726K3315K1363k1622l7888l7620
2667A01704384m7974n6839q5708j55136j61721j05621q9645j01784q7471l5408m5540
2678A00731537j16036j54617k01485j88278r2506p2815j13388j19042r4131j16562
2688I9462677j99654k12501j62247j51466j77239j48842o2896k3842N867j9600j43532
2699I8166725j47148l0998j1986n8128q0567r6840j25770j90880j79428p7271n3955
2710I7113754q2184j01829j51253j37260m0314l2043r9801j22741j35681j20331n1308
2721I6039009m8469j22147j11221j4183J426m8347o0318m8165o0607r9869j08414q7379
2733I5231316q9760j23078j04324l5912Q683O5590O3652j5801k7206J8379J9478j0010
$$ plain form
2745 95001007 94976715 94931557 94900200 94941856 94976166 94917725 94840714 94817543 94767906 94604584 94420769 94288872
2757 94288872 94183586 94110489 94049217 93970535 93906357 93899033 93887833 93827965 93713638 93498421 93259407
2768 93259407 93067123 92894722 92748665 92599319 92405655 92207977 92039345 91880486 91721657 91566994
2778 91566994 91428711 91272545 91058159 90816025 90566826 90299484 89993668 89697479 89456177 89257767
2788 89257767 89135864 88998817 88740158 88437912 88141823 87830116 87483124 87144234 86868858 86601135
2798 86601135 86291000 85976219 85685440 85395767 85107948 84779358 84331940 83872437 83503006 83159348
2808 83159348 82804420 82458405 82132271 81816650 81520676 81199478 80782700 80355957 80010895 79659035
2818 79659035 79227066 78761124 78277756 77792099 77324654 76875618 76488182 76053787 75445625 74761536
$$ packed form
2745I5001007k4292m5158l1357M1656L4310n8441p7011k3171m9637j63322j83815j31897
2757I4288872j05286p3097o1272p8682o4178p324j1200n9868j14327k15217k39014
2768I3259407j92284j72401j46057j49346j93664j97678j68632j58859j58829j54663
2778I1566994j38283j56166k14386k42134k49199k67342l05816k96189k41302j98410
2788H9257767j21903j37047k58659l02246k96089l11707l46992l38890k75376k67723
2798H6601135l10135l14781k90779k89673k87819l28590m47418m59503l69431l43658
2808H3159348l54928l46015l26134l15621k95974l21198m16778m26743l45062l51860
2818G9659035m31969m65942m83368m85657m67445m49036l87436m34395o08162o84089
$$ plain form
2828 74761536 74057625 73332191 72624275 71867561 70987007 70047501 69101646 68110947 67046501 65931847
2838 65931847 64764786 63593555 62486603 61381104 60219692 59054111 57904339 56808067 55802727
2847 55802727 54908989 54166267 53555702 53090714 52713753 52350807 52064346 51903225 51833961 51855995
2857 51855995 51919270 51973579 52018810 52037476 52031281 51989983 51931644 51857399 51807549 51833771 51902962 52003574
2869 52003574 52122402 52241611 52363419 52481079 52603340 52728008 52880955 53117825 53346802 53468586
2879 53468586 53561306 53683327 53794407 53850410 53921009 54094982 54270767 54358482 54411674 54453564 54484985
2890 54484985 54521656 54541969 54523968 54484222 54424549 54367233 54350113 54328083 54253220 54171490 54123283 54077148
2902 54077148 54025818 53936840 53743576 53541256 53428101 53328300 53184296 53039406 52934669 52819134 52642441
$$ packed form
2828G4761536p03911p25434p07916p56714q80554r39506r45855r90699j064446j114654
2838F5931847j167061j171231j106952j105499j161412j165581j149772j096272j005340
2847E5802727q93738p42722o10565m64988l76961l62946k86461j61121o9264K2034
2857E1855995O3275N4309M5231J8666o195m1298n8339p4245m9850K6222O9191J00612
2869E2003574J18828J19209J21808J17660J22261J24668J52947K36870K28977J21784
2879E3468586R2720J22021J11080N6003P0599J73973J75785Q7715N3192M1890L1421
2890E4484985L6671K0313j8001l9746n9673n7316j7120k2030p4863q1730m8207m6135
2902E4077148n1330q8978j93264k02320j13155r9801j44004j44890j04737j15535j76693
$$ plain form
2913 52642441 52443768 52242256 52047562 51879501 51726532 51575325 51451065 51359844 51345539 51487637
2923 51487637 51685143 51846100 52022552 52236343 52486015 52788280 53110291 53401375 53731560 54177071
2933 54177071 54668640 55166008 55658054 56109451 56552624 57009842 57475998 57959103 58441780 58917332
2943 58917332 59361721 59737442 60078026 60393215 60716583 61085320 61498047 61979698 62488197 62963631
2953 62963631 63484428 64117142 64837479 65664886 66534302 67368317 68223335 69136383 70088196 71066925
2963 71066925 72087143 73155998 74283836 75516914 76754570 77887703 78987625 80107071 81192635
2972 81192635 82202362 83154488 84043190 84898399 85752869 86591957 87420944 88212517 88944199 89606598
2982 89606598 90155052 90672852 91258049 91821457 92293594 92713097 93107414 93440437 93668030 93841621
$$ packed form
2913E2642441j98673k01512j94694j68061j52969j51207j24260r1221j4305J42098
2923E1487637J97506J60957J76452K13791K49672L02265L22011K91084L30185M45511
2933E4177071M91569M97368M92046M51397M43173M57218M66156M83105M82677M75552
2943E8917332M44389L75721L40584L15189L23368L68737M12727M81651N08499M75434
2953F2963631N20797O32714P20337Q27407Q69416Q34015Q55018R13048R51813R78729
2963G1066925J020218J068855J127838J233078J237656J133133J099922J119446J085564
2972H1192635J009727R52126Q88702Q55209Q54470Q39088Q28987P91573P31682O62399
2982H9606598N48454N17800N85197N63408M72137M19503L94317L33023K27593J73591
$$ plain form
2992 93841621 94010231 94136642 94172432 94199989 94300293 94429016 94569374 94719551 94870232 95026825
3002 95026825 95196129 95364594 95504066 95665024 95919418 96174576 96331810 96480774 96683212 96923920
3012 96923920 97240326 97536255 97690392 97815414 97991707 98194862 98426079 98688698 99017670 99319099
3022 99319099 99465797 99592278 99820801 100060890 100252983 100426483 100603554 100746300 100818398 100836945
3032 100836945 100766922 100728180 100870224 101069069 101262260 101414345 101442078 101426270 101408768 101423073 101555229
3043 101555229 101689384 101706169 101702141 101746918 101801682 101847168 101894165 101957153 102005699 101994850 101982262 102016045
3055 102016045 102079842 102191612 102296402 102336029 102337959 102293633 102252701 102273796 102321007 102391266 102444527 102416588
3067 102416588 102376488 102368164 102402588 102547501 102676247 102633904 102572968 102626419 102697662 102730415 102736305 102678772
$$ packed form
2992I3841621J68610J26411L5790K7557J00304J28723J40358J50177J50681J56593
3002I5026825J69304J68465J39472J60958K54394K55158J57234J48964K02438K40708
3012I6923920L16406K95929J54137J25022J76293K03155K31217K62619L28972L01429
3022I9319099J46698J26481K28523K40089J92093J73500J77071J42746P2098J8547
3032A00836945p0023l8742J42044J98845J93191J52085K7733j5808j7502J4305J32156
3043A01555229J34155J6785m028M4777N4764M5486M6997O2988M8546j0849j2588L3783
3055A02016045O3797J11770J04790L9627J930m4326m0932K1095M7211P0259N3261k7939
3067A02416588m0100q324L4424J44913J28746m2343o0936N3451P1243L2753N890n7533
$$ plain form
3079 102678772 102645782 102771904 102880669 102758530 102651146 102812317 103003838 103041313 103016785 102954124 102873230
3090 102873230 102788925 102740242 102802040 102881477 102889420 102889511 102924683 102967667 103015472 103038116 102989319 102914719 102834679
3103 102834679 102778694 102803543 102847549 102856590 102864647 102901749 102925491 102886292 102835754 102818130 102805801 102778770
3115 102778770 102758072 102764656 102778603 102786491 102789619 102772903 102771973 102837418 102908943 102931831 102939774 102944542 102957153
3128 102957153 103002426 103050545 103073761 103090500 103113388 103131699 103142456 103134987 103090904 103030396 102953049 102902031
3140 102902031 102952721 103007675 102975609 102913162 102834152 102775742 102800919 102845741 102867439 102865364 102796913 102745102
3152 102745102 102832840 102897789 102755592 102595116 102574493 102601532 102649567 102680016 102625298 102545639 102474998
3163 102474998 102424332 102422020 102449631 102513718 102567413 102543854 102509262 102522636 102538704 102525162 102501801 102482292
$$ packed form
3079A02678772l2990J26122J08765j22139j07384J61171J91521L7475k4528o2661q0894
3090A02873230q4305m8683O1798P9437P943R1L5172M2984M7805K2644m8797p4600q0040
3103A02834679n5985K4849M4006R041Q057L7102K3742l9199n0538j7624j2329k7031
3115A02778770k0698O584J3947P888L128j6716r30O5445P1525K2888P943M768J2611
3128A02957153M5273M8119K3216J6739K2888J8311J0757p469m4083o0508p7347n1018
3140A02902031N0690N4954l2066o2447p9010n8410K5177M4822K1698k075o8451n1811
3152A02745102Q7738O4949j42197j60476k0623K7039M8035L0449n4718p9659p0641
3163A02474998n0666k312K7611O4087N3695k3559l4592J3374J6068j3542k3361j9509
$$ plain form
3175 102482292 102452660 102394440 102334595 102293846 102272179 102283218 102306412 102335266 102341270 102274513 102192566 102139900
3187 102139900 102105835 102109840 102105904 102027847 101955536 101961205 102001312 102070526 102126266 102108047 102064301 102019714
3199 102019714 101984695 102008034 101999191 101828339 101661942 101648621 101712013 101861069 101988243 101951431 101863029
3210 101863029 101807045 101726173 101564285 101401497 101300285 101257133 101316666 101396606 101421951 101415344 101363419
3221 101363419 101298973 101249268 101217247 101231766 101242065 101187851 101126266 101102806 101091858 101081757 101076126 101066376
3233 101066376 101077248 101170135 101226257 101104858 100933006 100771782 100678230 100780632 100925949 100981140 101014473
3244 101014473 101090073 101087097 100825188 100546669 100480362 100486137 100500298 100522018 100541664 100521873 100379944 100242233
3256 100242233 100242661 100275658 100271347 100256279 100240158 100203705 100111961 100021294 99988510 99977158 99983406 99966003 99850227
$$ packed form
3175A02482292k9632n8220n9845m0749k1667J1039K3194K8854O004o6757q1947n2666
3187A02139900l4065M005l936p8057p2311N669M0107O9214N5740j8219m3746m4587
3199A02019714l5019K3339q843j70852j66397j3321O3392J49056J27174l6812q8402
3210A01863029n5984q0872j61888j62788j01212m3152N9533P9940K5345o607n1925
3221A01363419o4446m9705l2021J4519J0299n4214o1585k3460j0948j0101n631r750
3233A01066376J0872R2887N6122j21399j71852j61224r3552J02402J45317N5191L3333
3244A01014473P5600k976k61909k78519o6307N775J4161K1720J9646j9791j41929j37711
3256A00242233M28L2997m311j5068j6121l6453r1744r0667l2784j1352O248j7403j15776
$$ plain form
3269 99850227 99732567 99707436 99706268 99693344 99664474 99591759 99510551 99449562 99400803 99360893 99344490 99381348
3281 99381348 99422668 99437042 99401787 99255730 99082878 98936935 98847435 98907135 98979996 98927780 98849533
3292 98849533 98806503 98773453 98746399 98722717 98691818 98673676 98697876 98724838 98728653 98697708 98589874 98470665
3304 98470665 98390320 98352478 98412582 98465157 98379776 98286392 98299240 98334793 98353745 98337486 98239067 98104073
3316 98104073 97954346 97814133 97716400 97656723 97668007 97671005 97559547 97447159 97440842 97453758 97437599 97383568
3328 97383568 97242447 97087120 96981476 96903160 96859070 96824959 96774223 96720436 96671936 96617599 96537521
3339 96537521 96466278 96450043 96433876 96381851 96282837 96088501 95874214 95690063 95563484 95575356 95615433
3350 95615433 95591881 95530083 95386482 95276024 95368576 95455673 95328926 95157745 95054390 94981857 94955063
$$ packed form
3269I9850227j17660k5131j168j2924k8870p2715q1208o0989m8759l9910j6403L6858
3281I9381348M1320J4374l5255j46057j72852j45943q9500N9700P2861n2216p8247
3292I8849533m3030l3050k7054k3682l0899j8142K4200K6962L815l0945j07834j19209
3304I8470665q0345l7842O0104N2575q5381r3384J2848L5553J8952j6259r8419j34994
3316I8104073j49727j40213r7733n9677J1284K998j11458j12388o317J2916j6159n4031
3328I7383568j41121j55327j05644p8316m4090l4111n0736n3787m8500n4337q0078
3339I6537521p1243j6235j6167n2025r9014j94336k14287j84151j26579J1872M0077
3350I5615433k3552o1798j43601j10458R2552Q7097j26747j71181j03355p2533k6794
$$ plain form
3361 94955063 94930412 94846466 94771599 94789124 94792725 94668175 94522354 94444206 94373322 94274712 94160866 94015030
3373 94015030 93889954 93858047 93843483 93787170 93710899 93605682 93504692 93445206 93405510 93377090 93357536
3384 93357536 93352417 93329071 93244644 93135307 93024635 92907242 92782188 92659691 92550133 92451927 92360664
3395 92360664 92294907 92287422 92291092 92267349 92223045 92148041 92054512 91939613 91838242 91805740 91777824 91694023
3407 91694023 91598152 91521690 91440895 91331696 91226219 91157822 91098618 91034485 90957214 90841080 90724419
3418 90724419 90646217 90578651 90504501 90430618 90357948 90286758 90214706 90150543 90106773 90069603 90044090 89985870
3430 89985870 89826706 89643265 89487480 89365128 89309692 89289597 89285019 89293816 89320183 89325188 89254593 89158295
3442 89158295 89068626 88983772 88925217 88855270 88725136 88589264 88498352 88414696 88297340 88206573 88208679 88244507
$$ packed form
3361I4955063k4651q3946p4867J7525L601j24550j45821p8148p0884r8610j13846j45836
3373I4015030j25076l1907j4564n6313p6271j05217j00990n9486l9696k8420j9554
3384I3357536n119k3346q4427j09337j10672j17393j25054j22497j09558r8206r1263
3395I2360664o5757p485L670k3743m4304p5004r3529j14899j01371l2502k7916q3801
3407I1694023r5871p6462q0795j09199j05477o8397n9204o4133p7271j16134j16661
3418I0724419p8202o7566p4150p3883p2670p1190p2052o4163m3770l7170k5513n8220
3430H9985870j59164j83441j55785j22352n5436k0095m578Q797K6367N005p0595r6298
3442H9158295q9669q4854n8555o9947j30134j35872r0912q3656j17356r0767K106L5828
$$ plain form
3454 88244507 88282104 88305923 88279533 88233421 88195755 88136795 88005615 87893845 87904884 87952400 87990593 88001183
3466 88001183 87924004 87838745 87828041 87822533 87764717 87701706 87670731 87643860 87603714 87555481 87486412 87432953
3478 87432953 87433884 87469360 87553978 87622955 87592438 87534096 87488533 87465118 87498001 87553192 87616348 87662552
3490 87662552 87642525 87614799 87636017 87662529 87652542 87656807 87732101 87818336 87867424 87900017 87909271 87929222 88016747
3503 88016747 88096428 88088631 88062790 88052460 88085579 88230255 88399384 88530518 88617584 88617180 88578865 88526108
3515 88526108 88493660 88534019 88617393 88727165 88876152 89096001 89313652 89451859 89554741 89631485 89709259
3526 89709259 89850685 89958237 89900589 89841675 89924171 90080383 90317703 90553574 90688133 90780571 90845726
3537 90845726 90916611 91043663 91189316 91344765 91474007 91503838 91536903 91680817 91847229 91978981 92089821
$$ packed form
3454H8244507L7597K3819k6390m6112l7666n8960j31180j11770J1039M7516L8193J0590
3466H8001183p7179q5259j0704n508n7816o3011l0975k6871m0146m8233o9069n3459
3478H7432953R31L5476Q4618O8977l0517n8342m5563k3415L2883N5191O3156M6204
3490H7662552k0027k7726K1218K6512r987M265P5294Q6235M9088L2593R254J9951Q7525
3503H8016747P9681p797k5841j0330L3119J44676J69129J31134Q7066m04l8315n2757
3515H8526108l2448M0359Q3374J09772J48987K19849K17651J38207J02882P6744P7774
3526H9709259J41426J07552n7648n8914Q2496J56212K37320K35871J34559R2438O5155
3537I0845726P0885J27052J45653J55449J29242K9831L3065J43914J66412J31752J10840
$$ plain form
3548 92089821 92162086 92232681 92341110 92461945 92579506 92703964 92851349 92988060 93072037 93144608 93246696
3559 93246696 93337341 93345901 93402031 93686386 93975212 94073341 94075249 93966652 93878365 93982864 94140884
3570 94140884 94255447 94371864 94538376 94649170 94556068 94434380 94424530 94482780 94635796 94812653 94930984
3581 94930984 95051720 95228485 95400764 95516296 95603851 95678139 95728973 95725609 95744370 95870468 96046326
3592 96046326 96256615 96459534 96598862 96702194 96765564 96827126 96933342 97055267 97182701 97305725
3602 97305725 97391891 97498466 97697685 97912025 98078133 98225525 98347183 98489288 98729324 98966194
3612 98966194 99108246 99204445 99261543 99314377 99410484 99518463 99622368 99723412 99797180 99904419 100137642
3623 100137642 100376823 100494980 100605202 100839592 101013756 100899910 100760178 100833725 100961304 101053383
$$ packed form
3548I2089821P2265P0595J08429J20835J17561J24458J47385J36711Q3977P2571J02088
3559I3246696R0645Q560N6130K84355K88826R8129J908j08597q8287J04499J58020
3570I4140884J14563J16417J66512J10794r3102j21688r850N8250J53016J76857J18331
3581I4930984J20736J76765J72279J15532Q7555P4288N0834l364J8761J26098J75858
3592I6046326K10289K02919J39328J03332O3370O1562J06216J21925J27434J23024
3602I7305725Q6166J06575J99219K14340J66108J47392J21658J42105K40036K36870
3612I8966194J42052R6199N7098N2834R6107J07979J03905J01044P3768J07239K33223
3623A00137642K39181J18157J10222K34390J74164j13846j39732P3547J27579R2079
$$ plain form
3633 101053383 101139664 101218651 101294205 101357460 101444984 101580284 101793411 102191925 102566406 102702095 102722458
3644 102722458 102657082 102572754 102553154 102577087 102679657 102775406 102762726 102724960 102700256 102722458 102884743
3655 102884743 103046844 103060196 103042725 103075722 103120377 103158066 103209427 103276917 103396271 103644035 103899910
3666 103899910 104056931 104151367 104195473 104154251 103937172 103722809 103715202 103747223 103685974 103632500 103673294
3677 103673294 103719093 103671577 103644112 103754494 103891060 103979492 104025391 103987625 103932068 103923943 103923866 103909447
3689 103909447 103894928 103864693 103885941 104068085 104268578 104376511 104406067 104300858 104161743 104069229 104027702
3700 104027702 104079315 104191162 104371452 104538704 104600403 104597618 104526688 104429199 104351997 104275421 104181549
3711 104181549 104111671 104097298 104149483 104329872 104518272 104602745 104619911 104558113 104450249 104306152 104183365
$$ packed form
3633A01053383Q6281P8987P5554O3255Q7524J35300K13127L98514L74481J35689K0363
3644A02722458o5376q4328j9600K3933J02570R5749j2680l7766k4704K2202J62285
3655A02884743J62101J3352j7471L2997M4655L7689N1361O7490J19354K47764K55875
3666A03899910J57021R4436M4106m1222k17079k14363p607L2021o1249n3474M0794
3677A03673294M5799m7516k7465J10382J36566Q8432M5899l7766n5557q125p7j4419
3689A03909447j4519l0235K1248J82144K00493J07933K9556j05209j39115r2514m1527
3700A04027702N1613J11847J80290J67252O1699k785p0930r7489p7202p6576r3872
3711A04181549o9878j4373N2185J80389J88400Q4473J7166o1798j07864j44097j22787
$$ plain form
3722 104183365 104137161 104183891 104431793 104660461 104589462 104506851 104694077 104890274 104887032 104808334 104697990
3733 104697990 104587936 104517151 104508064 104611084 104781029 105046700 105236267 105082657 104900146 105017113
3743 105017113 105123901 104946396 104706001 104542923 104426483 104392029 104381393 104329300 104292442 104313614 104369064
3754 104369064 104471924 104554276 104507805 104466560 104574326 104693436 104712967 104696320 104680656 104633781 104514458
3765 104514458 104386757 104322769 104257271 104106995 103998184 104073692 104200150 104297684 104348495 104274895 104176453
3776 104176453 104133728 104125809 104167343 104232048 104308609 104366562 104362366 104324028 104240608 104185341 104267593 104367950
3788 104367950 104383133 104374023 104347321 104362251 104499100 104701111 105030037 105210403 104813812 104360649 104326538
3799 104326538 104417252 104519867 104565903 104375076 104169609 104159210 104201035 104197983 104222397 104355499 104473450
$$ packed form
3722A04183365m6204M6730K47902K28668p0999q2611J87226J96197l242p8698j10344
3733A04697990j10054p0785r087J03020J69945K65671J89567j53610j82511J16967
3743A05017113J06788j77505k40395j63078j16440l4454j0636n2093l6858K1172N5450
3754A04369064J02860Q2352m6471m1245J07766J19110J9531j6647j5664m6875j19323
3765A04514458j27701o3988o5498j50276j08811P5508J26458R7534N0811p3600r8442
3776A04176453m2725p919M1534O4705P6561N7953m196l8338q3420n5267Q2252J00357
3788A04367950J5183r110k6702J4930J36849K02011L28926J80366l96591m53163l4111
3799A04326538R0714J02615M6036j90827k05467j0399M1825l052K4414J33102J17951
$$ plain form
3810 104473450 104428246 104373505 104438423 104548241 104700325 104807259 104732635 104620407 104602005 104578377 104465553
3821 104465553 104349472 104282738 104280998 104424240 104571915 104582336 104538704 104449989 104396965 104511429 104649284
3832 104649284 104700211 104694298 104603554 104491684 104424286 104367661 104293991 104251076 104304764 104372879 104365135 104371620
3844 104371620 104463127 104607224 104880783 105026459 104664825 104238701 104127525 104141953 104237679 104358887
3854 104358887 104440643 104465958 104335716 104231354 104367828 104545425 104620270 104639793 104574181 104511353 104573753
3865 104573753 104627754 104559395 104432037 104234955 104076385 104077888 104188370 104460953 104704262 104688194 104581833
3876 104581833 104449127 104375076 104556824 104721619 104591919 104378937 104186867 104059196 104142593 104231575
3886 104231575 104110458 103956413 103881073 103865311 103958557 104066612 104072784 104093620 104229805 104411934 104670525
$$ packed form
3810A04473450m5204n4741O4918J09818J52084J06934p4624j12228j8402k3628j12824
3821A04465553j16081o6734j740J43242J47675J0421m3632q8715n3024J14464J37855
3832A04649284N0927n913r0744j11870o7398n6625p3670m2915N3688O8115p744O485
3844A04371620R1507J44097K73559J45676l61634m26124j11176J4428R5726J21208
3854A04358887Q1756K5315j30242j04362J36474J77597P4845J9523o5612o2828O2400
3865A04573753N4001o8359j27358j97082j58570J503J10482K72583K43309j6068j06361
3876A04581833j32706p4051J81748J64795j29700k12982j92070j27671Q3397Q8982
3886A04231575j21117j54045p5340j5762R3246J08055O172K0836J36185J82129K58591
$$ plain form
3897 104670525 104806229 104521538 104141167 103912949 103770020 103774788 103787186 103633072 103476837 103427269 103477005
3908 103477005 103717850 103960732 104001907 103976891 103959702 103931023 103888084 103855255 103877548 103890205 103830551
3919 103830551 103737282 103587746 103502945 103680397 103867867 103828720 103713516 103579689 103469658 103472755 103505325
3930 103505325 103508881 103497169 103448296 103410461 103434372 103490280 103585144 103659348 103644897 103573753 103415512 103288986
3942 103288986 103342796 103456787 103576424 103653427 103596451 103479836 103342987 103199318 103068588 102970932 102939674
3953 102939674 102954796 103018784 103097031 103148842 103194664 103253532 103288719 103265259 103196884 103065300 102931259
3964 102931259 102851700 102819801 102858498 102935196 103032448 103127647 103183342 103226402 103289726 103317642 103244186 103132820
3976 103132820 103011703 102920677 102933838 102976517 103003403 103000237 102917336 102815559 102743126 102687904 102658913 102640678
$$ packed form
3897A04670525J35704k84691l80371k28218j42929M768J2398j54114j56235m9568M9736
3908A03477005K40845K42882M1175k5016j7189k8679m2939l2829K2293J2657n9654
3919A03830551r3269j49536q4801J77452J87470l9147j15204j33827j10031L097L2570
3930A03505325L556j1712m8873l7835K3911N5908R4864P4204j4451p1144j58241j26526
3942A03288986N3810J13991J19637P7003n6976j16615j36849j43669j30730r7656l1258
3953A02939674J5122O3988P8247N1811M5822N8868L5187k3460o8375j31584j34041
3964A02931259p9559l1899L8697P6698R7252R5199N5695M3060O3324K7916p3456j11366
3976A03132820j21117r1026J3161M2679K6886l166q2901j01777p2433n5222k8991j8235
$$ plain form
3988 102640678 102610275 102599045 102651169 102705002 102676369 102676796 102864929 103015091 102888367 102682999 102497604
3999 102497604 102391693
4000 102391693
$$ packed form
3988A02640678l0403j1230N2124N3833k8633M27J88133J50162j26724k05368j85395
3999A02497604j05911
4000A02391693
##END=$$ End of the data block
