##TITLE=$$ Begin of the data block
##JCAMP-DX=5.00 $$ ACD/SpecManager v 10.08
##SPECTROMETER/DATA SYSTEM=16PC
##DATE=Thu Sep 05 14:17:37 2013
##DATA TYPE=INFRARED SPECTRUM
##DATA CLASS=XYDATA
##ORIGIN=
##OWNER=
##NPOINTS=3401
##FIRSTX=600.00000000
##LASTX=4000.00000000
##MAXX=4000.00000000
##MINX=600.00000000
##MAXY=107.23088074
##MINY=57.83066559
##XFACTOR=1.0000000000
##YFACTOR=0.000001000000000
##FIRSTY=102.12538147
##DELTAX=1.00000000
##XUNITS=1/CM
##YUNITS=TRANSMITTANCE
##XYDATA=(X++(Y..Y))
600A02125381j39160K60J72302J51848j84105j18614L70102M77737L43086K15027P752
611A03421616j84678n93666l87901O29807Q39042M19945K72202K25189O1416l00766
621A04402206l17337K1744J32256J96792O9092m31160m36569j6853K39227N46532O34094
632A05040024O38557K84241p44698r09546l71116k4964N71534N43449k18384m02359
642A04406738k74490q2542M80865M33922l17452m15374N8631P2571l25248k96166J34277
653A03875732K29500Q9432N0781M9164N226j12633r8945O2202J01403J953R9807M82743
665A04836365M63272J47461k01630r26231r20792j36474J25717Q9386J60835K96760
675A03934669K63978M982j7289K04041J78223q6098j32843r178J7135L3242m1680l14781
$$ y = [102125381, 101986221, 101986481, 102158783, 102310631, 102126526, 102007912, 102378014, 102855751, 103198837, 103413864, 103421616, 103236938, 102643272, 102255371, 102885178, 103724220, 104144165, 104416367, 104641556, 104702972, 104402206, 104084869, 104106613, 104238869, 104435661, 104504753, 104073593, 103637024, 103620171, 103859398, 104405930, 105040024, 105678581, 105962822, 105218124, 104308578, 103937462, 103912498, 104484032, 105027481, 104809097, 104406738, 104132248, 104049706, 104530571, 104964493, 104647041, 104231667, 104290298, 104362869, 104037621, 103741455, 103875732, 104105232, 104194664, 104245445, 104294609, 104299835, 104187202, 104088257, 104150459, 104251862, 104253815, 104353622, 104836365, 105299637, 105447098, 105245468, 104319237, 103398445, 103261971, 103387688, 103477074, 103637909, 103934669, 104198647, 104203629, 104186340, 104390381, 104568604, 104482506, 104349663, 104340485, 104357620, 104390862, 104349182, 104034401]
687A04034401k76566J08452J88545M4205N028J2520k9160k18628o5834O22994N82695
698A05008652k41997l65044O4423J56639J00426L0060j08674k33123m77837l87619
708A03545906J16249K63695K00439J13297q6784k30744m18953m19067k51625o7047
718A02765366L03604L34976K7138r4963j75003j63407R224J5617j53877j33728M3465
729A02778412J42311K53654K49482J12602L9749n9273k0477K21962K40539M5945K2865
740A04027771J52016J25602p1434p1167J07956J71540K14195J51611p6599j44913o6185
751A04520393j14586l95843k12837O10588O72462M5037j58905j55472j93238k90016
761A04327583j26144M64722M97367j1489j43815p7323j9265J44341J64581L9841K5413
$$ y = [104034401, 103757835, 103866287, 104054832, 104099037, 104104065, 104116585, 104087425, 103868797, 103802963, 104425957, 105008652, 104766655, 104401611, 104466034, 104622673, 104723099, 104753159, 104644485, 104411362, 103933525, 103545906, 103662155, 103925850, 104126289, 104239586, 104152802, 103922058, 103503105, 103084038, 102832413, 102765366, 103068970, 103403946, 103431084, 103336121, 103161118, 102997711, 103006935, 103022552, 102868675, 102734947, 102778412, 102920723, 103174377, 103423859, 103536461, 103576210, 103516937, 103496460, 103718422, 103958961, 104004906, 104027771, 104179787, 104305389, 104233955, 104162788, 104270744, 104442284, 104656479, 104808090, 104731491, 104586578, 104520393, 104405807, 104009964, 103797127, 104407715, 105080177, 105125214, 104966309, 104810837, 104617599, 104327583, 104201439, 104666161, 105163528, 105152039, 105008224, 104930901, 104911636, 105055977, 105220558, 105260399, 105285812]
772A05285812Q2085J11176J87728J10222j57470k69349l12278k84882j62674m5326
782A04545044J37306K04132K04682J21765j10985k11121k56538k18369n9577M2747
792A04399086K21916J21666l46016m73167l72124l01834j09360j47629m69116n11192
802A02012230m17137j76666M82177M61144l11661m50493k04300L6980N90042N78072
812A02600388J4900k78145n99022n77454k00653J09940O76918O30951q5022l73459
822A01919342n37613m62318O1035Q2664l57704m69322l82660l66882l61298l39699
832I8785545k89772k87323l46039l35571k87918k05704l0761O607p9804j15249j46004
843I6668007j61820j88987j32706L5881J06285J54213Q7189j88996k05207o081J17729
$$ y = [105285812, 105367897, 105479073, 105666801, 105777023, 105619553, 105350204, 105037926, 104753044, 104590370, 104545044, 104682350, 104886482, 105091164, 105212929, 105101944, 104890823, 104634285, 104415916, 104356339, 104399086, 104621002, 104742668, 104396652, 103923485, 103551361, 103249527, 103140167, 102992538, 102523422, 102012230, 101595093, 101418427, 101900604, 102361748, 102050087, 101599594, 101395294, 101432274, 102022316, 102600388, 102615288, 102337143, 101738121, 101160667, 100960014, 101069954, 101746872, 102377823, 102292801, 101919342, 101381729, 100919411, 100980446, 101063110, 100705406, 100236084, 99853424, 99486542, 99125244, 98785545, 98495773, 98208450, 97862411, 97526840, 97238922, 97033218, 97002457, 97009064, 96929260, 96814011, 96668007, 96506187, 96317200, 96184494, 96220375, 96326660, 96480873, 96568062, 96379066, 96173859, 96167778, 96285507]
854I6285507L17192K79122q3374j09818K12311J72424k22969k89436j19141k7870R4818
865I6508766J22643L7666L7842Q0368J38405K77351K62093P9918J6716M4006j0178
876I7595596j70326j66870J4473M7012k8679m8301o6017k9831O2446J50131L21122
887I7680756K84553k9350n0949J70547K61994L45352L05816O2256N3902L01651K82524
898I9669052L2639o9786j36162r9205J37047J21254j10886k50748m34059m26514k00218
909I8232414j01143l1921l6263j13777k22419m69445m68086k20230j05263R018k6802
920I6446083k67837l44185l09868l18909l75389l09036q6029j2085j4115p8865k91114
931I4038651l25104k05948j59355j06552j37162k93136l17124k09205k26593l67577
$$ y = [96285507, 96602699, 96881821, 96798447, 96688629, 96900940, 97073364, 96850395, 96560959, 96441818, 96413948, 96508766, 96631409, 96669075, 96706917, 96787285, 96925690, 97203041, 97465134, 97545052, 97561768, 97605774, 97595596, 97425270, 97258400, 97272873, 97319885, 97291206, 97242905, 97176888, 97147057, 97209503, 97359634, 97680756, 97965309, 97935959, 97885010, 98055557, 98317551, 98662903, 98968719, 99030975, 99084877, 99386528, 99669052, 99701691, 99631905, 99495743, 99396538, 99533585, 99654839, 99543953, 99293205, 98859146, 98432632, 98232414, 98131271, 98099350, 98063087, 97949310, 97726891, 97257446, 96789360, 96569130, 96463867, 96472885, 96446083, 96178246, 95834061, 95524193, 95205284, 94829895, 94520859, 94434830, 94422745, 94408630, 94329765, 94038651, 93713547, 93507599, 93348244, 93241692, 93104530, 92811394, 92494270, 92285065, 92058472, 91690895]
941I1690895l81966l15765k35268o1393m4228k03827k10068j39450j6235K32529L39218
952I0654442L53485L44109K08778K87918O41205O89430M71809M10485M20906M19113
962I4901680M44412M23477L81928K90535Q4045N2735K06016K15798J27410Q7258O6399
973I7281693L3973L1716p6775l73932l93585j30745p1693j54213j40976n6198m0619
984I5908646q6525q4450k6177n4145j72974k21802k57942k12982q0704M5418K57660
995I5014023K80311R4796N1094Q3847J04286J59790J49246P0694L2852J0971m867K1980
1007I6069023m5174k53326k78206j17874j04668j99554k26669k20436k19254k04750
1017I4199112k12128j92474l06488o19644p09420o30111n86968n31196m52965l17741
$$ y = [91690895, 91308929, 90993164, 90757896, 90696503, 90652275, 90448448, 90238380, 90098930, 90082695, 90315224, 90654442, 91007927, 91352036, 91560814, 91848732, 92489937, 93179367, 93651176, 94061661, 94482567, 94901680, 95346092, 95769569, 96151497, 96442032, 96526077, 96578812, 96784828, 97000626, 97128036, 97215294, 97281693, 97315666, 97347382, 97270607, 96896675, 96503090, 96372345, 96300652, 96146439, 96005463, 95949265, 95908646, 95822121, 95737671, 95711494, 95657349, 95484375, 95262573, 95004631, 94791649, 94710945, 94756363, 95014023, 95294334, 95389130, 95440224, 95524071, 95628357, 95788147, 95937393, 96008087, 96040939, 96051910, 96047043, 96069023, 96023849, 95770523, 95492317, 95374443, 95269775, 95070221, 94843552, 94623116, 94403862, 94199112, 93986984, 93794510, 93488022, 92868378, 92158958, 91528847, 90941879, 90410683, 89957718, 89639977]
1027H9639977k73568k99926l31162l95393m45801n20653n13939m48540l39218j19491
1037H5952286m0917p2052q7211j13556j68472l33954k64809R3201J77574O6948R102
1048H5218140p9483j12557q0711j08002j71707k38777l20267m04976n17105n71350
1058H2613205n80093n79094n49919n30526n24093m80080l58650l69713n19020n73944
1068G7548073n85434n82672n46746n24208n01083m86855m74731m82468m85778n64171
1078G2313927p67968q16467p16736p21191q26996p93320o19934n48599n03662n46219
1088F5452835p43652p65438o56510n67890m16492l83759m69067m93644n15534m81674
1098E9959175l90411l01575j53641j33133k49527k78686k86698k33341r5131o366R6347
$$ y = [89639977, 89366409, 89066483, 88735321, 88339928, 87894127, 87373474, 86859535, 86410995, 86071777, 85952286, 85911369, 85839317, 85752106, 85638550, 85470078, 85136124, 84871315, 84964516, 85142090, 85209038, 85218140, 85138657, 85026100, 84945389, 84837387, 84665680, 84426903, 84106636, 83701660, 83184555, 82613205, 82033112, 81454018, 80904099, 80373573, 79849480, 79369400, 79010750, 78641037, 78122017, 77548073, 76962639, 76379967, 75833221, 75309013, 74807930, 74321075, 73846344, 73363876, 72878098, 72313927, 71545959, 70729492, 70012756, 69291565, 68464569, 67671249, 67051315, 66502716, 65999054, 65452835, 64709183, 63943745, 63287235, 62719345, 62302853, 61919094, 61450027, 60956383, 60440849, 59959175, 59568764, 59267189, 59113548, 58980415, 58730888, 58452202, 58165504, 57932163, 57837032, 57830666, 57927013]
1109E7927013R3556n4314o9664L861O3156J78100J72234K6558o676J8669O5422J88401
1121E8606316K05181J01566J16707K42782K71584K50385J98101M8783M7134K24949
1131F0313488K10094m53k2816J25049J30940R941J3592J12938J72092K39418K57256
1142F1561539J96598K30789L31497M38427N97954O84547O97373P65228Q49228R75868
1152F7329048J182533J293091J355286J354263J225426J241852J406624J434204J371315
1161G9193642J316353J270103J131012Q53561P21100O90384O50650O72913N83549L56529
1171H7439796K69509K57950L02101M90806M88137L00552K38060K10976K67936N13291
1181I0779114M80743J46942P1381J70280K19132K79068L29849L86215M09485M22356
$$ y = [57927013, 58020569, 57966255, 57896591, 57900452, 57963608, 58141708, 58313942, 58340500, 58333824, 58352493, 58417915, 58606316, 58811497, 58913063, 59029770, 59272552, 59544136, 59794521, 59992622, 60041405, 60088539, 60313488, 60523582, 60523129, 60500313, 60625362, 60756302, 60766243, 60779835, 60892773, 61064865, 61304283, 61561539, 61758137, 61988926, 62320423, 62758850, 63356804, 64041351, 64738724, 65503952, 66353180, 67329048, 68511581, 69804672, 71159958, 72514221, 73739647, 74981499, 76388123, 77822327, 79193642, 80509995, 81780098, 82911110, 83764671, 84485771, 85176155, 85826805, 86499718, 87083267, 87439796, 87709305, 87967255, 88269356, 88760162, 89248299, 89548851, 89786911, 89997887, 90265823, 90779114, 91259857, 91406799, 91478180, 91648460, 91867592, 92146660, 92476509, 92862724, 93272209, 93694565]
1191I3694565L72558K39129J58027M3579J02425M06792M60838L18436K59971K33101
1201I6289421J66535M7966k167J0803j2474p1404o9191J0231N677q7166q9890j2916
1213I6185425P103n272j1826k7107l1395q064m3701j56639j87066j67366j28082J7403
1225I5443413m6990l66806m43840l33526l12661k92877l51021n34774n76638m90333
1235I1693947m88472n35751n60898o26801n53490k93495k16652k79281k86438k93183
1245H7559486k74376k35054j80366j13724j6571J27457K34367L24799M00070M63081
1255H8289169N00794M99801N26810N71533O08208O99638O20270L33908K10709J80458
1265I3041298J53732J72043J58600J38618Q7876O71p6057j67893k19726k18369k71705
$$ y = [93694565, 94067123, 94306252, 94464279, 94507858, 94610283, 95017075, 95477913, 95796349, 96056320, 96289421, 96455956, 96503922, 96501755, 96512558, 96500084, 96428680, 96359489, 96369720, 96375397, 96288231, 96198341, 96185425, 96192528, 96187256, 96175430, 96148323, 96116928, 96108864, 96065163, 95908524, 95721458, 95554092, 95426010, 95443413, 95396423, 95029617, 94585777, 94252251, 93939590, 93646713, 93295692, 92760918, 92184280, 91693947, 91205475, 90669724, 90108826, 89482025, 88928535, 88635040, 88418388, 88139107, 87852669, 87559486, 87285110, 87050056, 86869690, 86755966, 86739395, 86866852, 87101219, 87426018, 87826088, 88289169, 88789963, 89289764, 89816574, 90388107, 90996315, 91695953, 92316223, 92650131, 92860840, 93041298, 93195030, 93367073, 93525673, 93664291, 93752167, 93752838, 93676781, 93508888, 93289162, 93070793, 92799088]
1276I2799088m17656l96828k00058j23428r6512j05240j94496j99150j25031j14151
1286I0826538j54594j52253j03233j17279k03445k15813j90094j29746L602N9669N5077
1297H9678429P3623R4559J16798J41716J64635J49719K44858M85733N81642O05683
1307I2337395N56083L50571L19862M59412M56406L63632K82455J83182Q3061l5713
1317I5356346j19087j89308k11670j86867j47110p0785j2398J9386J13724K90512L80897
1328I5223640M44130M11721K49962J62170J03851M9713J7525l8574q7288k08260l82759
1339I5945831o06201r42276j140999j297973j281029j067375q80432o70334m13132
1348H7646080n7510J67251K85889M28490N83191O67167P14279O71578M87877M20807
$$ y = [92799088, 92381432, 91984604, 91784546, 91661118, 91564606, 91459366, 91264870, 91065720, 90940689, 90826538, 90671944, 90519691, 90416458, 90299179, 90095734, 89879921, 89689827, 89560081, 89563683, 89623352, 89678429, 89752052, 89846611, 89963409, 90105125, 90269760, 90419479, 90664337, 91150070, 91731712, 92337395, 92893478, 93244049, 93563911, 94023323, 94479729, 94843361, 95125816, 95308998, 95392059, 95356346, 95237259, 95047951, 94836281, 94649414, 94502304, 94431519, 94419121, 94438507, 94552231, 94842743, 95223640, 95667770, 96079491, 96329453, 96491623, 96595474, 96645187, 96662712, 96624138, 96536850, 96328590, 95945831, 95339630, 94397354, 93256355, 91958382, 90677353, 89609978, 88729546, 88059212, 87646080, 87588570, 87755821, 88041710, 88470200, 89053391, 89720558, 90434837, 91106415, 91594292, 92015099]
1358I2015099M31991M17160L91701L98300M69612M32396K69249K22847K74208K56439
1368I5579002J85585J64109J83029J75476J73378J15753m7996n4596Q2443J53763K29141
1379I6939087K38586J49277J62476K74444K98622K61422K43599K29881K00317J56662
1389I9154373J11557K4300M4868J95786K36923K02461J95435K26662J49612q9867j28746
1400A00323364M555O0326J00654J26503J54358J17157l1158l9269J01448J04973M219
1411A01027130m6585j02829r7519m7989M7829L05580K60399j41098k20680o5209n722
1422A00913307Q1658L2188k16598k50435o1158r5817l27278m17237m49585m27009k62688
1433I8519348l01262n38421o46881p53785o77795l56102k21420j56929j97556m33372
$$ y = [92015099, 92447090, 92864250, 93255951, 93654251, 94123863, 94556259, 94825508, 95048355, 95322563, 95579002, 95764587, 95928696, 96111725, 96287201, 96460579, 96576332, 96528336, 96473740, 96556183, 96709946, 96939087, 97177673, 97326950, 97489426, 97763870, 98062492, 98323914, 98567513, 98797394, 98997711, 99154373, 99265930, 99290230, 99335098, 99530884, 99767807, 99970268, 100165703, 100392365, 100541977, 100452110, 100323364, 100327919, 100388245, 100488899, 100615402, 100769760, 100886917, 100855759, 100816490, 100917938, 101022911, 101027130, 100980545, 100877716, 100780197, 100732208, 100780037, 101085617, 101346016, 101204918, 100984238, 100919029, 100913307, 100994965, 101027153, 100810555, 100560120, 100498962, 100403145, 100075867, 99658630, 99209045, 98782036, 98519348, 98218086, 97679665, 97032784, 96278999, 95601204, 95245102, 95023682, 94866753, 94669197, 94235825]
1443I4235825m69445l35762l07281l14636l60398m91234n18013m59076m30343m78821
1453I0070816l00812K39395K94953j28250k07108m9736m6921k05780j07170L38822
1463H9898209L53332j05072r1858K80831N16868P32063R58970J332901J280044P17285
1473I5873573N50843O68426O12663M52614L69118L15956K97142L55339L15834J67801
1483I9979309J29173J60859K01347K62497L58055N39093N87387N16296M90334M81941
1493A03706291M36707L79562K65244K9083k5223P6248J33774K10243K53533K99858
1503A05765320K56370J07621Q064j30158j10435J52351J20995k55371k36321J41480
1513A05819916K83935L52692K94945J7166n4001O3828J4305k26670k06512J11099J27960
$$ y = [94235825, 93766380, 93430618, 93123337, 92808701, 92448303, 91957069, 91439056, 90979980, 90549637, 90070816, 89770004, 90009399, 90304352, 90176102, 89968994, 89919258, 89872337, 89666557, 89559387, 89898209, 90251541, 90146469, 90054611, 90335442, 90852310, 91584373, 92543343, 93876244, 95156288, 95873573, 96424416, 97092842, 97705505, 98158119, 98527237, 98843193, 99140335, 99495674, 99811508, 99979309, 100108482, 100269341, 100470688, 100733185, 101091240, 101630333, 102217720, 102734016, 103224350, 103706291, 104142998, 104522560, 104787804, 104816887, 104791664, 104867912, 105001686, 105211929, 105465462, 105765320, 106021690, 106129311, 106137375, 106007217, 105896782, 106049133, 106170128, 105914757, 105678436, 105819916, 106103851, 106456543, 106751488, 106768654, 106714653, 106778481, 106792786, 106566116, 106359604, 106470703, 106598663]
1524A06598663j28364j69968q8188n676J69059J92574Q4969R086j16638j28983k7679
1535A06388855K2888N8983R9945J64703J58165J14563q010k92878l64807k88032j80886
1546A05873489M8706J50681J77315J69304J01822L3187j38992o3728L51089L85956
1556A07088829J35185n9158m01108m16565o9595K1912n6511k9274P3669R6222Q7624
1567A06471230O912k57683k18033J69876K41822J04095m242k09595k45590j35498n2856
1578A05870438R4482J11389p744m5372n7792l7598M7684O0440R559l173N081J213j4115
1591A06034492j0704J9883J3374k8587m8630o5781o1493k8747j4145k82j0346o8596
1603A05730438n5000L9268N8815L1563J175o3087q2230o9885n0614M982L769n5626
$$ y = [106598663, 106470299, 106300331, 106212143, 106206467, 106375526, 106568100, 106653069, 106662155, 106545517, 106416534, 106388855, 106411743, 106470726, 106570671, 106735374, 106893539, 107008102, 107000092, 106707214, 106342407, 106054375, 105873489, 105922195, 106072876, 106250191, 106419495, 106521317, 106554504, 106415512, 106351784, 106702873, 107088829, 107224014, 107164856, 106763748, 106347183, 106277588, 106299500, 106242989, 106213715, 106287384, 106383606, 106471230, 106478142, 106220459, 106002426, 106172302, 106414124, 106518219, 106513977, 106304382, 106058792, 105923294, 105870438, 105964920, 106076309, 106068565, 106023193, 105965401, 105927803, 105975487, 106035927, 106045486, 106042313, 106047394, 106048607, 106034492, 106023788, 106043671, 106057045, 106028458, 105979828, 105914047, 105852554, 105823807, 105809662, 105809380, 105799034, 105730438, 105675438, 105714706, 105773521, 105805084, 105806259, 105743172, 105660942, 105591057, 105540443, 105545425, 105549194, 105493568]
1615A05493568p4859q8906n6556O4209O4033m4914j01974j77552j50772J8761M8424
1626A04993462m0551n0712k2965Q896Q4877P8537o94o4369j67733j78360j03996m6303
1638A04490089M3175P2174N2880K8511m2389l7522N2063O8001n03M7782K51244K54891
1650A05280396R5397j9004k10854j98341O0913J15371O508J9623J42716J38168P271
1661A05438164j7906J2107O7139K11243K18010J13815J9295j69495j57570Q1894J46462
1672A05963158J27296O1867j49704j45531P6248J46103J31226J32271J90689L9932
1682A06573555m53377m89471q8265K9831k861M692j6258J8265J14296J63559K41539
1693A06095505J54258k07191k13455K14035J31531n13146n67703j07979J6953j267
$$ y = [105493568, 105418709, 105329803, 105273247, 105337456, 105401489, 105356575, 105254601, 105077049, 104926277, 104945038, 104993462, 104952911, 104902199, 104879234, 104888130, 104973007, 105051544, 105050850, 104986481, 104818748, 104640388, 104536392, 104490089, 104533264, 104605438, 104658318, 104686829, 104644440, 104606918, 104658981, 104726982, 104726479, 104774261, 105025505, 105280396, 105375793, 105356789, 105145935, 104947594, 105008507, 105123878, 105130386, 105150009, 105292725, 105430893, 105438164, 105420258, 105432365, 105499504, 105710747, 105928757, 106042572, 106061867, 105892372, 105734802, 105816696, 105963158, 106090454, 106152321, 106002617, 105857086, 105933334, 106079437, 106210663, 106342934, 106533623, 106573555, 106120178, 105630707, 105542442, 105572273, 105569412, 105574104, 105557846, 105576111, 105690407, 105853966, 106095505, 106249763, 106042572, 105829117, 106043152, 106174683, 105661537, 105093834, 104985855, 105002808, 105001541]
1703A05001541q0368l60298l63922p7721l2974j69586j96839j75933j53061m4754j39023
1714A03207062m59023o24138p15088p89810q22349q58620q56659r38652j133514j203591
1724I4805618j180832j175048j115349j175453j469803j366967r27215n41084J15890
1733H5969757J36284p20268n85289M39811Q92044J089715J222511J161552J232506
1742I0838623J414017J465790J436050J371925J232651J134132J078034R41490O90651
1751A01603363N83534O09253N53154M52133L73154K83669K46498L03650K24121l6843
1761A05195686o9404R7709J69373K48047K18872M4319j0849J0872J4496J1734N0422
1772A05981277J74454J60309j572m9659k7779k2171j526n173m6974l2158N0469O1279
$$ y = [105001541, 104921173, 104560875, 104196953, 104119232, 104086258, 103916672, 103719833, 103543900, 103390839, 103346085, 103207062, 102748039, 102123901, 101408813, 100619003, 99796654, 98938034, 98081375, 97142723, 96009209, 94805618, 93624786, 92449738, 91334389, 90158936, 88689133, 87322166, 86394951, 85853867, 85969757, 86106041, 85385773, 84800484, 85240295, 86132339, 87222054, 88444565, 89606117, 90838623, 92252640, 93718430, 95154480, 96526405, 97759056, 98893188, 99971222, 100912712, 101603363, 102186897, 102796150, 103349304, 103801437, 104174591, 104458260, 104704758, 105008408, 105232529, 105195686, 105126282, 105223991, 105393364, 105641411, 105860283, 105904602, 105893753, 105904625, 105919121, 105930855, 105981277, 106155731, 106316040, 106314468, 106264809, 106237030, 106214859, 106213333, 106208160, 106161186, 106129028, 106179497, 106240776]
1784A06240776J4137p011l9101j8669O6612J03859J36681J03409l8391n7434L1593
1795A06536461N6053N5313M4441J1254j0636m5868k9785P0862N8510r0317q4236O3065
1807A06635117J14944J44913R5604r3346j23138m174O127o5926o8497k7030Q316O7810
1819A06690720Q0558O1058K2149q2589q0444K7184P2929J20834Q2184q4572j24664
1830A06785347o9618m8355l9429K36J02707R6466m5112m4411R4673J09955L3028k90
1842A06975197j5137m7020r9464j22856j53237r6390J05881J26267k9686n7099j0276
1853A06576180K3056Q8737R1080L4828l357o6757n9342L3135N7602L8772L0777L5950
1865A06880661r201j41380j50559n7175J0445J22330J26358J0353k5032j3283k1149
$$ y = [106240776, 106254913, 106247902, 106208801, 106190132, 106256744, 106360603, 106497284, 106600693, 106562302, 106504868, 106536461, 106592514, 106647827, 106692268, 106703522, 106692886, 106647018, 106617233, 106688095, 106746605, 106656288, 106572052, 106635117, 106750061, 106894974, 106990578, 106897232, 106774094, 106769920, 106776047, 106710121, 106641624, 106614594, 106622910, 106690720, 106771278, 106832336, 106854485, 106771896, 106691452, 106718636, 106791565, 106912399, 106994583, 106910011, 106785347, 106715729, 106667374, 106627945, 106628181, 106730888, 106827354, 106782242, 106737831, 106832504, 106942459, 106975487, 106975197, 106960060, 106913040, 106813576, 106690720, 106537483, 106441093, 106546974, 106673241, 106643555, 106586456, 106576180, 106599236, 106687973, 106779053, 106813881, 106810524, 106743767, 106684425, 106717560, 106775162, 106813934, 106844711, 106880661, 106871460, 106730080, 106579521, 106522346, 106532791, 106655121, 106781479, 106791832, 106766800, 106753517, 106732368]
1876A06732368k7206n0514j21361r9922K9922O3591K6223K1484L2616K2888j1208j9073
1888A06599808q774J335K7634K2743j8189k8564j4542j8142l1166m4678q0803o0272
1900A06346390K9236N9150O2584L5599n8968o8878Q415J0331n0576o2179m8828k5338
1912A06236938K5628M9209Q5160K9304j74019j98059o4255j3870J6731J4191m2969
1923A05963989n5908m3556k9442P195O507l2775m5830n2475l8475J6159J7166m0505
1935A05672050m2701p889K3575R9586O8833j15464j14891Q6281Q6357j03859j26266
1946A05525612j6472R537M387k6657j33133j22284J2230N2215K8824L5400O5072N1712
1958A05486443j4328k8473L410K3l8239l1662K2599L3455N386J1490N1475N3124J9806
$$ y = [106732368, 106705162, 106654648, 106533287, 106433365, 106463287, 106526878, 106553101, 106574585, 106607201, 106630089, 106618881, 106599808, 106591034, 106592369, 106620003, 106642746, 106624557, 106595993, 106581451, 106563309, 106532143, 106487465, 106406662, 106346390, 106375626, 106434776, 106497360, 106532959, 106473991, 106405113, 106413528, 106423859, 106373283, 106311104, 106262276, 106236938, 106262566, 106311775, 106396935, 106426239, 106252220, 106054161, 105989906, 105976036, 105992767, 106006958, 105963989, 105908081, 105864525, 105835083, 105842278, 105848785, 105816010, 105770180, 105717705, 105679230, 105695389, 105712555, 105672050, 105629349, 105621460, 105645035, 105744621, 105813454, 105697990, 105583099, 105669380, 105755737, 105651878, 105525612, 105509140, 105518677, 105523064, 105496407, 105363274, 105240990, 105253220, 105305435, 105334259, 105369659, 105434731, 105486443, 105472115, 105443642, 105447052, 105447075, 105408836, 105377174, 105399773, 105433228, 105438614, 105450104, 105501579, 105554703, 105574509]
1971A05574509J0208J3664J3733K4673N913o5704n7129M3915N5122m501k8733n2925
1983A05532745m1870J9310L5668J6426J9294L7903L9818K3224K7489N8387N3147R987
1995A05831528j213O004J5518M8645L5973l6766m3343n813L7475J46271J19736o9886
2007A06084129j10931m7379j5159J8020N8609J41472J20598l1715n8983J3328L0449
2018A06202438K7962J8005j2016k4086k7443k3384M601q538q3969p1975K4436O7399
2030A06093430R9060Q8577K3605j5907o9496n9082M0626N0240j0903m1053q5808o4751
2042A06048538M2649P3814N7030M1412n814k906O2271N9181p797k5894o943j6617o1676
2055A06257248m9568L5644L7621n5069m0535R1484R8038J785m4945j03851q0727O4156
$$ y = [105574509, 105584717, 105598381, 105612114, 105636787, 105642700, 105576996, 105519867, 105563782, 105618904, 105614403, 105585670, 105532745, 105490875, 105510185, 105545853, 105562279, 105581573, 105619476, 105659294, 105682518, 105710007, 105768394, 105821541, 105831528, 105830315, 105836319, 105851837, 105900482, 105936455, 105899689, 105856346, 105850533, 105888008, 106034279, 106154015, 106084129, 105973198, 105925819, 105910660, 105928680, 105987289, 106128761, 106249359, 106217644, 106158661, 106171989, 106202438, 106230400, 106248405, 106236389, 106212303, 106184860, 106161476, 106166077, 106157539, 106073570, 106001595, 106026031, 106093430, 106192490, 106281067, 106304672, 106288765, 106219269, 106160187, 106200813, 106251053, 106240150, 106199097, 106113289, 106048538, 106091187, 106165001, 106222031, 106263443, 106257629, 106254723, 106316994, 106376175, 106368378, 106342484, 106335541, 106318924, 106257248, 106207680, 106243324, 106280945, 106225876, 106185341, 106276825, 106374863, 106376648, 106331703, 106227852, 106147125, 106211281]
2067A06211281P7629k8946m7852m04r369p4859p3746n913N051k9938l1067j3809L723
2080A05981781L3852M5013M6326L2692j1330j8951J0345P347k6420k8084N935j838
2092A06076668n9220n7655l288J9890L2135L6094K8282J9639J312k258J3679N394l9917
2105A06070755k7748M6631O9359O9854M3991l1189n9867o5491n0453Q178K0790M58
2117A06095268j5716n1308m9019J694J144o5918l8772J01783J18042K8206l074j1589
2129A06110741j8837p416k5559r6366p9300L3355P0046O5185N2361M433l647K9182
2141A06134178K3651l242m0245j35926j07406P6439J07979K3147j4351o1844n3863
2152A05948517J6479N6031J15554Q5167q4068q6761P3265J05888O5514K4482n7815
$$ y = [106211281, 106288910, 106259964, 106212112, 106211708, 106202339, 106127480, 106053734, 106047821, 106052872, 106022934, 105991867, 105978058, 105981781, 106015633, 106060646, 106106972, 106139664, 106128334, 106109383, 106119728, 106127075, 106100655, 106072571, 106078506, 106076668, 106017448, 105959793, 105956505, 105976395, 106008530, 106044624, 106072906, 106092545, 106093857, 106091599, 106105278, 106110672, 106070755, 106043007, 106089638, 106158997, 106228851, 106272842, 106241653, 106181786, 106116295, 106065842, 106074020, 106094810, 106095268, 106079552, 106028244, 105979225, 105980919, 105982063, 105916145, 105877373, 105979156, 106097198, 106125404, 106122330, 106110741, 106091904, 106084488, 106058929, 105962563, 105883263, 105916618, 105986664, 106051849, 106104210, 106108643, 106104996, 106134178, 106157829, 106154587, 106114342, 105978416, 105871010, 105947449, 106055428, 106078575, 106064224, 106002380, 105948517, 105964996, 106021027, 106136581, 106221748, 106137680, 106050919, 106124184, 106230072, 106295586, 106320068, 106262253]
2163A06262253r1507j09100p0450O0272R9541P7797N6549O752j7144k5131l1616k9678
2175A06188538l2715n0232l0976M1321N0377p40q339J7662J3016k3293k3193O172K5299
2188A06172897O5018M1145p5813q3923R155L1998P339J5381N4092N1072J0421j1947
2200A06286835m0200l3592K7825K3269n0903n9601j8791k3K6085J3351m5990p4699
2212A06053566j08147q2184K7329N9532L4142L3065L8552L9390L8880L4767J1612L3188
2224A06213692J38946J07262q0155j28837q7433n5908J0277L2760J5999K0195L9909
2235A06226707L6355J4213o767l7865n3810o5903n4550j0368R323J2848K3887M8996
2247A06143066L8292j4518l4623l1372m2465p8056o0105K1195M8233L1113M6730J06002
$$ y = [106262253, 106170746, 106061646, 105991196, 106051468, 106151009, 106228806, 106285355, 106292107, 106274963, 106249832, 106218216, 106188538, 106155823, 106105591, 106074615, 106115936, 106166313, 106165573, 106157234, 106174896, 106187912, 106164619, 106141426, 106147598, 106172897, 106237915, 106279060, 106203247, 106119324, 106128479, 106160477, 106167816, 106183197, 106237289, 106288361, 106298782, 106286835, 106246635, 106213043, 106240868, 106264137, 106213234, 106153633, 106134842, 106134819, 106160904, 106174255, 106128265, 106053566, 105945419, 105863235, 105890564, 105950096, 105984238, 106017303, 106055855, 106095245, 106134125, 106168892, 106180504, 106213692, 106352638, 106459900, 106379745, 106250908, 106163475, 106107567, 106117844, 106150604, 106166603, 106186798, 106226707, 106263062, 106277275, 106270508, 106232643, 106178833, 106112930, 106058380, 106048012, 106057335, 106070183, 106094070, 106143066, 106181358, 106166840, 106132217, 106100845, 106058380, 105980324, 105920219, 105941414, 105989647, 106020760, 106067490, 106173492]
2259A06173492Q8097l723o1844j49513j21430N5817J03165P0503L7140n1377n6625
2270A06083702K4223M1275R583J8692P8224N9937l6003q2344j25885j06789o180M0390
2282A05998825Q3374N6412r3887q7739Q0224J08772M0054O622m0336l8361J2467M9759
2294A06176186J21521R8106m8630p6675j3497Q751K7848K4818k0676q293O0799R0668
2306A06440926J21811Q8043k5818r2865j80458j46126O3896R1957m6348n5794R018
2317A06268242P1335K21534J74714j08384j85897j49842p4127J56143J55304r0721
2327A06438301j40091o0295k3537J3474M9591R9846J05003N2216N1880J06643R5368
2338A06788399M2961k9373j59859k17033k79358j64627K04300L36341L38341K73819
$$ y = [106173492, 106261589, 106257866, 106196022, 106046509, 105925079, 105980896, 106084061, 106154564, 106191704, 106140327, 106083702, 106107925, 106149200, 106158783, 106177475, 106255699, 106315636, 106279633, 106197289, 106071404, 105964615, 105958435, 105998825, 106082199, 106138611, 106044724, 105956985, 106037209, 106145981, 106186035, 106192657, 106152321, 106113960, 106126427, 106176186, 106297707, 106395813, 106347183, 106270508, 106257011, 106265762, 106293610, 106318428, 106297752, 106289459, 106350258, 106440926, 106562737, 106650780, 106624962, 106532097, 106351639, 106205513, 106269409, 106361366, 106315018, 106259224, 106268242, 106339577, 106561111, 106735825, 106627441, 106441544, 106291702, 106217575, 106373718, 106529022, 106438301, 106298210, 106237915, 106214378, 106227852, 106277443, 106377289, 106482292, 106534508, 106586388, 106693031, 106788399, 106831360, 106801987, 106642128, 106425095, 106145737, 105981110, 106185410, 106521751, 106860092, 107133911]
2348A07133911N5771l1494J4992j01090m65866m38599k8991J60766L45017K68600j44935
2359A06768082l34908m76501m29848j29578K2721J50871J60866n059k1888Q2092R4772
2370A05881622M5060K9418M0200J1398q2901p3341M8668P9391M9446L9986K5200K6848
2382A06120995M9896N2429L7720L4286M4197L0571j0780k6627l0685k1416Q827K7771
2394A06317184N7984M1199l6690o1157m2244n4596j00998r5963n4977j648J05499J23886
2406A06197479N4688L5621L5241M1412Q8287N1140r7107j23741m9995k3865j8837O843
2418A06197166O3065O8184K6421K403j8830m2251q0826p7774k5650j1231k7702j5571
2430A06057404J9027M0840N8724P2456J00518O9046n8220o2447Q0513N4955j63315
$$ y = [107133911, 107189682, 107158188, 107173180, 107072090, 106606224, 106167625, 106138634, 106299400, 106644417, 106913017, 106768082, 106433174, 105956673, 105526825, 105397247, 105419968, 105570839, 105731705, 105726646, 105704758, 105786850, 105881622, 105926682, 105956100, 105996300, 106007698, 105924797, 105851456, 105900124, 105979515, 106028961, 106068947, 106094147, 106120995, 106170891, 106223320, 106261040, 106295326, 106339523, 106370094, 106359314, 106332687, 106302002, 106280586, 106289413, 106317184, 106375168, 106416367, 106379677, 106318520, 106276276, 106221680, 106120682, 106024719, 105969742, 105968094, 106073593, 106197479, 106252167, 106287788, 106323029, 106364441, 106452728, 106503868, 106406761, 106283020, 106233025, 106209160, 106190323, 106197166, 106260231, 106328415, 106354836, 106357239, 106338409, 106296158, 106215332, 106137558, 106111908, 106100677, 106072975, 106057404, 106076431, 106117271, 106175995, 106248451, 106348969, 106418015, 106359795, 106297348, 106377861, 106432816, 106269501]
2441A06269501j61934N1170R5268K3842L670n432r827k121n676k5177j8715J3977K9678
2454A06258224L9292M2389M1557K6589j6213k2079J2443Q515l1929l7903k6375p10
2466A06293800P2098O3202l7933o0341k7397j6571L746j5549r5818j02546n0682j5191
2478A06010818M5754L9574m7631o7978o1821j5594J12152J42075R5871O5918L2760
2489A06351898j8379j19949j27556l4615j1925m5372k0668Q3069O7826q6358j01539
2500A05936432Q09K8228J9287J2017j023k8274j00830q6113K6321O1966M8798M9263
2512A05966881M3915M7638Q5830M2008j22338j37016j4610K4696L1731K3102k4529
2523A05967308l4477k0119m867K1102M1886Q9668N1598j11435j30348j9692R636k151
$$ y = [106269501, 106107567, 106158737, 106254005, 106277847, 106281517, 106276085, 106266258, 106264137, 106258461, 106233284, 106214569, 106228546, 106258224, 106297516, 106339905, 106381462, 106408051, 106391838, 106369759, 106382202, 106390717, 106358788, 106320885, 106294510, 106293800, 106365898, 106429100, 106391167, 106330826, 106303429, 106286858, 106290604, 106275055, 106179237, 106076691, 106026009, 106010818, 106056572, 106096146, 106048515, 105980537, 105918716, 105903122, 106015274, 106157349, 106253220, 106319138, 106351898, 106333519, 106213570, 106086014, 106051399, 106039474, 105994102, 105973434, 106056503, 106124329, 106037971, 105936432, 105937241, 105965469, 105984756, 105996773, 105995750, 105967476, 105866646, 105780533, 105806854, 105868820, 105917618, 105966881, 106010796, 106058434, 106144264, 106186272, 106063934, 105926918, 105912308, 105937004, 105968735, 105991837, 105967308, 105932831, 105912712, 105907845, 105928947, 105970833, 106060501, 106112099, 106000664, 105870316, 105850624, 105860260, 105858109]
2535A05858109n173j4183k0127l6018j8913N0499N1902l1280j2375J34445J18996n8487
2547A06017395j09001q3710o7016l7362L411P3456J01684J17874P3723q0398r7970
2558A05912086J8578L2448l2906l4782N363L0564R0957M2725j55449j94717j22902
2569A05591965n7602O9450J02547N4977K9137j4710k0126J3565K7085O0081J2993j53610
2581A05715752j82511j16440m1938J11885J47751R0835L7361p7911r0508J694K5772
2592A05621742J9364M738m2367m7225k3728Q896Q3397Q7837L2303j1757r2697q8661
2604A05551842Q888M3823O0745L6980n4260q3283p6408n8105j8334K7107J17134J11626
2616A05667755J0681m6272j20544j06553J2017O4018J14723P3914j15067j35772M455
$$ y = [105858109, 105852936, 105838753, 105818626, 105782608, 105763695, 105814194, 105866096, 105834816, 105822441, 105956886, 106075882, 106017395, 105908394, 105824684, 105757668, 105720306, 105723717, 105797173, 105898857, 106016731, 106090454, 106010056, 105912086, 105930664, 105963112, 105930206, 105895424, 105900787, 105931351, 106022308, 106065033, 105909584, 105714867, 105591965, 105534363, 105603813, 105706360, 105761337, 105790474, 105775764, 105755638, 105769203, 105796288, 105856369, 105869362, 105715752, 105533241, 105416801, 105374863, 105486748, 105634499, 105725334, 105762695, 105684784, 105594276, 105595970, 105621742, 105641106, 105645844, 105603477, 105556252, 105532524, 105541420, 105624817, 105712654, 105744957, 105733200, 105640503, 105551842, 105560730, 105604553, 105665298, 105702278, 105648018, 105564735, 105488327, 105430222, 105411888, 105438995, 105556129, 105667755, 105678436, 105632164, 105511620, 105405067, 105417084, 105481102, 105595825, 105669739, 105554672, 105418900, 105423355]
2627A05423355J8166n9960q1489j00327m9309J17920J48537P0885K4315n5291n0850
2638A05405952O3630O6856j7021o3660j33278j09550L7857P1144K0363L074j4686j4923
2650A05315758K3552k022j12938j21429m6517r1O9732O7238j8600m8066n6190m2847
2662A05027580K0935J9074n4604n9456L380k334p7012q2824l0564j5281j4496k3293
2674A04711105n3482o2942n9342n4474k8900m8751j37475j35498m3365j8669l2471
2685A04035736m3060n8579q8142j58577j53534o4713m1862o8359o1318l4454j6091
2696A03247047P744R323j5014k3247l2929j5785O0990L7574r9037j37184j12968r3720
2708A02832794m8134l4141m6753m8332m3038n1971r2697p4074K8869K4865j00396r8632
$$ y = [105423355, 105441521, 105381561, 105300072, 105199745, 105150436, 105268356, 105416893, 105487778, 105512093, 105456802, 105405952, 105469582, 105536438, 105519417, 105455757, 105322479, 105212929, 105250786, 105321930, 105342293, 105345367, 105330681, 105315758, 105339310, 105337288, 105224350, 105102921, 105056404, 105056313, 105126045, 105193283, 105174683, 105126617, 105070427, 105027580, 105048515, 105067589, 105012985, 104953529, 104956909, 104954575, 104877563, 104794739, 104764175, 104748894, 104734398, 104711105, 104657623, 104594681, 104535339, 104480865, 104451965, 104403214, 104265739, 104130241, 104086876, 104068207, 104035736, 103992676, 103934097, 103845955, 103687378, 103533844, 103469131, 103427269, 103358910, 103297592, 103263138, 103247047, 103254791, 103264114, 103249100, 103225853, 103192924, 103177139, 103238129, 103275703, 103176666, 103039482, 102926514, 102832794, 102784660, 102750519, 102703766, 102655434, 102612396, 102560425, 102467728, 102393654, 102422523, 102447388, 102346992, 102248360]
2720A02248360J7662M9926M1794J7197m9736p9704q1330r9678j43982j32583o7070
2731A01720856k2980L1799M4068R460j739r201m654K5970J7929k7351n0827p7324o6895
2744A01589111q087J3230J2809J3207J6304q171q9722q0391L4470M7973r582n2811
2756A01478340j42723j20682M8279O5376m7042p9628p0717p6630j09001o5285J08673
2767A00988960R3605j18522j76430j42120j18920n1735n7846j38542j71349j96151
2777I9910950j75904q6143o1844r4940q2871k2392k9396j02043j32080j35880j56349
2788I8831108j97342k00607j78192j40358m4724n0857j68373j99486j71395j73240
2798I7306534j85723j97128k25853k10068j29364j27388j94336k25997k56875k53463
$$ y = [102248360, 102266022, 102315948, 102357742, 102374939, 102325203, 102245499, 102164169, 102064491, 101920509, 101787926, 101720856, 101697876, 101729675, 101773743, 101783203, 101781464, 101772263, 101767609, 101793579, 101811508, 101784157, 101733330, 101656006, 101589111, 101581024, 101594254, 101607063, 101620270, 101636574, 101628403, 101538681, 101458290, 101492760, 101540733, 101531151, 101478340, 101335617, 101214935, 101263214, 101328590, 101281548, 101201920, 101131203, 101054573, 100945572, 100880287, 100988960, 101082565, 100964043, 100787613, 100645493, 100526573, 100474838, 100416992, 100278450, 100107101, 99910950, 99735046, 99648903, 99587059, 99492119, 99409248, 99386856, 99357460, 99255417, 99123337, 98987457, 98831108, 98633766, 98433159, 98254967, 98114609, 98069885, 98019028, 97850655, 97651169, 97479774, 97306534, 97120811, 96923683, 96697830, 96487762, 96358398, 96231010, 96036674, 95810677, 95553802, 95300339]
2808I5300339j99936j93382k36512k21534j30677j42959k62764k93679k70607k50534
2818I3097755j94114k02011k75208l09280l22914l46108l72864l97377m28863m36257
2828H9812759m15283m14367m00185m57955o10878o81159o93726p27013p39029q19465
2838H3853699j002457j062035j011322j024154j070809j096557j122811j118827j107712
2847G4237015j027779q72040p30323n52056m50043m36920l49380j93955j07788o4110
2857F9452621l3210k7611k6962n7083l5187N3428O6803J5328q32k0935J1521J19186
2869F9517067J54922J26099J50177K18468K48092K52251K60925K80144K55608J91139
2879G1654892J25526K4537j3810k2911L2852K19895K36824J01089M4251O9J647P6127
$$ y = [95300339, 95100403, 94907021, 94670509, 94448975, 94318298, 94175339, 93912575, 93618896, 93348289, 93097755, 92903641, 92701630, 92426422, 92117142, 91794228, 91448120, 91075256, 90677879, 90249016, 89812759, 89397476, 88983109, 88582924, 88124969, 87514091, 86832932, 86139206, 85412193, 84673164, 83853699, 82851242, 81789207, 80777885, 79753731, 78682922, 77586365, 76463554, 75344727, 74237015, 73209236, 72337196, 71606873, 71054817, 70604774, 70167854, 69818474, 69624519, 69516731, 69452621, 69419411, 69391800, 69364838, 69307755, 69272568, 69325996, 69392799, 69408127, 69407295, 69386360, 69397881, 69517067, 69671989, 69798088, 69948265, 70166733, 70414825, 70667076, 70928001, 71208145, 71463753, 71654892, 71780418, 71804955, 71791145, 71768234, 71801086, 72020981, 72257805, 72358894, 72403145, 72403214, 72404861, 72480988]
2891G2480988Q1779L6453J0491j0468l9696r4223r2796k3407j5335n0522p1976r1476
2903G2119812j19164j65679j78551j53374j60339j93070k07115k09976k16408k13318
2913G0302818k38510l06488l21747l12256k61734j43219q1184q1940L952K02942K59644
2924F9022278J88774J86829J99127K47810L45139M19586N01327N41230N40283N43503
2934G2735886N35606N32455N30816N27458N21683N19226N42854M95697L48068L15262
2944G7605011L88954L87123L25226L23174L73367L86093L72505L77678L72078M28505
2954H1339714N73090O28402O14144O28944O46210O73462P14561P46178P81181P91123
2964H8137009P86728P53334O60423O44607O98044P15401P33086P10754O34048O00411
$$ y = [72480988, 72562767, 72599220, 72609711, 72599243, 72559547, 72465324, 72372528, 72349121, 72333786, 72283264, 72211288, 72119812, 72000648, 71834969, 71656418, 71503044, 71342705, 71149635, 70942520, 70732544, 70516136, 70302818, 70064308, 69757820, 69436073, 69123817, 68862083, 68718864, 68637680, 68555740, 68559692, 68762634, 69022278, 69211052, 69397881, 69597008, 69844818, 70189957, 70609543, 71110870, 71652100, 72192383, 72735886, 73271492, 73803947, 74334763, 74862221, 75383904, 75903130, 76445984, 76941681, 77289749, 77605011, 77993965, 78381088, 78706314, 79029488, 79402855, 79788948, 80161453, 80539131, 80911209, 81339714, 81912804, 82541206, 83155350, 83784294, 84430504, 85103966, 85818527, 86564705, 87345886, 88137009, 88923737, 89677071, 90337494, 90982101, 91680145, 92395546, 93128632, 93839386, 94473434, 95073845]
2974I5073845O01768N72724N37803M64226L12302K73422L26439L64258M51301M36951
2984I9415039L25203K50366J55182J34163K10304J97060J11717P1358M8401L5766L4279
2995A00988838M7707R4581R6657N3742M4677M2061P6721J75164K00439J80580J40335
3006A02141502L8834J4641O5300O1874L143K2866J25412J59309J57334J39923Q6097
3017A03016235N9265L2425M9973J18614J66992K54486K14814o41l1258J02379J21803
3028A04105087P0290N3284L5003N2880J44455J22100l4645n6602L6262N4627K2316
3039A04605057L3142P3479J03782J51947J45859Q6639M1825k3293l7605j60J3893K6588
3051A05221153K4727P10k022J3084J6236K6161k388r8541j00419j7646K6062Q3206
$$ y = [95073845, 95675613, 96248337, 96786140, 97250366, 97562668, 97836090, 98162529, 98526787, 98978088, 99415039, 99740242, 99990608, 100145790, 100279953, 100490257, 100687317, 100799034, 100870392, 100918793, 100954559, 100988838, 101036545, 101131126, 101227783, 101281525, 101326202, 101368263, 101444984, 101620148, 101820587, 102001167, 102141502, 102180336, 102194977, 102260277, 102322151, 102325294, 102348160, 102473572, 102632881, 102790215, 102930138, 103016235, 103075500, 103107925, 103157898, 103276512, 103443504, 103697990, 103912804, 103912163, 103880905, 103983284, 104105087, 104175377, 104228661, 104263664, 104316544, 104460999, 104583099, 104548454, 104491852, 104528114, 104582741, 104605057, 104638199, 104711678, 104815460, 104967407, 105113266, 105199905, 105241730, 105218437, 105180832, 105180672, 105194565, 105221153, 105245880, 105246590, 105244568, 105257652, 105273888, 105300049, 105297661, 105199120, 105098701, 105081055, 105107117, 105190323]
3063A05190323O7329n4214o4491L5644L2639q0185o2630P6416J32248J70113J33445
3074A05576637j7692o7139m3564m8538o1348o3347p5981l2234J03615J21429K7130
3085A05418968O867K9632L2974L3593K6893K3705j4832j31439j16516N8510O9618q8119
3097A05349854p1030J17378J47225N4832K4628K5703k769p0549p7935k3460j3016l8124
3109A05422737k7107J8165L3165L2593K1836j6739j7952J3900L0617N2475M6494J4396
3121A05624580j7860p1617q7547q5709m5303N9272J04523J39832R1148r3918j32080
3132A05485321n7434j6930N7480M0558j04019j06102K6298N4932Q16J8090J17187J02112
3144A05618309l0281p1549n3115n8060p7576o3804j7952J6952P2312O5490j7402l8361
$$ y = [105190323, 105257652, 105203438, 105138947, 105174591, 105207230, 105127045, 105064415, 105140831, 105273079, 105443192, 105576637, 105558945, 105491806, 105448242, 105399704, 105338356, 105275009, 105199028, 105166794, 105270409, 105391838, 105418968, 105425835, 105455467, 105488441, 105522034, 105548927, 105572632, 105557800, 105426361, 105309845, 105368355, 105437973, 105349854, 105278824, 105396202, 105543427, 105598259, 105622887, 105648590, 105645821, 105575272, 105497337, 105473877, 105460861, 105422737, 105395630, 105413795, 105446960, 105479553, 105501389, 105484650, 105466698, 105480598, 105511215, 105563690, 105610184, 105624580, 105606720, 105535103, 105447556, 105361847, 105316544, 105375816, 105480339, 105620171, 105711319, 105617401, 105485321, 105427887, 105410957, 105468437, 105508995, 105404976, 105298874, 105325172, 105380104, 105380920, 105399010, 105516197, 105618309, 105588028, 105516479, 105463364, 105405304, 105327728, 105263924, 105245972, 105262924, 105335236, 105400726, 105383324, 105344963]
3156A05344963k3910o035M8874L8314m1984p2479q3016p3768l8079k594N5046P1884
3168A05217216O9573K4124j20445j16394M4464Q1398L6621K1790J0223l235j9173l0471
3180A05215691m7203l6263J5305K2338R77k8488j02997r5085O081K9396o241n440J3542
3193A04981613K8206N2475N2979M1885L555r8755j02592k1668L6217J32126J29509
3204A05235550L9986m6471k18506k11647o439N4886K1148L9246R9564R3505K9206j7311
3216A05112717q3588r5512o5773j7769R2888J11892O0776P416r8946j23314q2397m4655
3228A04773735K9755M9781K7947M959m7188n7243k9923j7784m669k983j3565k0889
3240A04691933k5818m0650q1161p1953r392J6403L2235K0767m4136m0695M0413L9741
$$ y = [105344963, 105321053, 105315018, 105363892, 105402206, 105360222, 105287743, 105204727, 105130959, 105092880, 105090286, 105145332, 105217216, 105286789, 105310913, 105190468, 105074074, 105118538, 105199936, 105236557, 105258347, 105268570, 105265335, 105246162, 105215691, 105168488, 105132225, 105147530, 105169868, 105170845, 105142357, 105039360, 104944275, 104950356, 104979752, 104973511, 104968071, 104981613, 105009819, 105062294, 105115273, 105157158, 105160713, 105061958, 104959366, 104937698, 104973915, 105106041, 105235550, 105275536, 105229065, 105010559, 104798912, 104792473, 104847359, 104868507, 104907753, 105007317, 105100822, 105130028, 105112717, 105029129, 104933617, 104867844, 104850075, 104942963, 105054855, 105115631, 105123047, 105024101, 104900787, 104818390, 104773735, 104803490, 104853271, 104881218, 104886177, 104838989, 104781746, 104751823, 104734039, 104729370, 104726387, 104712822, 104691933, 104666115, 104625465, 104544304, 104472351, 104462959, 104479362, 104511597, 104532364, 104488228, 104447533, 104487946, 104527687]
3252A04527687l1044n9128p8605o6231m723J3283M601n440k6436m5326p1717q0154
3264A04076767r8610m0840J41548J68755P4791L166j24283j38451l2280l341j6899
3275A04010323j4595j1971n241K2628n26j06888r5627L7575P4219N1330L9200Q888
3287A04009315N700N1330J3642j41121j46057o127L1357J0178K502r491k6726o7688
3299A03726814n7716J0467L2875M1512J2085p9369j12724j14967r8274n3483n218Q3664
3311A03385666Q8783J267j9173J4542n577q1231r7702p9918m2915M5204P1671N7152
3323A03337769L1585k9182n8510p2403p3532o0867l5836M0390J3733j34086j76094
3334A02782967j73523j08673Q4159J24337N0308j1421j34346j50994o4178l0090m242
$$ y = [104527687, 104496643, 104437515, 104358910, 104292679, 104287956, 104301239, 104305840, 104300400, 104273964, 104228638, 104156921, 104076767, 103978157, 103937317, 104078865, 104247620, 104322411, 104325577, 104201294, 104062843, 104030563, 104027222, 104010323, 103995728, 103983757, 103978516, 104001144, 104000618, 103893730, 103798103, 103835678, 103909897, 103961227, 104000427, 104009315, 104015015, 104066345, 104079987, 103938866, 103792809, 103786682, 103818039, 103828217, 103830719, 103821228, 103794502, 103726814, 103669098, 103679565, 103712440, 103753952, 103766037, 103686668, 103573944, 103458977, 103360703, 103307220, 103302002, 103385666, 103474449, 103475716, 103456543, 103471085, 103465508, 103384277, 103286575, 103206657, 103163742, 103208946, 103280617, 103337769, 103369354, 103340172, 103281662, 103209259, 103135727, 103074860, 103039024, 103079414, 103093147, 102959061, 102782967, 102609444, 102500771, 102584930, 102709267, 102759575, 102748154, 102613808, 102462814, 102398636, 102368546, 102364304]
3345A02364304q637o7993o1394K312L7651Q4114O9115n410p4699j96052k05185j05568
3357A01832558m7638J7502M4776M5319J9531n7983q6212r1988o9092J9478J9150p5912
3369A01569489q8173l6477k3223j6259m1793j31752j32271m9263j3085R606J5594q774
3381A01053619o034J9676K7366K6917J9836J5496k5368j33392j46935q0635l7598K8778
3393A00761726L4974j8479n0285j02638q8097K6901K0333j04355j38924j35117r4291
3404A00111748K9945N3261l716l9321j05904r5772K030L5903O1181P865j88468k00181
3416I9668571k6702J770q3764p7362M342K1476k212k1935o4186o8069k3102l2379r3933
3429I9202515j12702j08505r7343p0145m7371r682j4282r2079o2462R2430J20377N7655
$$ y = [102364304, 102355667, 102287674, 102226280, 102228592, 102266243, 102350357, 102419472, 102414062, 102339363, 102143311, 101938126, 101832558, 101784920, 101802422, 101847198, 101892517, 101912048, 101854065, 101767853, 101675865, 101606773, 101626251, 101645401, 101569489, 101481316, 101444839, 101421616, 101405357, 101363564, 101231812, 101099541, 101050278, 101037193, 101046799, 101062393, 101053619, 101047585, 101067261, 101094627, 101121544, 101141380, 101156876, 101131508, 100998116, 100851181, 100770546, 100732948, 100761726, 100796700, 100778221, 100727936, 100625298, 100537201, 100564102, 100584435, 100480080, 100341156, 100206039, 100111748, 100141693, 100194954, 100191238, 100151917, 100046013, 99950241, 99952271, 99988174, 100049355, 100057220, 99868752, 99668571, 99641869, 99643639, 99559875, 99482513, 99486855, 99508331, 99506119, 99484184, 99419998, 99351929, 99328827, 99296448, 99202515, 99089813, 98981308, 98883965, 98813820, 98766449, 98756767, 98742485, 98650406, 98587944, 98680374, 98800751, 98858406]
3441I8858406J1345n5908j01898j52665j46362q5831k1865J05621J07124k9823o5903
3452I8422241l6667l9245o5804n0636K4574K0554p1503p7171n608N036l8338k5345
3464I8062088N5550M7516n4810p3296m6653J739J34537J24580k9518r5367j40839j26930
3476I7858597k2125Q438j4588q682K5032Q255p5508q2375l1517R865Q1993R0935L7148
3489I7885468J2725o767j5640j4450o844Q042L0227P2739Q3496P6248M7875l4241l6713
3502I8102165L3974P0099J28860Q9096q6761j27648q0604k8542Q5022J17058P7416
3513I8380135O9549P1762O7139O7833M2099l3020l4210J9928Q0375K24259J91780o2226
3525I9085403r7274N0804Q4739M0841P0732J84540J90094J10763M4945o5994q6045
$$ y = [98858406, 98869751, 98813843, 98711945, 98559280, 98412918, 98327087, 98305222, 98410843, 98517967, 98488144, 98422241, 98385574, 98346329, 98280525, 98229889, 98254463, 98275017, 98203514, 98126343, 98120735, 98125771, 98087433, 98062088, 98117638, 98165154, 98110344, 98037048, 97990395, 97992134, 98126671, 98251251, 98221733, 98126366, 97985527, 97858597, 97836472, 97844910, 97830322, 97821640, 97846672, 97854927, 97779419, 97697044, 97665527, 97675392, 97757385, 97848320, 97885468, 97898193, 97891426, 97875786, 97861336, 97854492, 97862534, 97892761, 97965500, 98048996, 98125244, 98173119, 98138878, 98102165, 98136139, 98206238, 98335098, 98424194, 98337433, 98209785, 98129181, 98100639, 98185661, 98302719, 98380135, 98449684, 98521446, 98588585, 98656418, 98698517, 98665497, 98631287, 98651215, 98731590, 98955849, 99147629, 99085403, 98988129, 99038933, 99123672, 99164513, 99235245, 99419785, 99609879, 99720642, 99765587, 99699593, 99613548]
3536I9613548k3178J8334Q0520R9350Q5037O0708j23j4976m738L1494J32988J41838
3548A00220802M9424M7920J32225J30462M6944L6102Q4183R1408Q7624N2970m9278
3559A00930786n2330L6095Q0108J31485J18660L9246k5894j62529j08574J87515K57347
3570A01431915J82015J05400o1821j06331n9868r086J07025J31111O6734N6618P6675
3581A01920387Q0467Q7357O6094L28j3489J4755K7992L8887N3597P8651Q1681O1943
3593A02498650N4741M4349N8052J00281J25931J72638J34849j8455n7648k2125J5953
3604A03107216J05430J23047Q0513N3933R010O462L4851P9063J98723J70113l6934
3615A03931427p8293q682M6585J58958J67893O2157M7134R8846J07834J44913L6194
$$ y = [99613548, 99590370, 99608704, 99689224, 99788574, 99873611, 99934319, 99934196, 99919220, 99914482, 99945976, 100078964, 100220802, 100270226, 100318146, 100450371, 100580833, 100627777, 100663879, 100748062, 100839470, 100927094, 100980064, 100930786, 100878456, 100914551, 100994659, 101126144, 101244804, 101284050, 101258156, 101095627, 100987053, 101174568, 101431915, 101613930, 101719330, 101657509, 101551178, 101491310, 101482224, 101589249, 101720360, 101787094, 101843712, 101920387, 102000854, 102088211, 102154305, 102154633, 102141144, 102155899, 102183891, 102222778, 102276375, 102355026, 102436707, 102498650, 102553391, 102597740, 102655792, 102756073, 102882004, 103054642, 103189491, 103171036, 103113388, 103091263, 103107216, 103212646, 103335693, 103416206, 103470139, 103479149, 103485611, 103520462, 103599525, 103798248, 103968361, 103931427, 103853134, 103844452, 103891037, 104049995, 104217888, 104280045, 104327179, 104426025, 104533859, 104678772, 104714966]
3626A04714966l40058l23104J04240K12334J22711P8750j3473k1790M0223R4535J94237
3637A04863571K04704J14968J03210J63864J40953L9101m288R797n2262k29217k32766
3648A05121635r2788K1904K16964K38610P0854L1280P9758N8884k9228l5569K7153
3659A05709457O0723R1797J11602J50032R6230q8570j38527j29005k4368L17482K92419
3670A06449272q7623k66358m50111l70095P3571K12478J60508J30508O508L9368K67028
3681A06165054K86484J68198L3310k30767k95257j84868j29891p6293r964R3193J22406
3692A05941605Q1611O5491L5095N1407J50276J27266q728q8928k09709j54640J26243
3703A06116989K16530K18155J39755q6639j97884k90848k41470j503J11862J86043
$$ y = [104714966, 104374908, 104051804, 104156044, 104368378, 104491089, 104569839, 104556366, 104534576, 104574799, 104669334, 104863571, 105068275, 105183243, 105286453, 105450317, 105591270, 105630371, 105626083, 105635880, 105583618, 105354401, 105121635, 105028847, 105050751, 105267715, 105506325, 105577179, 105608459, 105688217, 105747101, 105717873, 105682304, 105709457, 105770180, 105861977, 105973579, 106123611, 106219841, 106131271, 105992744, 105863739, 105839371, 106156853, 106449272, 106361649, 106095291, 105645180, 105275085, 105348656, 105561134, 105721642, 105852150, 105858658, 105898026, 106165054, 106451538, 106619736, 106653046, 106422279, 106127022, 105942154, 105812263, 105735970, 105726006, 105819199, 105941605, 106023216, 106088707, 106123802, 106175209, 106325485, 106452751, 106444023, 106355095, 106145386, 105990746, 106116989, 106333519, 106551674, 106691429, 106604790, 106406906, 106116058, 105874588, 105873085, 105984947, 106170990]
3713A06170990J88560J03074K7343j05217j26121l3737l380P339M074m5463j7807J00517
3725A06270172J31989J16706P1595l6286r2224j23619j35872j42647q3999N4581J54991
3736A06185387L05915K70463L6598j10909l19130k84858K2461J76971L60588K71462
3746A06914948j90400l23318k59659j71692N8441J31363R4872N7007m7661o5521N798
3757A06204178K907o6994o9473p775l555n7816m4891M1504N0262r346k3651k9899O912
3770A05992363J25740J35422N8700m264j12175j30730n8838l5408l9482j6022M5395
3781A05960701M7974l0426m601J66016J33941j58172j33652K15240K80594J50994P9986
3792A06708595k1934n0423J4114j1085j07834j66229k68936j95404J41021J72928p9422
$$ y = [106170990, 106359550, 106462624, 106489967, 106384750, 106258629, 106224892, 106221512, 106228851, 106232925, 106187462, 106169655, 106270172, 106402161, 106518867, 106590462, 106554176, 106461952, 106338333, 106202461, 106059814, 105975815, 106030396, 106185387, 106491302, 106761765, 106798363, 106687454, 106368324, 106083466, 106105927, 106282898, 106643486, 106914948, 106724548, 106401230, 106141571, 105969879, 106028320, 106159683, 106254555, 106311562, 106263901, 106198380, 106204178, 106207085, 106140091, 106070618, 106062843, 106059288, 106001472, 105956581, 105998085, 106048347, 106039001, 106015350, 105985451, 105992363, 106118103, 106253525, 106312225, 106307961, 106195786, 106065056, 106006218, 105970810, 105931328, 105915306, 105960701, 106008675, 105978249, 105973648, 106139664, 106273605, 106115433, 105981781, 106197021, 106477615, 106628609, 106708595, 106686661, 106636238, 106650352, 106639267, 106531433, 106365204, 106096268, 105900864, 106041885, 106214813, 106135391]
3803A06135391j29936o7757k2628N1757R9732J60812J32492l341p1976j48728j07261
3814A06028557J09436J46721M3823j793n3520n5245J6404J1924p7324o7611K2339Q3610
3826A06207321J94931J50040j16326j37207M8806J28860K39922J46721k38587l29376
3836A06295105k10190j29814J9142N5718l3089j4641P6248J46126K37320K73918L15117
3847A07030960J99921j29700k80861l49708l44544k50816j18614J44889K18483J26488
3857A06246498R2888O2248L2067j3634q705O5422O8138K9640l0426j78764j68351J9646
3869A06216667O2874n653M295P5912Q5831P6248J473k17362k19185O539N6434l936
3881A06140137l3593q3778r0843n4047m0054k8870l3760q5403m7806Q8097J49940J83777
$$ y = [106135391, 106005455, 105937698, 105915070, 105966827, 106066559, 106227371, 106359863, 106356522, 106284546, 106135818, 106028557, 106137993, 106284714, 106328537, 106326744, 106273224, 106217979, 106234383, 106246307, 106168983, 106101372, 106123711, 106207321, 106402252, 106552292, 106435966, 106298759, 106347565, 106476425, 106716347, 106863068, 106624481, 106295105, 106084915, 105955101, 105974243, 106029961, 105996872, 105982231, 106058479, 106204605, 106441925, 106715843, 107030960, 107230881, 107101181, 106820320, 106470612, 106126068, 105875252, 105756638, 105901527, 106120010, 106246498, 106339386, 106401634, 106433701, 106420067, 106411362, 106476784, 106544922, 106574562, 106544136, 106365372, 106197021, 106216667, 106279541, 106273888, 106278183, 106354095, 106439926, 106516174, 106517647, 106300285, 106081100, 106087639, 106144073, 106140137, 106106544, 106022766, 105931923, 105877876, 105837822, 105808952, 105775192, 105689789, 105641983, 105730080, 105880020, 106063797]
3893A06063797J77666J13586P5386N1644M196n5031j35918l20129k71507N8578J39359
3904A05901627K3407L1089J34713J24427J7449m5487j20857j23855l3288j9096o2202
3915A05827927o9138n6702n1544p0808j9455J32461J70067J30417P9987l5378o5712
3926A05972122r918k2484j16608q5212J03019J15540k6985p4745q5472p8133k8969
3937A05662155j4305l8483p888R8228J02921n19q278Q3092N5763j03874j23673k3147
3949A05681992L669J5976k9251j95389j86012q057O9497J27029J11679k5017l6499
3960A05529617P3624P2937j5862n1422p3219o5109p828N104k3888j1184L8841N9937
3972A05531548P1716O1874J7472K410J7167m319o9427q2565n3879l8552l1356J983
$$ y = [106063797, 106241463, 106355049, 106430435, 106482079, 106486275, 106431244, 106295326, 105975197, 105703690, 105762268, 105901627, 105925034, 105956123, 106090836, 106215263, 106232712, 106187225, 106066368, 105942513, 105909225, 105890129, 105827927, 105758789, 105702087, 105650543, 105579735, 105560280, 105692741, 105862808, 105993225, 106073212, 106037834, 105972122, 105962204, 105939720, 105823112, 105737900, 105840919, 105956459, 105929474, 105854729, 105769257, 105691124, 105662155, 105647850, 105609367, 105601479, 105699707, 105802628, 105802109, 105793831, 105876923, 105932686, 105828812, 105705139, 105681992, 105685661, 105701637, 105672386, 105476997, 105290985, 105282928, 105352425, 105479454, 105591133, 105566116, 105529617, 105603241, 105676178, 105660316, 105608894, 105535675, 105470566, 105462738, 105467842, 105443954, 105432770, 105471611, 105531548, 105603264, 105665138, 105682610, 105685020, 105702187, 105697868, 105628441, 105545876, 105491997, 105453445, 105422089, 105424072]
3984A05424072Q7639Q6403j503l7788m0032p6507j81290j49872K9137J05690J55327
3995A05401276J25625k9754p3098l9413k6390
4000A05358246
$$ y = [105424072, 105511711, 105598114, 105596611, 105558823, 105518791, 105442284, 105260994, 105111122, 105140259, 105245949, 105401276, 105526901, 105497147, 105424049, 105384636, 105358246]
##END=$$ End of the data block
