##TITLE=PRIC $$ Begin of the data block
##JCAMP-DX=5.00 $$ ACD/SpecManager v 10.08
##SPECTROMETER/DATA SYSTEM=Alpha
##DATE=01 Apr 2015 08:53:30
##DATA TYPE=INFRARED SPECTRUM
##DATA CLASS=XYDATA
##ORIGIN=
##OWNER=
##NPOINTS=1765
##FIRSTX=399.76428223
##LASTX=3997.64306641
##MAXX=3997.64306641
##MINX=399.76428223
##MAXY=1.00159144
##MINY=0.30956534
##XFACTOR=1.0000000000
##YFACTOR=0.000000010000000
##FIRSTY=1.00000000
##DELTAX=2.03961372
##XUNITS=1/CM
##YUNITS=ARBITRARY UNITS
##XYDATA=(X++(Y..Y))
399.8A00000000k28059j23424r3180k03126k42245p2337O2645p8833l42185k90685
420.2I8388571j12743k64740m12792k67547j24031k55478l85534k34992m4811j21992
440.6I6163911k79951j68133n198j33437l29023k86275j86485l73042n82254m25726
461I3394387l07030m83423o46252n79279n09578o08737o22308l98552j87934j92958
481.3H8858336k36344j13851l4046k16717m16225l63153k73711m05234n56624m91392
501.7H5751039l74222m37152n06330l64435j97458k17986k92069k04193o4564j08796
522.1H2983834j96434p4291J12385J05798K5976Q0621J96368J37984m0328p6014j3828
544.6H3242071j09965l11518l28833k21920k85351m64910m90952m06599m54813n92554
$$ y = [100000000, 99771941, 99648517, 99555337, 99352211, 99109966, 99037629, 99100274, 99021441, 98679256, 98388571, 98275828, 98011088, 97598296, 97330749, 97206718, 96951240, 96565706, 96330714, 96285903, 96163911, 95883960, 95715827, 95710629, 95577192, 95248169, 94961894, 94775409, 94402367, 93820113, 93394387, 93087357, 92603934, 91957682, 91378403, 90868825, 90260088, 89637780, 89239228, 89051294, 88858336, 88621992, 88508141, 88474095, 88257378, 87841153, 87478000, 87204289, 86799055, 86242431, 85751039, 85376817, 84939665, 84433335, 84068900, 83871442, 83653456, 83361387, 83157194, 83092630, 82983834, 82787400, 82713109, 82825494, 82931292, 82957268, 83037889, 83234257, 83372241, 83331913, 83255899, 83242071, 83132106, 82820588, 82491755, 82269835, 81984484, 81519574, 81028622, 80622023, 80167210, 79574656]
565G9574656o11794n22017m79519m59433l12918n1397J47229K27976L50010N16439
585.4G8379232N29420L63314K39188K45130J97249M1390k8610L6484N9020j228J0848
607.8H0071437J41639K26432J93453J80197K78794L88134L74257L01689L05826L20303
628.2H2782161K18785J06549J29450J72019P1639n9373m7117J4102n7351j80280j58698
650.6H2991886o0958q3166j73956j62792q9360j07258j55962j68478k26903k51871
671H1511182k39236j79612k7001Q9347J22047K06315L64203M04638K70116J24425L8987
693.5H2685411q3703k40934k59655j00244P5669J64258K55662M38172O01882O42234
713.9H4178752O73479Q11553R64909J016647J032394J113945J170725J078063Q93814
$$ y = [79574656, 78962862, 78440845, 77961326, 77501893, 77188975, 77137578, 77284807, 77512783, 77862793, 78379232, 78908652, 79271966, 79511154, 79756284, 79953533, 79994923, 79966313, 80002797, 80061817, 80060589, 80071437, 80213076, 80439508, 80632961, 80813158, 81091952, 81480086, 81854343, 82156032, 82461858, 82782161, 83000946, 83107495, 83236945, 83408964, 83480603, 83421230, 83374113, 83388215, 83330864, 83150584, 82991886, 82930928, 82847762, 82673806, 82511014, 82421654, 82314396, 82158434, 81989956, 81763053, 81511182, 81271946, 81092334, 81065333, 81154680, 81276727, 81483042, 81847245, 82251883, 82521999, 82646424, 82685411, 82601708, 82360774, 82101119, 82000875, 82076544, 82240802, 82496464, 82934636, 83536518, 84178752, 84852231, 85663784, 86628693, 87645340, 88677734, 89791679, 90962404, 92040467, 92934281]
732.2I2934281P46637O28805M59350K85041K00599J70237P9078l9286q0317o0207p6383
754.7I5247835j10626l6168J41292K95854L87949M91738O00970O26993N50878M62294
775.1I8659009M24558L72851K59506J57208J07675J9193j49530m43757p48825j067650
795.4I7590238j399642j620317j602542j381856j096684q01075m63539j01233K24603
813.8H9347953N16855Q23337J134920J364231J441890J356167J107669P16227L01242
832.2I8110491N4711K8044Q8871J09070R1690R8056J24704J26434J37114K23661L23754
854.6I9516600L11983J71417%j91802n21803r68080j405615j743662j917130j788682
875I1463226j256567m41677L28410P99650R49657Q31688M87172M1205l08126m51279
$$ y = [92934281, 93680918, 94309723, 94769073, 95054114, 95254713, 95424950, 95504028, 95464742, 95384425, 95324218, 95247835, 95137209, 95101041, 95242333, 95538187, 95926136, 96417874, 97018844, 97645837, 98196715, 98659009, 99083567, 99456418, 99715924, 99873132, 99980807, 100000000, 99850470, 99406713, 98657888, 97590238, 96190596, 94570279, 92967737, 91585881, 90489197, 89688122, 89224583, 89123350, 89347953, 89864808, 90688145, 91823065, 93187296, 94629186, 95985353, 97093022, 97809249, 98110491, 98165202, 98193246, 98282117, 98391187, 98482877, 98580933, 98705637, 98832071, 98969185, 99192846, 99516600, 99828583, 100000000, 100000000, 99808198, 99286395, 98318315, 96912700, 95169038, 93251908, 91463226, 90206659, 89764982, 90093392, 90893042, 91842699, 92674387, 93161559, 93202764, 92894638, 92443359]
895.4I2443359m53627m30674l93945l16101k77710l67904n13076n85717n69022m97770
915.8H8037813l61181j53714L9959J02901M1354n4479j77049l71230o07467p96896
936.2H5700011r33724j098198j295024j468277j645494j883507k112472k195578k108187
954.5G0959550j929521j706100j433003j150662r46354q40998p65479o72984n93144
972.9F0921305n52964n33664n35578o11275p93523j030677j243413j404214j502108
991.3E2713889j505607j409662j267785j132721j005912q86270q14244q14590q47855
1009.6D3029243q67486q56397q13198p25645n77059l87463k03148n4785N5232J27155
1030C8726449J39034Q7932J5398m5058p3009o3748k1571N3111J47057K45192L39094
$$ y = [92443359, 91989732, 91559058, 91165113, 90849012, 90571302, 90203398, 89690322, 89104605, 88535583, 88037813, 87676632, 87522918, 87562877, 87665778, 87707132, 87652653, 87475604, 87104374, 86496907, 85700011, 84766287, 83668089, 82373065, 80904788, 79259294, 77375787, 75263315, 73067737, 70959550, 69030029, 67323929, 65890926, 64740264, 63793910, 62952912, 62187433, 61514449, 60921305, 60368341, 59834677, 59299099, 58687824, 57894301, 56863624, 55620211, 54215997, 52713889, 51208282, 49798620, 48530835, 47398114, 46392202, 45505932, 44691688, 43877098, 43029243, 42161757, 41305360, 40492162, 39766517, 39189458, 38801995, 38598847, 38544062, 38599294, 38726449, 38865483, 38953415, 38968813, 38923755, 38850746, 38786998, 38765427, 38818538, 38965595, 39210787, 39549881]
1052.4C9549881M19036M69857M97148N19126N37065N28669M66809L40423J66190j0670
1072.8D3483534j35436j62092q5533M9869J84586K92495L80892M57096N13515N39985
1093.2D5518911N37684N13140M78613M51666M55907N15330O32084P55563Q18300P77388
1113.6E1454586O06257L20637j0050k95853m65399m96239m19002k76632j09791L3873
1134E0342387J20097J48183J40286J19466J00117R3872J24281K08766L36134M87316
1154.4E2220905O73806R10271J171314J421023J644415J829594J947880J982164J961756
1172.8F5763128J925051J847637J693791J488334J276493J058620Q01611N18227K59918
1191.1G6632810L4576j82253l71641m79430n06067n07176m96370m42200l55661k97523
$$ y = [39549881, 39968917, 40438774, 40935922, 41455048, 41992113, 42520782, 42987591, 43328014, 43494204, 43483534, 43348098, 43186006, 43100473, 43150342, 43334928, 43627423, 44008315, 44465411, 44978926, 45518911, 46056595, 46569735, 47048348, 47500014, 47955921, 48471251, 49103335, 49858898, 50677198, 51454586, 52060843, 52381480, 52371430, 52075577, 51610178, 51113939, 50694937, 50418305, 50308514, 50342387, 50462484, 50610667, 50750953, 50870419, 50970536, 51064408, 51188689, 51397455, 51733589, 52220905, 52894711, 53804982, 54976296, 56397319, 58041734, 59871328, 61819208, 63801372, 65763128, 67688179, 69535816, 71229607, 72717941, 73994434, 75053054, 75854665, 76372892, 76632810, 76667386, 76485133, 76113492, 75634062, 75127995, 74620819, 74124449, 73682249, 73326588, 73029065]
1211.5G3029065k79343k57194k21348k08419k31678k48480k34085k28625k50471k47133
1231.9G0622289j96391j48821j34510j13952n5796M786L2348N1921R5034J35309J39874
1254.4G0432091J25289J27500J40059J27465J05041J13118J36750J36120J24144J36960
1274.8G1704537J59073J47491J12331R1118P6681M0049j0109l9816n0712p0387r7400
1297.2G2062856r2328m5681O527M1342O8891Q9604Q3035M8917J1385j1516k9462n6833
1321.7G2176737r0015j08654j19912j44756j69039j72794j71846j88714j82313j31881
1342.1G0696813j11950j52647k08259k44575k64454k92963l21466l29321l57652m19158
1362.5F7994368m40055m36741m42785l85821l40742l45814l19153l17854l67564l69388
$$ y = [73029065, 72749722, 72492528, 72271180, 72062761, 71831083, 71582603, 71348518, 71119893, 70869422, 70622289, 70425898, 70277077, 70142567, 70028615, 69972819, 69977605, 70009953, 70061874, 70156908, 70292217, 70432091, 70557380, 70684880, 70824939, 70952404, 71057445, 71170563, 71307313, 71443433, 71567577, 71704537, 71863610, 72011101, 72123432, 72214550, 72291231, 72331280, 72321171, 72281355, 72230643, 72160256, 72062856, 71970528, 71924847, 71931374, 71972716, 72041607, 72131211, 72214246, 72263163, 72274548, 72263032, 72233570, 72176737, 72086722, 71978068, 71858156, 71713400, 71544361, 71371567, 71199721, 71011007, 70828694, 70696813, 70584863, 70432216, 70223957, 69979382, 69714928, 69421965, 69100499, 68771178, 68413526, 67994368, 67554313, 67117572, 66674787, 66288966, 65948224, 65602410, 65283257, 64965403, 64597839, 64228451]
1382.9F4228451k85375j80775q8388m6843r2900j58614j62744j58668j29032r7888
1403.3F2827224r1410l8988K8956R1112J57595K00212K16901K87312L53515L49009
1423.7F4381438L25490K74729K01506J39117P0655m5037q7053l7920p4863j57768k17974
1446.1F4772320k43896j84298r8014l6591N3787L32457N69022O15525P01505Q11797
1466.5F7293614Q29339R15790J225054J405710J278269J084799Q63749O28888L49224
1484.9G5874436M8846k71547n10460n91993q35044j240509j311267j112306j008808
1503.2F9041348j354737k051955j616466j146227j154012j123231r48906o73718n78832
1521.6E8393264m66412l38221l12007k17944j83254j85281n5826M828o6358M2182K27219
$$ y = [64228451, 63943076, 63762301, 63673913, 63627070, 63534170, 63375556, 63212812, 63054144, 62925112, 62827224, 62735814, 62696826, 62725782, 62816894, 62974489, 63174701, 63391602, 63678914, 64032429, 64381438, 64706928, 64981657, 65183163, 65322280, 65392935, 65347898, 65260845, 65222925, 65148062, 64990294, 64772320, 64528424, 64344126, 64246112, 64209521, 64263308, 64595765, 65164787, 65780312, 66481817, 67293614, 68122953, 69038743, 70263797, 71669507, 72947776, 74032575, 74896324, 75525212, 75874436, 75923282, 75651735, 75141275, 74549282, 73714238, 72473729, 71162462, 70050156, 69041348, 67686611, 65634656, 64018190, 62871963, 61717951, 60594720, 59645814, 58972096, 58393264, 57926852, 57588631, 57276624, 57058680, 56875426, 56690145, 56634319, 56639147, 56572789, 56614971, 56842190]
1544E6842190K95645L13765L41600L90053M29565M37653N32656P94751P57337P21508
1564.4F1856723P63249Q07601R04066Q51106P85703Q60959Q05062O63334N61226M38058
1584.8F9297087K86740J33497k8265j93858l51936m71931n97340q00413j048917j283341
1605.2F4941323j544768j855594k026802k010733k279288k675086k102285j625827
1621.5D8820940j597241j216713p74693m98557k44072j59553k40120j61332n7399o7416
1641.9D3803844j21638k21515j75431L028p2515j52594J14208J97804J64312J47161
1662.3D3686664K13343K63193K55102K90141L54302L92663M47232M81104M75663M96376
1682.7D7355783O47867P30404O80560O83358O12366N74708P10547J123435J754260
$$ y = [56842190, 57137835, 57451600, 57793200, 58183253, 58612818, 59050471, 59583127, 60377878, 61135215, 61856723, 62619972, 63427573, 64331639, 65182745, 65968448, 66829407, 67634469, 68297803, 68859029, 69297087, 69583827, 69717324, 69689059, 69495201, 69143265, 68671334, 68073994, 67273581, 66224664, 64941323, 63396555, 61540961, 59514159, 57503426, 55224138, 52549052, 50446767, 48820940, 47223699, 46006986, 45232293, 44733736, 44489664, 44330111, 44089991, 43928659, 43871260, 43803844, 43682206, 43460691, 43285260, 43288288, 43215773, 43063179, 43177387, 43375191, 43539503, 43686664, 43900007, 44163200, 44418302, 44708443, 45062745, 45455408, 45902640, 46383744, 46859407, 47355783, 48003650, 48734054, 49414614, 50097972, 50710338, 51285046, 51995593, 53119028, 54873288]
1701.1E4873288J719910J576221J622670J447863J244968J095158J010007J087206
1717.4F5677291J136178J017970R74428R87745R52929R10538Q50535R03404R91338
1735.7G4402356Q72249Q28117Q54438Q34102Q02534P66486P89518Q46290P89297P05558
1756.1H2490945O78295O35493O17384O08236N46181M87834M35234M24409M82976M86088
1776.5H7893075M23461L78936L74300L73828L77417L46464K77966K97809L80504L68410
1796.9I1492170L04014K88796L24374L23540K80410K45178K50960K70933K57128K35790
1817.3I4273293K39337K24590J76835J74671J98221J81300K03621K37376K12419J87451
1837.7I6309114J79731J39255R5838J49107K01678J84059J66673J48493J23984J13141
$$ y = [54873288, 56593198, 58169419, 59792089, 61239952, 62484920, 63580078, 64590085, 65677291, 66813469, 67831439, 68805867, 69793612, 70746541, 71657079, 72507614, 73411018, 74402356, 75274605, 76102722, 76957160, 77791262, 78593796, 79360282, 80149800, 80996090, 81785387, 82490945, 83169240, 83804733, 84422117, 85030353, 85576534, 86064368, 86499602, 86924011, 87406987, 87893075, 88316536, 88695472, 89069772, 89443600, 89821017, 90167481, 90445447, 90743256, 91123760, 91492170, 91796184, 92084980, 92409354, 92732894, 93013304, 93258482, 93509442, 93780375, 94037503, 94273293, 94512630, 94737220, 94914055, 95088726, 95286947, 95468247, 95671868, 95909244, 96121663, 96309114, 96488845, 96628100, 96723938, 96873045, 97074723, 97258782, 97425455, 97573948, 97697932, 97811073]
1858.1I7811073J23990J28907J04135N4407L5059J04678J48457J13786Q6885Q6964
1878.5I8798341P4064N9951O9165O8819L6151L6108O9577O5249M7958L8159L5452L5596
1903I9434590J8657j0544j7912M727Q017k3765m5681p379K2233J6546M7612P9275P0971
1929.5I9597347N3376N3662O3401N9212K7990O14K1964M9836L5846J8626J6350Q201
1954A00006425k908m781J264Q953j049q983Q232K7954K0039Q798J1957J5008Q273P546
1982.5A00106728J1957R191J252o009L34J6725J5366L600r65q404j6058j9264k0754
2009A00093699k4605k9934l9160l7593m0483n1582p7564q0209k7270J2845l016k7716
2033.5I9667412l8040m1347m4012m3548m0042l8117l5113k9511k7376k3252j2231n972
$$ y = [97811073, 97935063, 98063970, 98168105, 98222512, 98257571, 98362249, 98510706, 98624492, 98711377, 98798341, 98872405, 98932356, 99001521, 99070340, 99106491, 99142599, 99212176, 99277425, 99325383, 99363542, 99398994, 99434590, 99453247, 99442703, 99424791, 99429518, 99437535, 99413770, 99368089, 99360710, 99382943, 99399489, 99447101, 99526376, 99597347, 99650723, 99704385, 99767786, 99826998, 99854988, 99855602, 99877566, 99927402, 99963248, 99981874, 99998224, 100006425, 100003517, 99998736, 100000000, 100008953, 100007904, 99998921, 100007153, 100035107, 100055146, 100063944, 100075901, 100090909, 100099182, 100106728, 100118685, 100127876, 100129128, 100123119, 100123453, 100140178, 100155544, 100159144, 100158179, 100149775, 100133717, 100114453, 100093699, 100069094, 100039160, 100000000, 99962407, 99921924, 99870342, 99792778, 99712569, 99685299, 99698144, 99695128, 99667412, 99629372, 99588025, 99544013, 99500465, 99460423, 99422306, 99387193, 99357682, 99330306, 99307054, 99294823, 99288851]
2058I9288851j1605j8471j6445q732l589p009p647m477j0490j8382j3912q887j5432
2084.5I9143773k1189j6385p642q958j8692k1935j5223j3727j8769j8013j6320k1225
2109I8945695k5445j8764j0275j3847k2339j8597p361o718j1849q202m7Q04k098k62
2137.5I8800695P945R823J07j615P826J0210M966O300J3756J6368J4234J6379K4068
2164.1I8931062K6185J8149J9962L7282M4454L5441K6518L0225L7801L3194K4569K6292
2188.5I9291134L5292L7628L3552L5453M1067L8344L3432L6681L8659L6025L7158L9142
2213I9733567L6991L5459L4421L1191K8515K6751K2048J6200J3936J3238P683J0705
2237.5A00010705N662L756j991p928j0168r203r245j1343o610O145J4192J7566J8370
$$ y = [99288851, 99277246, 99258775, 99242330, 99233598, 99230009, 99223000, 99215353, 99210876, 99200386, 99182004, 99168092, 99159205, 99143773, 99122584, 99106199, 99098557, 99089599, 99070907, 99048972, 99033749, 99020022, 99001253, 98983240, 98966920, 98945695, 98920250, 98901486, 98891211, 98877364, 98855025, 98836428, 98829067, 98822349, 98810500, 98802298, 98802251, 98803055, 98800957, 98800695, 98808640, 98818463, 98818570, 98816955, 98824781, 98834991, 98839957, 98846257, 98860013, 98876381, 98890615, 98906994, 98931062, 98957247, 98975396, 98995358, 99032640, 99077094, 99112535, 99139053, 99169278, 99207079, 99240273, 99264842, 99291134, 99326426, 99364054, 99397606, 99433059, 99474126, 99512470, 99545902, 99582583, 99621242, 99657267, 99694425, 99733567, 99770558, 99806017, 99840438, 99871629, 99900144, 99926895, 99948943, 99965143, 99979079, 99992317, 100000000, 100010705, 100016367, 100020123, 100018132, 100010204, 100000036, 99990833, 99981588, 99970245, 99963635, 99969780, 99983972, 100001538, 100019908]
2264A00019908J4770J1516R048M124q70j657m959j2469j3555m446k15q356j2839N36
2292.5A00000536O688M137J323K909M291j752n150N674J2875o68j1992L326K0194P295
2321.1A00049686k1672k3794k813j407M864k6655l4166k9224k1768j9198n4235j08152
2345.6I9711466o5375M2665J06603R7871N6970K4397j3298n8276r1320j00970j02669
2368I9608064j08278j18178j19537j02014q9436q8990p7486n4586m3374n3508o6709
2390.4I8685968o0815n1498o1995p5173p2807o8492p5209q0675p4124o9541p7909q4943
2414.9I7832787p9012p1490p8243r0539q7583p9870q8752j03140j03229r6303j01972
2437.4I6852654j17630j20198j11854j13643j21063j20055j15705j21987j33198j31619
$$ y = [100019908, 100034678, 100046194, 100055242, 100059366, 100058496, 100056839, 100051880, 100039411, 100025856, 100021410, 100021195, 100012839, 100000000, 100000536, 100007224, 100011361, 100012684, 100015593, 100019884, 100018132, 100012982, 100018656, 100031531, 100030863, 100018871, 100022197, 100042391, 100049686, 100028014, 100004220, 100001407, 100000000, 100004864, 99978209, 99944043, 99914819, 99893051, 99873853, 99819618, 99711466, 99646091, 99688756, 99795359, 99893230, 99950200, 99974597, 99961299, 99903023, 99811703, 99710733, 99608064, 99499786, 99381608, 99262071, 99160057, 99070621, 98981631, 98904145, 98849559, 98806185, 98752677, 98685968, 98625153, 98573655, 98511660, 98436487, 98363680, 98295188, 98219979, 98139304, 98065180, 97995639, 97917730, 97832787, 97753775, 97682285, 97604042, 97513503, 97425920, 97346050, 97257298, 97154158, 97050929, 96954626, 96852654, 96735024, 96614826, 96502972, 96389329, 96268266, 96148211, 96032506, 95910519, 95777321, 95645702]
2457.8I5645702j18703j14649j22309j25021j22219j22988j26565j22809j15365j16241
2478.1I4438833j18732j15300j12039j11717Tj07830r8759r6107r8079r1028q0306
2500.6I3297219p7170p6496o9488o1667o1160o4832o5255o3258o4320o8342o6191n6231
2525.1I2502809n4330o6257p4887p0190o6197o8319o6984o4641o8802p2461o5321n8114
2549.5I1706306o6096p7617p5084o6060o7431p8827q4191q0031q1057r0021r3895q9872
2574I0756124r0843j00464j03980r6524r5862j07557j13690j07371j05542j14429j16658
2596.4H9603204j10800j13803j25736j31893j30975j35166j44797j47426j42968j43230
2616.8H8276410j51473j59222j59139j56158j59132j64175j62488j59914j63924j65982
$$ y = [95645702, 95526999, 95412350, 95290041, 95165020, 95042801, 94919813, 94793248, 94670439, 94555074, 94438833, 94320101, 94204801, 94092762, 93981045, 93869328, 93761498, 93662739, 93566632, 93468553, 93377525, 93297219, 93220049, 93143553, 93074065, 93012398, 92951238, 92886406, 92821151, 92757893, 92693573, 92625231, 92559040, 92502809, 92448479, 92382222, 92307335, 92237145, 92170948, 92102629, 92035645, 91971004, 91902202, 91829741, 91764420, 91706306, 91640210, 91562593, 91487509, 91421449, 91354018, 91275191, 91191000, 91110969, 91029912, 90939891, 90845996, 90756124, 90665281, 90564817, 90460837, 90364313, 90268451, 90160894, 90047204, 89939833, 89834291, 89719862, 89603204, 89492404, 89378601, 89252865, 89120972, 88989997, 88854831, 88710034, 88562608, 88419640, 88276410, 88124937, 87965715, 87806576, 87650418, 87491286, 87327111, 87164623, 87004709, 86840785, 86674803]
2637.2H6674803j59865j57648j66631j71530j65713j61529j64085j65082j60145j56701
2657.6H5045874j61326j65856j58906j52206j56707j59281j49822j40638j42908j44040
2678H3514184j35130j27757j28984j30051j23638j13148j12176j21718j22983j16229
2698.4H2282370j17421j26201j29235j27863j33872j43695j49769j54155j58889j64681
2718.8H0876589j67322j59794j50425j47509j45138j38753j36835j45137j48767j39898
2739.2G9397011j32954j35464j37108j32251j30618j37353j41066j36763j37329j44678
2759.6G8031427j46646j43921j45108j49691j55091j59085j60396j65134j72776j75614
2780G6457965j75595j80650j88428j92267j98721k09845k15762k16645k21748k31939
$$ y = [86674803, 86514938, 86357290, 86190659, 86019129, 85853416, 85691887, 85527802, 85362720, 85202575, 85045874, 84884548, 84718692, 84559786, 84407580, 84250873, 84091592, 83941770, 83801132, 83658224, 83514184, 83379054, 83251297, 83122313, 82992262, 82868624, 82755476, 82643300, 82521582, 82398599, 82282370, 82164949, 82038748, 81909513, 81781650, 81647778, 81504083, 81354314, 81200159, 81041270, 80876589, 80709267, 80549473, 80399048, 80251539, 80106401, 79967648, 79830813, 79685676, 79536909, 79397011, 79264057, 79128593, 78991485, 78859234, 78728616, 78591263, 78450197, 78313434, 78176105, 78031427, 77884781, 77740860, 77595752, 77446061, 77290970, 77131885, 76971489, 76806355, 76633579, 76457965, 76282370, 76101720, 75913292, 75721025, 75522304, 75312459, 75096697, 74880052, 74658304, 74426365]
2800.4G4426365k38681k38341k37709k40505k41548k41732k46597k52682k55650k57146
2820.8G1975774k62475k73043k82658k89416k99519l15595l32480l47138l70103m10378
2841.2F8792969m59653n08005n47677n65868n56636n31394n11902n17148n55432o12134
2861.6F3427120o65140p10392p35128p14129o48814n61554m67109l72809k96092k52217
2882E8003736k30134k14034k04170k00927j97071j84930j70981j68592j73199j80018
2902.4E6079680j98227k31654k73502l17746l64238m07970m29875m22281l94493l46154
2922.8E2693540k77430j96075j08779k5749N3984J43379K36982L21156L91209M36014
2943.2E3668231M46409M25076L79479L15774K38758J59222R0366M2844K1076J9283
$$ y = [74426365, 74187684, 73949343, 73711634, 73471129, 73229581, 72987849, 72741252, 72488570, 72232920, 71975774, 71713299, 71440256, 71157598, 70868182, 70568663, 70253068, 69920588, 69573450, 69203347, 68792969, 68333316, 67825311, 67277634, 66711766, 66155130, 65623736, 65111834, 64594686, 64039254, 63427120, 62761980, 62051588, 61316460, 60602331, 59953517, 59391963, 58924854, 58552045, 58255953, 58003736, 57773602, 57559568, 57355398, 57154471, 56957400, 56772470, 56601489, 56432897, 56259698, 56079680, 55881453, 55649799, 55376297, 55058551, 54694313, 54286343, 53856468, 53434187, 53039694, 52693540, 52416110, 52220035, 52111256, 52085507, 52139491, 52282870, 52519852, 52841008, 53232217, 53668231, 54114640, 54539716, 54919195, 55234969, 55473727, 55632949, 55723315, 55766159, 55787235, 55806518]
2963.6E5806518L9285R3329J82265K98440M30459N66167O98531Q07583Q68684Q89265
2984F0680526Q89874Q64321Q04591P22063O29478N32115M31603L37345K56311J83005
3004.4F6331232J14870N5003L171m5669r2703j30570j55765j78784k06906k33877k49576
3026.8F5210426k51711k47502k42907k49082k65657k76918k83670k88957k90728k95699
3047.2F2517595l00139k96408k96610l03632l02089k89011k74723k66093k60085k47163
3067.6E9681642k29263k18433k12491k01684j89233j84292j84399j79439j70470j64508
3088E7747430j61368j59490j61559j65414j65743j66857j72335j78534j81913j83076
3108.4E6051141j90586k02149k09451k14541k19184k30497k46739k51562k46805k47925
$$ y = [55806518, 55845803, 55939132, 56121397, 56419837, 56850296, 57416463, 58114994, 58922577, 59791261, 60680526, 61570400, 62434721, 63239312, 63961375, 64590853, 65122968, 65554571, 65891916, 66148227, 66331232, 66446102, 66501105, 66504276, 66458607, 66365904, 66235334, 66079569, 65900785, 65693879, 65460002, 65210426, 64958715, 64711213, 64468306, 64219224, 63953567, 63676649, 63392979, 63104022, 62813294, 62517595, 62217456, 61921048, 61624438, 61320806, 61018717, 60729706, 60454983, 60188890, 59928805, 59681642, 59452379, 59233946, 59021455, 58819771, 58630538, 58446246, 58261847, 58082408, 57911938, 57747430, 57586062, 57426572, 57265013, 57099599, 56933856, 56766999, 56594664, 56416130, 56234217, 56051141, 55860555, 55658406, 55448955, 55234414, 55015230, 54784733, 54537994, 54286432, 54039627, 53791702]
3128.8E3791702k57725k66283k66213k64197k65813k72072k79736k80273k78223k76053
3149.2E1085114k71123k74122k85804k91118k86138k80011k80765k82991k79423k74149
3169.6D8279470k73049k74944k75785k74545k68566k66066k68800k64814k57528k54246
3189.9D5601127k52989k52137k51844k47831k40528k34792k32169k30318k28274k23655
3210.3D3206590k17294k14994k11954k08390k07117k05717k04360k01953k01761k00585
3230.7D1132465j94457j97593k10613k15014k08885k02277j98361j96717j98972j99896
3251.1C9109680j96770j94958j94060j90744j86843j84083j77926j64422j50126j47835
3271.5C7321913j49700j40244j24946j12867j04028r7758r3156q6987p9179p2640o7702
$$ y = [53791702, 53533977, 53267694, 53001481, 52737284, 52471471, 52199399, 51919663, 51639390, 51361167, 51085114, 50813991, 50539869, 50254065, 49962947, 49676809, 49396798, 49116033, 48833042, 48553619, 48279470, 48006421, 47731477, 47455692, 47181147, 46912581, 46646515, 46377715, 46112901, 45855373, 45601127, 45348138, 45096001, 44844157, 44596326, 44355798, 44121006, 43888837, 43658519, 43430245, 43206590, 42989296, 42774302, 42562348, 42353958, 42146841, 41941124, 41736764, 41534811, 41333050, 41132465, 40938008, 40740415, 40529802, 40314788, 40105903, 39903626, 39705265, 39508548, 39309576, 39109680, 38912910, 38717952, 38523892, 38333148, 38146305, 37962222, 37784296, 37619874, 37469748, 37321913, 37172213, 37031969, 36907023, 36794156, 36690128, 36592370, 36499214, 36412227, 36333048, 36260408, 36192706]
3294C6192706o5708o5717o4439o3607o0907n8958o5624p5189p7161p2533p0768p3493
3318.4C5378602p6628q0797q6406r0366r2062r5541r8645r6757r6008j03399j15192
3340.9C4346801j19263j16601j14239j11741j17549j28472j31470j28278j23328j20029
3361.3C3135831j20902j19474j17645j22374j29530j26627j14331j07264j04580j02174
3381.7C1970930r6470q3834o4540n6434p3286q5319p2911n2121m2874n2318o3523n5397
3406.1C1171903m0930l5078l2207l2518l0431k0092j4794r319R018K2101K5579K7922
3430.6C1041154M0120N6005M9439L1486L3754N5349O9409O8588P7238R6923J01734
3453.1C1721199J02952J17424J28135J15710J12734J40756J57595J38533J08900J09375
$$ y = [36192706, 36126998, 36061281, 35996842, 35933235, 35872328, 35813370, 35747746, 35672557, 35595396, 35522863, 35452095, 35378602, 35301974, 35221177, 35134771, 35044405, 34952343, 34856802, 34758157, 34661400, 34565392, 34461993, 34346801, 34227538, 34110937, 33996698, 33884957, 33767408, 33638936, 33507466, 33379188, 33255860, 33135831, 33014929, 32895455, 32777810, 32655436, 32525906, 32399279, 32284948, 32177684, 32073104, 31970930, 31874460, 31790626, 31726086, 31669652, 31596366, 31511047, 31438136, 31386015, 31343141, 31290823, 31227300, 31171903, 31130973, 31095895, 31063688, 31031170, 31000739, 30980647, 30965853, 30956534, 30965552, 30987653, 31013232, 31041154, 31081274, 31137279, 31186718, 31218204, 31251958, 31307307, 31376716, 31445304, 31522542, 31619465, 31721199, 31824151, 31941575, 32069710, 32185420, 32298154, 32438910, 32596505, 32735038, 32843938, 32953313]
3473.4C2953313J32269J58319J63343J40974J42533J70227J73426J63713J73229J86709
3493.8C4558055J95628J96469J95092J93113J87329J88040J97956K17954K42689K43723
3514.2C6616048K26072K28944K46599K65336K68466K53835K55850K87801L15061L18530
3534.6C9282542L12248L14877L35318L47238L38251L26925L46229L69090L78322L97831
3555D2748871M17802M27595M31004M21980L94842M27637N27101N61440N39586N39333
3575.4D7437191N57023N78165O07619O13350N75831N75805O71411P03823O71333O86062
3595.8E3677613P28869P39974P48688P53015P16317P09879P52705P76148P98667P96389
3616.2F1198264P65378Q15069Q59130Q13764P16806O72626Q03506Q58343Q13103P81870
$$ y = [32953313, 33085582, 33243901, 33407244, 33548218, 33690751, 33860978, 34034404, 34198117, 34371346, 34558055, 34753683, 34950152, 35145244, 35338357, 35525686, 35713726, 35911682, 36129636, 36372325, 36616048, 36842120, 37071064, 37317663, 37582999, 37851465, 38105300, 38361150, 38648951, 38964012, 39282542, 39594790, 39909667, 40244985, 40592223, 40930474, 41257399, 41603628, 41972718, 42351040, 42748871, 43166673, 43594268, 44025272, 44447252, 44842094, 45269731, 45796832, 46358272, 46897858, 47437191, 47994214, 48572379, 49179998, 49793348, 50369179, 50944984, 51616395, 52320218, 52991551, 53677613, 54406482, 55146456, 55895144, 56648159, 57364476, 58074355, 58827060, 59603208, 60401875, 61198264, 61963642, 62778711, 63637841, 64451605, 65168411, 65841037, 66644543, 67502886, 68315989, 69097859]
3636.6F9097859P58099P50751P51233P07721O16533O00117P49791Q14587P20662O89208
3657G6256561P23446O78968O21444O06573N39893M46552N13494N31971M22597N05841
3677.4H1847340N95909N61011N33396M77523L61472K99162L99738M73821M32742L61502
3697.8H6343616K88224K44964K98619L37303K62653J37324J29246K98202L62552K87044
3718.2H8989747K07096J76930J72824J95485K58965K31659J08802M6474J34927K81197
3738.6I0804106L01790J16015l1573J59198J92791L3325J46002L08305K49493J45084
3759I2424536J69235K01893J50102J13625R5588J31327K06130K00773J28585P6550
3779.4I3898344J19066J44542J20997J38682J58608J53309J13619N7762P6861N3101
$$ y = [69097859, 69855958, 70606709, 71357942, 72065663, 72682196, 73282313, 74032104, 74846691, 75567353, 76256561, 76980007, 77658975, 78280419, 78886992, 79426885, 79873437, 80386931, 80918902, 81341499, 81847340, 82443249, 83004260, 83537656, 84015179, 84376651, 84675813, 85075551, 85549372, 85982114, 86343616, 86631840, 86876804, 87175423, 87512726, 87775379, 87912703, 88041949, 88340151, 88702703, 88989747, 89196843, 89373773, 89546597, 89742082, 90001047, 90232706, 90341508, 90387982, 90522909, 90804106, 91105896, 91221911, 91190338, 91349536, 91542327, 91575652, 91721654, 92029959, 92279452, 92424536, 92593771, 92795664, 92945766, 93059391, 93154979, 93286306, 93492436, 93693209, 93821794, 93898344, 94017410, 94161952, 94282949, 94421631, 94580239, 94733548, 94847167, 94904929, 94981790, 95034891]
3799.8I5034891M274J34188J48332R5952J84655K05368P8976j7208M6998J8889M1014
3822.2I5976329J96361J81193J25604R6727O8402P9775K3580l8743O3574J50323J61159
3844.6I7084284J78671J64717K3973k30598r6959K64489K66481J25062K0004M0430
3865I7840554R0110J6320J7023J08766J43481J34438K4771j734P2807M5633P3725Q1790
3889.5I8647684P802O7258J31708M0436o2519o2901q273R1147J52481J04171M6378
3912I9155372K1232j6821k0522L2848M7565J8895K7143L8207K223k926N0473O9028
3936.4I9422717L6967N12j3589J8078L9136K2006K4575M0609L8469K4247J2642M393
3960.9I9670762Q160K0319J5610Q190J2648J4860J3589J1349J0055K3497L6174K3776
$$ y = [95034891, 95039165, 95173353, 95321685, 95417637, 95602292, 95807660, 95886636, 95869428, 95916426, 95935315, 95976329, 96172690, 96353883, 96479487, 96576214, 96644616, 96724391, 96747971, 96709228, 96772802, 96923125, 97084284, 97262955, 97427672, 97451645, 97221047, 97124088, 97388577, 97655058, 97780120, 97800124, 97840554, 97930664, 97946984, 97964007, 98072773, 98216254, 98350692, 98375463, 98373729, 98446536, 98492169, 98565894, 98647684, 98655486, 98722744, 98854452, 98894888, 98832369, 98769468, 98761195, 98852342, 99004823, 99108994, 99155372, 99176604, 99159783, 99139261, 99172109, 99219674, 99238569, 99265712, 99303919, 99306142, 99303216, 99353689, 99422717, 99459684, 99460196, 99446607, 99464685, 99503821, 99525827, 99550402, 99591011, 99629480, 99653727, 99666369, 99670762, 99678922, 99699241, 99714851, 99723041, 99735689, 99750549, 99764138, 99775487, 99785542, 99809039, 99845213, 99868989]
3985.4I9868989O211M482J6201L2806L7134L4177
3997.6A00000000
$$ y = [99868989, 99875200, 99879682, 99895883, 99928689, 99965823, 100000000]
##END=$$ End of the data block
