##TITLE=$$ Begin of the data block
##JCAMP-DX=5.00 $$ ACD/SpecManager v 10.08
##SPECTROMETER/DATA SYSTEM=16PC
##DATE=Tue Sep 03 11:04:08 2013
##DATA TYPE=INFRARED SPECTRUM
##DATA CLASS=XYDATA
##ORIGIN=
##OWNER=
##NPOINTS=3601
##FIRSTX=400.00000000
##LASTX=4000.00000000
##MAXX=4000.00000000
##MINX=400.00000000
##MAXY=38.69048691
##MINY=15.57260990
##XFACTOR=1.0000000000
##YFACTOR=0.000000100000000
##FIRSTY=19.55844307
##DELTAX=1.00000000
##XUNITS=1/CM
##YUNITS=TRANSMITTANCE
##XYDATA=(X++(Y..Y))
$$ plain form
400 195584431 245741234 285534286 311948547 326098213 331780434 333212128 333249550 332886314 331930771
409 331930771 330092850 327658806 325417786 324118195 324015541 324881897 326400642 328545609 331581764
418 331581764 335671806 340422325 344780235 347439957 347537346 345183182 341479568 338000717 336050148
427 336050148 336120529 337820892 340236664 342455215 343953438 344688301 344929695 345000000 345083504 345181694
437 345181694 345192223 345034447 344743996 344487839 344494019 344926910 345771980 346798820 347643661 347985268
447 347985268 347725792 347069473 346440125 346276779 346823921 348039742 349668083 351413231 353091660
456 353091660 354662590 356135254 357444572 358412132 358837700 358666153 358100510 357557716 357466278 358013992
466 358013992 359004555 359923134 360192528 359486580 357929649 356073952 354668045 354336510 355334358 357484627
$$ packed form
400A95584431N0156803L9793052K6414261J4149666N682221J431694L7422l63236r55543
409C31930771j837921k434044k241020j299591j02654Q66356J518745K144967L036155
418C31581764M090042M750519M357910K659722R7389k354164l703614l478851j950569
427C36050148P0381J700363K415772K218551J498223P34863K41394P0305Q3504R8190
437C45181694J0529j57776k90451k56157O180M32891Q45070J026840Q44841L41607
447C47985268k59476o56319o29348j63346N47142J215821J628341J745148J678429
456C53091660J570930J472664J309318R67560M25568j71547n65643n42794r1438N47714
466C58013992R90563R18579K69394p05948j556931j855697j405907l31535R97848K150269
$$ plain form
476 357484627 360305405 363238297 365849991 367919655 369402084 370329208 370735207 370652313 370163956
485 370163956 369453316 368787994 368430862 368519173 368988457 369591370 370008240 369991684 369470291 368561897
495 368561897 367502251 366536560 365831718 365445099 365347977 365474396 365761261 366162643 366640892 367150879
505 367150879 367635765 368041077 368341026 368558884 368764877 369041481 369431305 369894295 370309486 370530586
515 370530586 370472145 370174370 369795189 369519386 369429550 369422073 369234390 368586235 367361145 365716057
525 365716057 364043655 362795982 362266045 362457886 363114166 363881645 364503479 364922066 365235901 365557556
535 365557556 365879860 366047935 365856361 365206490 364212151 363180351 362471046 362316818 362708626 363409004
545 363409004 364079590 364444504 364401245 364029045 363507080 363004150 362602577 362291107 362011833 361721115
$$ packed form
476C57484627K820778K932892K611694K069664J482429R27124M05999q2894m88357
485C70163956p10640o65322l57132Q8311M69284O02913M16870j6556n21393r08394
495C68561897j059646r65691p04842l86619r7122J26419K86865M01382M78249N09987
505C67150879M84886M05312K99949K17858K05993K76604L89824M62990M15191K21100
515C70530586n8441k97775l79181k75803q9836p477j87683o48155j225090j645088
525C65716057j672402j247673n29937J91841O56280P67479O21834M18587L13835L21655
535C65557556L22304J68075j91574o49871r94339j031800p09305j54228L91808P00378
545C63409004O70586L64914m3259l72200n21965n02930m01573l11470k79274k90718
$$ plain form
555 361721115 361422501 361156273 360962296 360841179 360739021 360559082 360190315 359539337 358559952 357279472
565 357279472 355818291 354390564 353268318 352700043 352804298 353483467 354410477 355116310 355158920 354302902
575 354302902 352628365 350512047 348484383 347027016 346401100 346577415 347289658 348170586 348904953
584 348904953 349331245 349461098 349424973 349378700 349419327 349540482 349642143 349581032 349237900 348568954 347622833
595 347622833 346517715 345393944 344367065 343502274 342815323 342292099 341905861 341624641 341408844 341212807
605 341212807 341001778 340778961 340608292 340610619 340927162 341663055 342840576 344386978 346163864 348020897
615 348020897 349840622 351552429 353111763 354468384 355552559 356297951 356690559 356810570 356830521
624 356830521 356954002 357320328 357924194 358605919 359127464 359304771 359121437 358753891 358483849 358538628
$$ packed form
555C61721115k98614k66228j93977j21117j02158j79939l68767o50978r79385j280480
565C57279472j461181j427727j122246n68275J04255O79169R27010P05833M2610q56018
575C54302902j674537k116318k027664j457367o25916J76315P12243Q80928P34367
584C48904953M26292J29853l6125m6273M0627J21155J01661o1111l43132o68946r46121
595C47622833j105118j123771j026879q64791o86951n23224l86238k81220k15797j96037
605C41212807k11029k22817j70669K327L16543P35893J177521J546402J776886J857033
615C48020897J819725J711807J559334J356621J084175P45392L92608J20011J9951
624C56830521J23481L66326O03866O81725N21545J77307j83334l67546k70042N4779
$$ plain form
634 358538628 358954086 359542236 359992981 360054703 359687691 359099197 358637619 358609352 359125938 360064735
644 360064735 361153450 362114677 362780724 363125687 363221054 363168373 363057518 362959518 362927628 362981300 363080978
655 363080978 363133812 363063698 362920380 362951126 363542595 365016785 367369308 370117073 372393150 373297005
665 373297005 372341728 369758797 366470375 363719635 362538795 363325653 365735893 368917084 371929703
674 371929703 374124069 375302734 375643387 375489426 375154724 374836235 374629478 374581795 374718208 375025482
684 375025482 375430374 375811424 376052551 376104469 376008873 375866203 375770988 375761719 375818176 375903015 376009827
695 376009827 376178627 376466026 376893234 377411842 377913094 378276520 378428497 378375092 378193626 377991486
705 377991486 377856674 377824936 377876663 377957344 378011131 378008575 377959938 377906609 377897377 377960815 378087311 378231392
$$ packed form
634C58538628M15458N88150M50745O1722l67012n88494m61578k8267N16586R38797
644C60064735J088715R61227O66047L44963R5367n2681j10855r8000l1890N3672R9678
655C63080978N2834p0114j43318L0746N91469J474190K352523K747765K276077R03855
665C73297005r55277k582931l288422k750740j180840P86858K410240L181191L012619
674C71929703K194366J178665L40653j53961l34702l18489k06757m7683J36413L07274
684C75025482M04892L81050K41127N1918r5596j42670r5215r269N6457Q4839J06812
695C76009827J68800K87399M27208N18608N01252L63426J51977n3405j81466k02140
705C77991486j34812l1738N1727Q0681N3787k556m8637n3329r232O3438J26496J44081
$$ plain form
717 378231392 378331299 378333626 378208542 377948036 377555046 377038040 376422768 375773125 375203590 374861221 374876442
728 374876442 375303726 376086464 377072639 378076096 378950577 379636688 380154037 380552940 380858421 381048393
738 381048393 381079712 380943375 380707855 380516434 380531693 380856552 381475143 382253075 382998238 383553658
748 383553658 383872681 384037399 384207764 384531097 385058670 385715942 386340599 386766357 386904869 386779938
758 386779938 386496544 386169319 385854225 385528984 385131607 384627380 384058418 383537407 383186378 383058739
768 383058739 383095741 383147659 383049316 382705956 382136726 381454163 380794182 380244293 379812355 379450302 379112434
779 379112434 378801880 378573494 378489647 378557930 378694305 378741379 378536530 377994041 377155533 376177521 375260963
790 375260963 374560432 374121819 373882904 373732262 373591843 373470306 373454361 373643532 374067650 374642105
$$ packed form
717C78231392R9907K327j25084k60506l92990n17006o15272o49643n69535l42369J5221
728C74876442M27284P82738R86175J003457Q74481O86111N17349L98903L05481J89972
738C81048393L1319j36337k35520j91421J5259L24859O18591P77932P45163N55420
748C83553658L19023J64718J70365L23333N27573O57272O24657M25758J38512j24931
758C86779938k83394l27225l15094l25241l97377n04227n68962n21011l51029j27639
768C83058739L7002N1918r8343l43360n69230o82563o59981n49889m31938l62053l37868
779C79112434l10554k28386q3847O8283J36375M7074k04849n42489q38508r78012r16558
790C75260963p00531m38613k38915j50642j40419j21537j5945J89171M24118N74455
$$ plain form
800 374642105 375192871 375543022 375610085 375457611 375263939 375224724 375441551 375862274 376306152 376560440
810 376560440 376493073 376118202 375582428 375084724 374777451 374705429 374807739 374974022 375114784 375204773 375280685
821 375280685 375402946 375609818 375892334 376198997 376461868 376625328 376660461 376562805 376341515 376009903
831 376009903 375583954 375086555 374549599 374009628 373497543 373028297 372599106 372197571 371815720 371461449
841 371461449 371159134 370937729 370810928 370761871 370740700 370680084 370523643 370254097 369908066 369566727 369325600
852 369325600 369255447 369371834 369628143 369935417 370198669 370349808 370365181 370258293 370059128 369794998
862 369794998 369484177 369143982 368804207 368510323 368310356 368230820 368255081 368320312 368336067 368217583 367917290
873 367917290 367439690 366836357 366185722 365570717 365062294 364711609 364548607 364582367 364803619 365189171
$$ packed form
800C74642105N50766L50151O7063j52474j93672l9215K16827M20723M43878K54288
810C76560440o7367l74871n35774m97704l07273p2022J02310J66283J40762Q9989P5912
821C75280685J22261K06872K82516L06663K62871J63460L5133r7656k21290l31612
831C76009903m25949m97399n36956n39971n12085m69246m29191m01535l81851l54271
841C71461449l02315k21405j26801m9057k1171o0616j56441k69546l46031l41339k41127
852C69325600p0153J16387K56309L07274K63252J51139J5373j06888j99165k64130
862C69794998l10821l40195l39775k93884j99967p9536K4261O5231J5755j18484l00293
873C67917290m77600o03333o50635o15005n08423l50685j63002L3760K21252L85552
$$ plain form
883 365189171 365710411 366341209 367062531 367859650 368714027 369597740 370474701 371310654 372083092 372784042
893 372784042 373410683 373951035 374375801 374646492 374737129 374655418 374446831 374174423 373886147 373590851
903 373590851 373263626 372879410 372452850 372055321 371787720 371721077 371840973 372033234 372130241 371995888
913 371995888 371601219 371043854 370494652 370102501 369912148 369845467 369757729 369533043 369159203 368736000
923 368736000 368409882 368276367 368310471 368367729 368256493 367839088 367104988 366174393 365234680 364446526
933 364446526 363871994 363460426 363095284 362670898 362156372 361613503 361161537 360912857 360912018 361113434 361407394
944 361407394 361680031 361875076 362024040 362227020 362594185 363178368 363937149 364747467 365464630 365995865
954 365995865 366344833 366601715 366883469 367260170 367711525 368140869 368440170 368565559 368575516 368606071 368792343
$$ packed form
883C65189171N21240O30798P21322P97119Q54377Q83713Q76961Q35953P72438P00950
893C72784042O26641N40352M24766K70691R0637q1711k08587k72408k88276k95296
903C73590851l27225l84216m26560l97529k67601o6643J19896J92261R7007j34353
913C71995888l94669n57365n49202l92151j90353o6681q7738k24686l73840m23203
923C68736000l26118j33515L4104N7258j11236m17405p34100r30595r39713p88154
933C64446526n74532m11568l65142m24386n14526n42869m51966k48680q39K01416K93960
944C61407394K72637J95045J48964K02980L67165N84183P58781Q10318P17163N31235
954C65995865L48968K56882K81754L76701M51355M29344K99301J25389R957L0555J86272
$$ plain form
965 368792343 369182663 369697762 370161400 370389862 370289268 369906807 369405670 368978844 368751373 368725586
975 368725586 368797836 368830223 368732529 368503799 368213158 367936401 367693329 367426033 367031136 366425056 365599823
986 365599823 364637108 363671150 362825890 362161484 361656990 361235275 360809021 360322456 359767151 359171715
996 359171715 358575249 358002815 357453575 356904640 356323738 355684128 354974213 354200134 353381271 352542534
1006 352542534 351706963 350894165 350123177 349419098 348814201 348341293 348018875 347837029 347755280 347716980
1016 347716980 347674255 347609558 347538567 347491074 347481461 347489510 347465477 347361069 347165222 346922150 346716118
1027 346716118 346630859 346705704 346916656 347192192 347453880 347655029 347794647 347900505 347995644 348073578 348099098
1038 348099098 348034515 347871323 347644882 347420311 347257957 347178650 347152863 347120628 347031212 346879768 346719246
$$ packed form
965C68792343L90320N15099M63638K28462j00594l82461n01137m26826k27471k5787
975C68725586P2250L2387r7694k28730k90641k76757k43072k67296l94897o06080q25233
986C65599823r62715r65958q45260o64406n04494m21715m26254m86565n55305n95436
996C59171715n96466n72434n49240n48935n80902o39610p09915p74079q18863q38737
1006C52542534q35571q12798p70988p04079o04897m72908l22418j81846q1749l8300
1016C47716980m2725o4697p0991m7493r613Q049k4033j04408j95847k43072k06032
1027C46716118q5259P4845K10952K75536K61688K01149J39618J05858R5139P7934K5520
1038C48099098o4583j63192k26441k24571j62354p9307k5787l2235q9416j51444j60522
$$ plain form
1049 346719246 346638527 346720352 346998634 347439232 347953110 348434830 348807755 349053650 349213676 349361382
1059 349361382 349562721 349843216 350176926 350502701 350756378 350902252 350945625 350922279 350872040 350813866 350739403
1070 350739403 350628090 350475388 350312805 350204620 350217819 350380211 350654373 350942650 351128159 351130524
1080 351130524 350946922 350654221 350371170 350199318 350176010 350264053 350380783 350447655 350430260 350347328 350246658
1091 350246658 350167274 350113678 350057030 349960403 349808350 349619637 349433365 349280472 349159203 349034119 348861084
1102 348861084 348621979 348347473 348109741 347988281 348025284 348196907 348415680 348565903 348552971 348343811
1112 348343811 347980347 347558327 347186356 346941299 346841393 346847992 346892166 346912003 346882477 346822243 346775970
1123 346775970 346783638 346856041 346971550 347097359 347220306 347365227 347585983 347930450 348400917 348936501
$$ packed form
1049C46719246q0719Q1825K78282M40598N13878M81720L72925K45895J60026J47706
1059C49361382K01339K80495L33710L25775K53677J45874M3373k3346n0239n8174p4463
1070C50739403j11313j52702j62583j08185J3199J62392K74162K88277J85509K365
1080C51130524j83602k92701k83051j71852k3308Q8043J16730O6872j7395q2932j00670
1091C50246658p9384n3596n6648r6627j52053j88713j86272j52893j21269j25084j73035
1102C48861084k39105k74506k37732j21460L7003J71623K18773J50223j2932k09160
1112C48343811l63464m22020l71971k45057r9906O599M4174J9837k9526o0234m6273
1123C46775970P668P2403J15509J25809J22947J44921K20756L44467M70467N35584
$$ plain form
1133 348936501 349434700 349803391 350015030 350128288 350262833 350537491 351007919 351639862 352335205 352994118
1143 352994118 353576622 354125671 354738274 355501747 356433525 357461853 358459206 359309425 359970970 360498161
1153 360498161 361007423 361606903 362327957 363097763 363770180 364199066 364315491 364165192 363887138 363641510
1163 363641510 363529129 363543167 363581886 363511810 363245544 362790642 362242432 361728706 361338501 361078720
1173 361078720 360879097 360640450 360293617 359834595 359316788 358810310 358355865 357942696 357523193 357050896
1183 357050896 356516838 355958977 355438957 355000496 354635773 354281082 353846436 353262901 352521744 351683197
1193 351683197 350849495 350116653 349530983 349072380 348674049 348265038 347813148 347343597 346923370 346620750
1203 346620750 346462784 346414452 346393433 346310616 346115570 345820122 345486488 345187378 344961205 344788017
$$ packed form
1133C48936501M98199L68691K11639J13258J34545K74658M70428O31943O95343O58913
1143C52994118N82504N49049O12603P63473R31778J028328R97353Q50219O61545N27191
1153C60498161N09262N99480P21054P69806O72417M28886J16425j50299k78054k45628
1163C63641510j12381J4038L8719p0076k66266m54902n48210n13726l90205k59781
1173C61078720j99623k38647l46833m59022n17807n06478m54445m13169m19503m72297
1183C57050896n34058n57861n20020m38461l64723l54691m34646n83535p41157q38547
1193C51683197q33702p32842n85670m58603l98331m09011m51890m69551m20227l02620
1203C46620750j57966m8332k1019q2817j95046k95448l33634k99110k26173j73188
$$ plain form
1213 344788017 344602699 344335594 343956604 343497238 343034668 342649536 342383804 342223854 342120056 342026482
1223 342026482 341934929 341877213 341895256 341998062 342138367 342226219 342177238 341963730 341638451 341311836 341095963
1234 341095963 341046448 341138496 341287880 341404686 341444511 341427040 341413574 341458664 341570587 341704369 341792030
1245 341792030 341791344 341720619 341657524 341700706 341915054 342292404 342749939 343167458 343442192 343530617 343456573
1256 343456573 343282814 343067284 342831192 342559013 342227058 341842575 341463051 341182709 341089973 341218872
1266 341218872 341524620 341897507 342210159 342374916 342381020 342293358 342215118 342232742 342373428 342594872 342812538
1277 342812538 342949333 342980156 342946701 342933617 343017082 343215332 343470726 343675346 343730545 343604660 343356361
1288 343356361 343105698 342968712 342993050 343132629 343278198 343326454 343244820 343094177 342994995 343056908 343314171
$$ packed form
1213C44788017j85318k67105l78990m59366m62570l85132k65732j59950j03798r3574
1223C42026482r1553n7716J8043J02806J40305Q7852m8981k13508l25279l26615k15873
1234C41095963m9515R2048J49384J16806L9825j7471j3466M5090J11923J33782Q7661
1245C41792030o86p0725o3095M3182K14348L77350M57535M17519K74734Q8425p4044
1256C43456573j73759k15530k36092k72179l31955l84483l79524k80342r2736J28899
1266C41218872L05748L72887L12652J64757O104q7662p8240J7624J40686K21444K17666
1277C42812538J36795L0823l3455j3084Q3465J98250K55394K04620N5199j25885k48299
1288C43356361k50663j36986K4338J39579J45569M8256q1634j50643r9182O1913K57263
$$ plain form
1299 343314171 343704758 344103889 344392204 344517250 344515076 344482880 344520454 344678535 344940872 345247879 345543976
1310 345543976 345814781 346091881 346420593 346815071 347230339 347574768 347758026 347746925 347592545 347410202
1320 347410202 347320251 347384109 347574692 347797890 347952232 347991104 347951317 347933998 348052711 348377762 348903961
1331 348903961 349552917 350200539 350715866 350999298 351011543 350789452 350439339 350105629 349918137 349940453
1341 349940453 350145493 350434341 350689621 350832558 350848083 350764580 350607834 350366440 349998169 349474678
1351 349474678 348829536 348168526 347625465 347286949 347133942 347040138 346831512 346372337 345626945 344667168
1361 344667168 343628769 342649841 341827393 341205673 340787010 340544434 340423241 340339203 340186005 339864693
1371 339864693 339322319 338582077 337744102 336953850 336352234 336031876 336014290 336252365 336649590 337085114
$$ packed form
1299C43314171L90587L99131K88315J25046k174l2196L7574J58081K62337L07007K96097
1310C45543976K70805K77100L28712L94478M15268L44429J83258j1101j54380j82343
1320C47410202q9951O3858J90583K23198J54342L8872l9787j7319J18713L25051N26199
1331C48903961O48956O47622N15327K83432J2245k22091l50113l33710j87492K2316
1341C49940453K05040K88848K55280J42937J5525q3503j56746k41394l68271n23491
1351C49474678o45142o61010n43061l38516j53007r3804k08626m59175p45392r59777
1361C44667168j038399r78928q22448o21720m18663k42576j21193q4038j53198l21312
1371C39864693n42374p40242q37975p90252o01616l20358j7586K38075L97225M35524
$$ plain form
1381 337085114 337439232 337619286 337587013 337377853 337103119 336921730 336983147 337358627 337993164 338705101
1391 338705101 339244461 339392776 339058723 338324203 337412224 336588821 336047478 335833206 335844879 335908890
1401 335908890 335876923 335693130 335396805 335072327 334789772 334579582 334453125 334442940 334618645 335052490
1411 335052490 335748215 336579819 337291374 337573662 337190094 336092339 334464912 332672806 331130486
1420 331130486 330145836 329806366 329955597 330275078 330438499 330270424 329831543 329379997 329218292 329500885
1430 329500885 330108147 330668373 330729294 329993057 328487778 326577415 324807091 323669395 323414612
1439 323414612 323989716 325106087 326372986 327423286 327999840 328014832 327598495 327115173 327091484 328017731
1449 328017731 330071716 332904587 335655975 337264519 336967888 334734764 331364708 328154640 326282616
$$ packed form
1381C37085114L54118J80054l2273k09160k74734j81389O1417L75480O34537P11937
1391C38705101N39360J48315l34053p34520r11979q23403n41343k14272J1673O4011
1401C35908890l1967j83793k96325l24478k82555k10190j26457j0185J75705M33845
1411C35052490O95725Q31604P11555K82288l83568j097755j627427j792106j542320
1420C31130486r84650l39470J49231L19481J63421j68075m38881m51546j61705K82593
1430C29500885O07262N60226O0921p36237j505279j910363j770324j137696k54783
1439C23414612N75104J116371J266899J050300N76554J4992m16337m83322k3689R26247
1449C28017731K053985K832871K751388J608544k96631k233124l370056l210068j872024
$$ plain form
1458 326282616 326239853 327634506 329479942 330795250 331160583 330901794 330810852 331591568 333378754 335621147
1468 335621147 337384224 337876320 336879654 334845543 332627602 331035042 330470314 330834274 331705666
1477 331705666 332648544 333453064 334186668 335060921 336222115 337600212 338900719 339737015 339833336 339194183
1487 339194183 338152733 337260818 337049141 337755432 339156761 340618439 341383286 340989952 339606895
1496 339606895 338069687 337538223 338905754 342255630 346682892 350621109 352542572 351678963 348385010
1505 348385010 343957748 340022316 337821617 337771950 339465523 342039757 344650955 346788597 348315163
1514 348315163 349301682 349828033 349885902 349414520 348399048 346944771 345280647 343709679 342541466
1523 342541466 342026558 342289085 343261719 344661140 346056862 347050285 347494698 347626381 347985954 349122925
$$ packed form
1458C26282616m2763J394653J845436J315308L65333k58789r0942P80716J787186K242393
1468C35621147J763077M92096r96666k034111k217941j592560n64728L63960Q71392
1477C31705666R42878Q04520P33604Q74253J161194J378097J300507Q36296R6321o39153
1487C39194183j041450q91915k11677P06291J401329J461678P64847l93334j383057
1496C39606895j537208n31464J367531L349876M427262L938217J921463q63609l293953
1505C48385010m427262l935432k200699m9667J693573K574234K611198K137642J526566
1514C48315163R86519N26351N7869m71382j015472j454277j664124j570968j168213
1523C42541466n14908K62527R72634J399421J395722R93423M44413J31683L59573J136971
$$ plain form
1533 349122925 351225052 353888893 356202583 357134476 356042404 353030090 348953056 345065689 342491417
1542 342491417 341781158 342762032 344720001 346795464 348390656 349405785 350216675 351420212 353465691
1551 353465691 356330261 359391899 361580696 361784058 359358482 354520607 348408356 342729950 339116936
1560 339116936 338459816 340542870 344168625 347722893 349907265 350279121 349339409 348150177 347704239
1569 347704239 348392601 349838104 351158142 351481514 350424690 348276749 345819931 343915634 343094597
1578 343094597 343362808 344290466 345293236 345928650 346055145 345802956 345421295 345112762 344945908 344867897
1588 344867897 344777184 344596558 344309120 343952370 343589859 343278160 343042221 342862892 342683868 342439232
1598 342439232 342092934 341663704 341211853 340788345 340381660 339912262 339299698 338567924 337906075 337612877
$$ packed form
1533C49122925K102127K663841K313690R31893j092072l012314m077034l887367k574272
1542C42491417p10259R80874J957969K075463J595192J015129Q10890J203537K045479
1551C53465691K864570L061638K188797K03362k425576m837875o112251n678406l613014
1560C39116936o57120K083054L625755L554268K184372L71856r39712j189232m45938
1569C47704239O88362J445503J320038L23372j056824k147941k456818j904297q21037
1578C43094597K68211R27658J002770O35414J26495k52189l81661l08533j66854p8011
1588C44867897r0713j80626k87438l56750l62511l11699k35939j79329j79024k44636
1598C42439232l46298m29230m51851m23508m06685m69398o12564p31774o61849k93198
$$ plain form
1608 337612877 337921371 338798943 339862061 340496941 340153351 338656120 336344604 333938866 332192955
1617 332192955 331525421 331832695 332581139 333110199 332967873 332103348 330844193 329712791 329200783 329604568
1627 329604568 330951195 332990417 335226707 336998367 337637024 336708183 334260597 330946693 327892914
1636 327892914 326303749 326942863 329741516 333765297 337609062 340061569 340706787 340130844 339585533
1645 339585533 340257339 342527008 345645599 348051071 348195419 345447426 340557747 335393028 332051010
1654 332051010 331826782 334600563 338981667 343109741 345640793 346354332 346069145 345983658 346888351
1663 346888351 348739014 350808487 352248840 352650757 352232590 351576920 351154747 351006012 350807953
1672 350807953 350264740 349508057 349181671 350102844 352690849 356536598 360417290 362796707 362557297
$$ packed form
1608C37612877L08494Q77572J063118O34880l43590j497231k311516k405738j745911
1617C32192955o67534L07274P48444N29060j42326q64525j259155j131402n12008M03785
1627C29604568J346627K039222K236290J771660O38657r28841k447586l313904l053779
1636C27892914j589165O39114K798653M023781L843765K452507O45218n75943n45311
1645C39585533O71806K269669L118591K405472J44348k747993m889679n164719l342018
1654C32051010k24228K773781M381104M128074K531052P13539k85187q5487R04693
1663C46888351J850663K069473J440353M01917m18167o55670m22173j48735j98059
1672C50807953n43213p56683l26386R21173K588005L845749L880692K379417k39410
$$ plain form
1681 362557297 359564667 354761925 349751396 346097794 344710274 345590515 348014069 350985222 353694839
1690 353694839 355752792 357129211 357911301 358071785 357408371 355685692 352873077 349306412 345645752
1699 345645752 342628365 340744553 340020447 340037498 340183640 340001335 339437904 338860054 338823013 339718666
1709 339718666 341491089 343571281 345072784 345160522 343425598 340093269 335966797 332122536 329486923
1718 329486923 328479271 328886795 330031242 331149750 331794281 332035713 332353935 333272400 334945641
1727 334945641 336955223 338456345 338612556 337075691 334227486 331028938 328553848 327468452 327750130
1736 327750130 328791008 329805183 330284500 330239143 330102386 330389023 331331673 332714157 333985863
1745 333985863 334569588 334173546 332936249 331342163 329980125 329284859 329391098 330144463 331227760
$$ packed form
1681C62557297k992630m802742n010529l653602j387520Q80241K423554K971153K709617
1690C53694839K057953J376419P82090J60484o63414j722679k812615l566665l660660
1699C45645752l017387j883812p24106J7051J46142j82305n63431n77850l7041Q95653
1709C39718666J772423K080192J501503Q7738j734924l332329m126472l844261k635613
1718C29486923j007652M07524J144447J118508O44531K41432L18222R18465J673241
1727C34945641K009582J501122J56211j536865k848205l198548k475090j085396K81678
1736C27750130J040878J014175M79317m5357j36757K86637R42650J382484J271706
1745C33985863N83725l96042j237297j594086j362038o95266J06239P53365J083297
$$ plain form
1754 331227760 332313232 333164291 333661499 333783836 333586655 333205681 332866135 332857819 333443947 334725266
1764 334725266 336524773 338379860 339680977 339918442 338923492 336976738 334714127 332869530 331978302
1773 331978302 332186241 333245735 334675140 335981979 336835213 337129860 336957169 336534424 336138649
1782 336138649 336046448 336460953 337421989 338737869 340002708 340732346 340582733 339543076 337985115
1791 337985115 336518059 335707893 335806046 336634064 337689056 338408241 338450737 337847824 336955528 336250076
1801 336250076 336084404 336530914 337374954 338245468 338800507 338874168 338521423 337955780 337426682 337104836
1811 337104836 337030144 337137299 337328644 337543221 337782516 338083725 338470001 338918228 339365005 339740753
1821 339740753 340001297 340128937 340109749 339913139 339505386 338892784 338162880 337478256 337015228 336878014
$$ packed form
1754C31227760J085472Q51059M97208J22337j97181l80974l39546q316N86128J281319
1764C34725266J799507J855087J301117K37465r94950j946754k262611j844597q91228
1773C31978302K07939J059494J429405J306839Q53234K94647j72691m22745l95775
1782C36138649r2201M14505R61036J315880J264839P29638j49613j039657j557961
1791C37985115j467056q10166R8153Q28018J054992P19185M2496o02913q92296p05452
1801C36250076j65672M46510Q44040Q70514N55039P3661l52745n65643n29098l21846
1811C37104836p4692J07155J91345K14577K39295L01209L86276M48227M46777L75748
1821C39740753K60544J27640j9188j96610m07753o12602p29904o84624m63028j37214
$$ plain form
1831 336878014 337052574 337436523 337927856 338504944 339227829 340148315 341190720 342100334 342521896 342181892
1841 342181892 341067734 339484825 337940903 336914558 336639214 337022285 337737656 338422623 338857193
1850 338857193 339030876 339077721 339145622 339293022 339472275 339595871 339627762 339634171 339757919 340132866 340786705
1861 340786705 341590614 342285690 342581367 342283821 341393890 340125961 338831825 337861252 337423859 337519569
1871 337519569 337968674 338518677 338965683 339224739 339322472 339336319 339332466 339342995 339383621 339479523 339662209
1882 339662209 339936485 340245819 340477905 340520401 340334702 339992599 339642601 339421387 339370766 339419136
1892 339419136 339441605 339356613 339188652 339053001 339074821 339301529 339671249 340055695 340342331 340494537
1902 340494537 340551376 340575218 340595207 340592270 340533524 340424232 340328674 340340080 340515862 340827332 341160965
$$ packed form
1831C36878014J74560L83949M91333N77088P22885R20486J042405R09614M21562l40004
1841C42181892j114158j582909j543922j026345k75344L83071P15371O84967M34570
1850C38857193J73683M6845O7901J47400J79253J23596L1891O409J23748L74947O53839
1861C40786705Q03909O95076K95677k97546q89931j267929j294136r70573m37393R5710
1871C37519569M49105N50003M47006K59056R7733J3847l853J0529M0626R5902J82686
1882C39662209K74276L09334K32086M2496j85699l42103l49998k21214n0621M8370
1892C39419136K2469q4992j67961j35651K1820K26708L69720L84446K86636J52206
1902C40494537N6839K3842J9989k937n8746j09292r5558J1406J75782L11470L33633
$$ plain form
1913 341160965 341373367 341365662 341131058 340749168 340337410 339992790 339758720 339627647 339568138 339552498 339567604
1924 339567604 339608688 339667664 339726791 339763145 339759674 339716034 339654160 339615707 339652061 339806290 340091667 340474281
1936 340474281 340870628 341167412 341261215 341102028 340719910 340218277 339734840 339386215 339224434 339222946
1946 339222946 339300308 339364204 339354172 339263268 339129372 339006920 338934822 338919067 338935814 338952293 338950539 338940506
1958 338940506 338954239 339025040 339162064 339336891 339489555 339553375 339486351 339292412 339021263 338745728 338528938
1969 338528938 338396950 338332596 338292084 338234329 338146248 338048935 337982216 337977257 338034935 338124390 338203888 338249969
1981 338249969 338275986 338325157 338440208 338626785 338834038 338969307 338941574 338711128 338318062 337870178
1991 337870178 337496300 337287560 337259674 337352066 337465019 337510033 337448082 337296791 337108574 336936150 336805573
$$ packed form
1913C41160965K12402p705k34604l81890m11758l44620k34070j31073n9509j5640J5106
1924C39567604M1084N8976N9127L6354l471m3640o1874l8453L6354J54229K85377L82614
1936C40474281L96347K96784R3803j59187l82118n01633m83437l48625j61781j488
1946C39222946P7362O3896j0032r0904j33896j22452p2098j5755J6747J6479j754j0033
1958C38940506J3733P0801J37024J74827J52664O3820o7024j93939k71149k75535k16790
1969C38528938j31988o4354m0512n7755q8081r7313o6719m959N7678Q9455P9498M6081
1981C38249969K6017M9171J15051J86577K07253J35269k7733k30446l93066m47884
1991C37870178l73878k08740k7886R2392J12953M5014o1951j51291j88217j72424j30577
$$ plain form
2002 336805573 336711388 336631317 336549225 336470909 336422844 336436005 336523972 336668396 336821251 336921883 336923714
2013 336923714 336815948 336629028 336422310 336256523 336168251 336155777 336185493 336213760 336211548 336176491 336128311
2024 336128311 336088753 336062202 336028481 335954437 335816002 335618095 335397377 335205727 335082932 335034409 335026512
2035 335026512 335004578 334922142 334767609 334571953 334395332 334297371 334307518 334409828 334549522 334657707 334682617
2046 334682617 334610329 334467010 334301758 334160004 334062538 334001884 333955078 333905296 333857155 333834114 333861084
2057 333861084 333941307 334046669 334127922 334142342 334081497 333981361 333905678 333911438 334015617 334184456 334351387
2068 334351387 334453926 334466743 334411964 334341469 334303436 334314079 334351616 334374008 334347954 334270515 334169121
2079 334169121 334083939 334042053 334041824 334054909 334043732 333984451 333880730 333762169 333669777 333636093 333670235 333755341
$$ packed form
2002C36805573r4185q0071q2092p8316m8065J3161Q7967J44424J52855J00632J831
2013C36923714j07766j86920k06718j65787q8272j2474K9716K8267k212l5057m8180
2024C36128311l9558k6551l3721p4044j38435j97907k20718j91650j22795m8523p897
2035C35026512k1934q2436j54533j95656j76621r7961J0147J02310J39694J08185K4910
2046C34682617p2288j43319j65252j41754r7466o0654m6806m9782m8141k3041K6970
2057C33861084Q0223J05362Q1253J4420o0845j00136p5683N760J04179J68839J66931
2068C34351387J02539J2817n4779p0495l8033J0643L7537K2392k6054p7439j01394
2079C34169121q5182m1886k29J3085j1177n9281j03721j18561r2392l3684L4142Q5106
$$ plain form
2091 333755341 333856964 333939476 333979912 333975067 333937492 333884087 333825111 333757629 333669930 333552513 333409538
2102 333409538 333262825 333145561 333088341 333104782 333186111 333304558 333426323 333523941 333583145 333601913 333584442
2113 333584442 333535652 333458977 333358955 333244400 333128967 333028488 332955399 332914124 332899170 332897568 332893906
2124 332893906 332876472 332841682 332795296 332749939 332719078 332710495 332721710 332740669 332750702 332738533 332699852 332639656
2136 332639656 332568665 332495079 332421455 332344856 332262688 332178154 332102089 332048836 332028656 332040901 332072220 332101173
2148 332101173 332106361 332073669 332000656 331896248 331777763 331667480 331588402 331560211 331594086 331687698 331822701
2159 331822701 331966553 332080841 332133026 332107658 332012215 331874161 331730614 331614265 331541481 331508713 331497116
2170 331497116 331484184 331455231 331410255 331361961 331327286 331317101 331331482 331360970 331394577 331427689 331465073 331515884
$$ packed form
2091C33755341J01623Q2512M0436m845l7575n3405n8976o7482q7699j17417j42975
2102C33409538j46713j17264n7220J6441Q1329J18447J21765R7618N9204J8768j7471
2113C33584442m8790p6675j00022j14555j15433j00479p3089m1275j4954j602l662
2124C32893906j7434l4790m6386m5357l0861q583J1215J8959J0033j2169l8681o0196
2136C32639656p0991p3586p3624p6599q2168q4534p6065n3253k0180J2245L1319K8953
2148C32101173N188l2692p3013j04408j18485j10283p9078k8191L3875R3612J35003
2159C31822701J43852J14288N2185k5368r5443j38054j43547j16349p2784l2768j1597
2170C31497116j2932k8953m4976m8294l4675j0185J4381K9488L3607L3112L7384N0811
$$ plain form
2182 331515884 331584740 331664276 331734886 331773071 331763496 331708031 331625366 331542473 331480827 331446533 331429100 331409111
2194 331409111 331368637 331300316 331208496 331105309 331003799 330914459 330845680 330805511 330802956 330843315 330921402 331016960
2206 331016960 331096344 331123314 331074333 330950890 330780983 330609322 330478592 330411720 330403824 330427551 330448341
2217 330448341 330441246 330400581 330339699 330280342 330240898 330228310 330238495 330261497 330289078 330317879 330348434 330380363
2229 330380363 330408630 330423431 330413857 330374298 330308609 330230751 330160255 330114098 330100365 330114021 330140228 330161705
2241 330161705 330166969 330155869 330138016 330126495 330129623 330146713 330170250 330192299 330210609 330229988 330257034 330292625
2253 330292625 330327873 330346947 330335426 330288773 330214500 330126953 330038986 329956055 329877205 329801178 329731789 329679070
2265 329679070 329652214 329652519 329669037 329681015 329665527 329603882 329485779 329310265 329086685 328837547 328600731
$$ packed form
2182C31515884O8856P9536P0610L8185r575n5465q2665q2893o1646l4294j7433j9989
2194C31409111m0474o8321r1820j03187j01510q9340o8779m0169k555M0359P8087R5558
2206C31016960P9384K6970m8981j23443j69907j71661j30730o6872p896K3727K0790
2217C30448341p095m0665o0882n9357l9444j2588J0185K3002K7581K8801L0555L1929
2229C30380363K8267J4801r574l9559o5689p7858p0496m6157j3733J3656K6207K1477
2241C30161705N264j1100j7853j1521L128J7090K3537K2049J8310J9379K7046L5591
2253C30292625L5248J9074j1521m6653p4273q7547q7967q2931p8850p6027o9389n2719
2265C29679070k6856L05J6518J1978j5488o1645j18103j75514k23580k49138k36816
$$ plain form
2276 328600731 328425941 328362579 328441811 328662529 328987503 329355431 329700890 329972725 330143433 330208321
2286 330208321 330179596 330082474 329953690 329838715 329783058 329818153 329948311 330148735 330378532 330603180 330815392
2297 330815392 331039772 331321526 331702003 332194633 332772903 333372993 333909607 334299927 334487991 334465141
2307 334465141 334281540 334042740 333889275 333960381 334350204 335068665 336020813 337015953 337810898 338181458
2317 338181458 338003273 337310143 336298790 335261993 334466133 334024963 333836479 333628693 333103180 332103615
2327 332103615 330714645 329226112 327978172 327181740 326820488 326691513 326542854 326196480 325563965
2336 325563965 324548950 322940712 320436020 316851292 312435627 308077049 305198574 305297050 309294395
2345 309294395 317020531 327120323 337471771 345938377 351100616 352633743 351192703 347927361
$$ packed form
2276C28600731j74790o3362P9232K20718L24974L67928L45459K71835J70708O4888
2286C30208321k8725r7122j28784j14975n5657L5095J30158K00424K29797K24648K12212
2297C30815392K24380K81754L80477M92630N78270O00090N36614L90320J88064k2850
2307C34465141j83601k38800j53465P1106L89823P18461R52148R95140P94945L70560
2317C38181458j78185o93130j011353j036797p95860m41170j88484k07786n25513r99565
2327C32103615j388970j488533j247940p96432l61252j28975j48659l46374o32515
2336C25563965j015015j608238k504692l584728m415665m358578k878475R8476L997345
2345C09294395P726136J0099792J0351448Q466606N162239J533127j441040l265342
$$ plain form
2353 347927361 343913231 339781570 335676231 331468239 327041168 322467384 318004990 313966408 310570526
2362 310570526 307871628 305784149 304164181 302885361 301872902 301097088 300550404 300230293 300133801
2371 300133801 300258198 300601254 301160603 301936035 302935467 304176826 305678425 307437801 309410152
2380 309410152 311500854 313582478 315528183 317245712 318693562 319873791 320810738 321531410 322058678
2389 322058678 322418098 322645836 322788467 322891464 322982330 323062973 323115540 323120804 323077621 323010597 322961502
2400 322961502 322969246 323049889 323189316 323350906 323494759 323596802 323657112 323694382 323731728 323781624 323839455
2411 323839455 323888626 323910789 323897209 323852386 323790817 323729820 323682327 323653374 323640060 323632431 323616219 323576355
2423 323576355 323501320 323388939 323247528 323092232 322936287 322782631 322622375 322441940 322236404 322018166
$$ packed form
2353C47927361m014130m131661m105339m207992m427071m573784m462394m038582l395882
2362C10570526k698898k087479j619968j278820j012459p75814n46684l20111r6492
2371C00133801J24397L43056N59349P75432R99432J241359J501599J759376J972351
2380C09410152K090702K081624J945705J717529J447850J180229R36947P20672N27268
2389C22058678L59420K27738J42631J02997R0866Q0643N2567N264m3183o7024m9095
2400C22961502P744Q0643J39427J61590J43853J02043O0310L7270L7346M9896N7831
2411C23839455M9171K2163j3580m4823o1569o0997m7493k8953j3314p629j6212l9864
2423C23576355p5035j12381j41411j55296j55945j53656j60256j80435k05536k18238
$$ plain form
2433 322018166 321815720 321659889 321566467 321526184 321509743 321484108 321431885 321359825 321291389 321248817 321236763
2444 321236763 321236954 321218567 321155357 321040611 320889168 320727921 320580330 320455933 320349770 320251427 320156517
2455 320156517 320072136 320012856 319987545 319987545 319982624 319930573 319797497 319577255 319299469 319019394 318792820 318648739
2467 318648739 318576126 318531704 318466244 318353386 318205452 318065300 317980232 317974243 318033047 318112392 318161964
2478 318161964 318150864 318080406 317977619 317876873 317800083 317747536 317702198 317642326 317555103 317442951 317320633
2489 317320633 317206802 317114239 317044373 316987553 316929169 316857929 316771851 316679230 316592731 316520939 316461544 316401634
2501 316401634 316325302 316223907 316102505 315976791 315862103 315762234 315665569 315551720 315406399 315232906
2511 315232906 315053062 314896164 314782734 314714355 314676170 314649925 314628792 314622002 314646587 314711761 314805222
$$ packed form
2433C22018166k02446j55831r3422m0283j6441k5635n2223p2060o8436m2572j2054
2444C21236763J91j8387o3210j14746j51443j61247j47591j24397j06163r8343r4910
2455C20156517q4381n9280k5311%m921n2051j33076k20242k77786k80075k26574j44081
2467C18648739p2613m4422o5460j12858j47934j40152q5068n989N8804P9345M9572
2478C18161964j1100p0458j02787j00746p6790n2547m5338n9872q7223j12152j22318
2489C17320633j13831r2563o9866n6820n8384p1240q6078r2621q6499p1792n9395n9910
2501C16401634p6332j01395j21402j25714j14688r9869r6665j13849j45321j73493
2511C15232906j79844j56898j13430o8379l8185k6245k1133o790K4585O5174R3461
$$ plain form
2522 314805222 314894428 314940453 314918232 314830990 314708424 314591312 314509964 314469700 314450722 314421253 314357147
2533 314357147 314255447 314136105 314032059 313972836 313971043 314017696 314086685 314146099 314169846 314145489 314075928
2544 314075928 313976097 313865967 313763885 313681393 313621750 313581715 313556194 313543606 313548336 313578968 313642864 313738213
2556 313738213 313850002 313952141 314015903 314021702 313967571 313870277 313757935 313657703 313584728 313538132 313503723
2567 313503723 313462410 313398724 313305798 313186722 313052826 312920494 312808037 312731686 312699833 312709560 312745628
2578 312745628 312786160 312812634 312820511 312823181 312845383 312908707 313015270 313139286 313234425 313252659 313167534 312989349
2590 312989349 312762356 312546883 312392349 312317848 312307682 312323895 312328358 312300434 312242584 312171745 312104645
2601 312104645 312046013 311988735 311922989 311847572 311775475 311728039 311722050 311758118 311817913 311871872 311892815 311867485
$$ packed form
2522C14805222Q9206M6025k2221q7242j22566j17112q1348m0264j8978k9469o4106
2533C14357147j01700j19342j04046n9223j793M6653O8989N9414K3747k4357o9561
2544C14075928r9831j10130j02082q2492n9643m0035k5521j2588M730L0632O3896R5349
2556C13738213J11789J02139O3762N799n4131r7294j12342j00232p2975m6596l4409
2567C13503723m1313o3686r2926j19076j33896j32332j12457p6351l1853R727L6068
2578C12745628M0532K6474P877K670K2202O3324J06563J24016R5139J8234q5125j78185
2590C12989349k26993k15473j54534p4501j0166J6213M463k7924n7850p0839o7100
2601C12104645n8632n7278o5746p5417p2097m7436n989L6068N9795N3959K0943k5330
$$ plain form
2613 311867485 311799450 311703758 311597958 311495094 311401463 311319237 311248569 311188030 311133900 311079731 311018658
2624 311018658 310947704 310870094 310794353 310729771 310681152 310647736 310625362 310611095 310605621 310610428 310624046 310639019
2636 310639019 310644970 310635357 310614243 310595379 310594273 310616627 310651569 310674744 310660667 310597267 310493317 310374222
2648 310374222 310269318 310197868 310163097 310155544 310162258 310175457 310193596 310216599 310239048 310248280 310228996 310172901
2660 310172901 310086098 309989929 309913197 309878254 309888973 309926510 309956417 309944954 309877186 309767818 309658070
2671 309658070 309597607 309618855 309717789 309851513 309956837 309980812 309908924 309772243 309630833 309540863 309523849
2682 309523849 309557552 309591942 309581165 309511509 309407692 309315186 309269657 309273605 309295635 309290543 309228325 309112740
2694 309112740 308978405 308869629 308814278 308808804 308822193 308815536 308763275 308665905 308547707 308442612 308379230
$$ packed form
2613C11867485o8035r5692j05800j02864r3631q2226p0668o0539n4130n4169o1073
2624C11018658p0954p7610p5741o4582m8619l3416k2374j4267n474M807J3618J4973
2636C10639019N951r613k1114j8864j106K2354L4942K3175j4077o3400j03950j19095
2648C10374222j04904p1450l4771p553O714J3199J8139K3003K2449R232j9284n6095
2660C10172901q6803r6169p6732l4943J0719L7537K9907j1463o7768j09368j09748
2671C09658070o0463K1248R8934J33724J05324K3975p1888j36681j41410q9970j7014
2682C09523849L3703L4390j0777o9656j03817r2506m5529L948K2030n092o2218j15585
2694C09112740j34335j08776n5351n474J3389o657n2261r7370j18198j05095o3382
$$ plain form
2705 308379230 308369904 308409996 308481655 308561783 308627987 308663349 308660469 308624630 308573532 308533516 308529148 308571815
2717 308571815 308651276 308735313 308780270 308747578 308620186 308411064 308159637 307917690 307731094 307624664 307596722
2728 307596722 307623940 307672596 307711601 307721329 307696934 307646275 307585144 307531605 307500286 307498169 307522182 307560539
2740 307560539 307597065 307619038 307622757 307615547 307610397 307617302 307635612 307652531 307649250 307611675 307538414 307441673 307340355
2753 307340355 307249184 307171307 307098503 307017803 306921558 306812897 306705608 306618500 306567783 306562157 306600666 306673450
2765 306673450 306764050 306852169 306917992 306947498 306937523 306896915 306842880 306792202 306752892 306718998 306675110 306605721
2777 306605721 306506157 306388893 306280270 306209526 306195946 306238232 306313457 306384544 306413956 306378670 306279507
2788 306279507 306142216 306007881 305917892 305898094 305948734 306045322 306148396 306218853 306231670 306183567 306091976
$$ packed form
2705C08379230r326M0092P1659Q0128O6204L5362k880l5839n1098m0016m368M2667
2717C08571815P9461Q4037M4957l2692j27392k09122k51427k41947j86596j06430k7942
2728C07596722K7218M8656L9005R728k4395n0659o1131n3539l1319k117K4013L8357
2740C07560539L6526K1973L719p210n150O905J8310J6919l281l7575p3261r6741j01318
2753C07340355r1171p7877p2804q0700r6245j08661j07289q7108n0717n626L8509P2784
2765C06673450R0600Q8119O5823K9506r975m0608n4035n0678l9310l3894m3888o9389
2777C06605721r9564j17264j08623p0744j3580M2286P5225P1087K9412l5286r9163
2788C06279507j37291j34335q9989j9798N0640R6588J03074P0457J2817m8103r1591
$$ plain form
2799 306091976 305987263 305901985 305858936 305862732 305895653 305921593 305898399 305796051 305613155 305382404 305159473
2810 305159473 304998798 304926682 304928322 304956970 304960594 304911766 304821777 304730396 304678059 304678917 304711456 304733696
2822 304733696 304710636 304636421 304535294 304442120 304377594 304334583 304285583 304205246 304090157 303961086 303847103
2833 303847103 303761730 303690052 303596191 303447666 303239594 303002281 302786942 302637806 302566681 302547188 302528820
2844 302528820 302462063 302320480 302106457 301842079 301552315 301252785 300948029 300638580 300330009 300036545
2854 300036545 299776287 299561958 299394436 299262314 299150620 299050999 298968277 298918476 298918056 298971519 299063263
2865 299063263 299161034 299229050 299244804 299210968 299154949 299115124 299120636 299175415 299253712 299312153 299311199 299236031
2877 299236031 299106293 298968163 298873482 298854656 298908329 298996563 299064636 299066887 298988590 298851147 298699493
$$ packed form
2799C06091976j04713q5278m3049L796L2921K5940k3194j02348j82896k30751k22931
2810C05159473j60675p2116J640K8648L624m8828q9989r1381n2337Q58L2539K2240
2822C04733696k3060p4215j01127r3174o4526m3011m9000q0337j15089j29071j13983
2833C03847103q5373p1678r3861j48525k08072k37313k15339j49136p1125j9493j8368
2844C02528820o6757j41583k14023k64378k89764k99530l04756l09449l08571k93464
2854C00036545k60258k14329j67522j32122j11694r9621q2722m9801m20N3463R1744
2865B99063263R7771O8016J5754l3836n6019l9825N512N4779P8297N8441r54p5168
2877B99236031j29738j38130r4681j8826N3673Q8234O8073K251p8297j37443j51654
$$ plain form
2888 298699493 298578339 298509884 298486309 298478794 298457966 298411121 298345909 298278084 298213043 298134327 298009243 297809925
2900 297809925 297536087 297224979 296938267 296733093 296632690 296612968 296615086 296574516 296450863 296242313 295977383
2911 295977383 295691738 295405979 295116463 294804173 294453373 294068604 293678741 293326340 293049030 292862759
2921 292862759 292755051 292691841 292632790 292548237 292430153 292292347 292160702 292058010 291990490 291942730 291883564
2932 291883564 291781197 291620121 291412392 291196346 291024628 290944443 290981445 291131725 291366291 291643791
2942 291643791 291925507 292186604 292419338 292628517 292824059 293013058 293195171 293363743 293507710 293615093
2952 293615093 293674603 293675232 293606682 293461514 293239174 292951889 292625313 292293701 291989765 291732674 291522617
2963 291522617 291343746 291176414 291010532 290852489 290721588 290638332 290611725 290635929 290696163 290781021 290891838
$$ packed form
2888B98699493j21154o8455k3575p515k0828m6845o5212o7825o5041p8716j25084j99318
2900B97809925k73838l11108k86712k05174j00403j9722K118m0570j23653k08550k64930
2911B95977383k85645k85759k89516l12290l50800l84769l89863l52401k77310j86271
2921B92862759j07708o3210n9051q4553j18084j37806j31645j02692o7520m7760n9166
2932B91883564j02367j61076k07729k16046j71718q0185L7002J50280K34566K77500
2942B91643791K81716K61097K32734K09179J95542J88999J82113J68572J43967J07383
2952B93615093N9510O29o8550j45168k22340k87285l26576l31612l03936k57091k10057
2963B91522617j78871j67332j65882j58043j30901q3256k6607K4204O0234Q4858J10817
$$ plain form
2974 290891838 291041241 291242695 291496296 291782646 292068939 292324238 292534962 292709866 292871037 293036919
2984 293036919 293208351 293365898 293482208 293539486 293543625 293523540 293517857 293555565 293642597 293761654 293885174
2995 293885174 293993740 294088840 294192982 294336262 294537525 294789200 295054913 295282040 295422859 295455132
3005 295455132 295391865 295274734 295154285 295067463 295022163 294999065 294968567 294913731 294845543 294800282 294818974
3016 294818974 294920483 295083618 295251827 295358829 295362415 295267296 295122528 294995575 294936562 294953957 295014286
3027 295014286 295065060 295064526 295001240 294892368 294766121 294641914 294522419 294402390 294284077 294187012 294142857
3038 294142857 294176521 294288292 294448605 294610615 294733925 294804077 294836769 294863319 294908333 294972439 295030746
3049 295030746 295047359 294997311 294882755 294735603 294604797 294534779 294545498 294623432 294726830 294803734 294815502
$$ packed form
2974B90891838J49403K01454K53601K86350K86293K55299K10724J74904J61171J65882
2984B93036919J71432J57547J16310N7278M139k0085n683L7708Q7032J19057J23520
2995B93885174J08566R5100J04142J43280K01263K51675K65713K27127J40819L2273
3005B95455132o3267j17131j20449q6822m5300k3098l0498n4836o8188m5261J8692
3016B94818974J01509J63135J68209J07002L586r5119j44768j26953n9013J7395O0329
3027B95014286N0774n34o3286j08872j26247j24207j19495j20029j18313r7065m4155
3038B94142857L3664J11771J60313J62010J23310P0152L2692K6550M5014O4106N8307
3049B95030746J6613n0048j14556j47152j30806p0018J0719P7934J03398P6904J1768
$$ plain form
3060 294815502 294754372 294647293 294543533 294490032 294508553 294584923 294678383 294745045 294762573 294740906 294711895
3071 294711895 294704647 294722137 294734974 294698505 294583244 294399815 294201241 294059162 294026108 294105568 294247551
3082 294247551 294372635 294410896 294334068 294164619 293958797 293775616 293650436 293585739 293560753 293548107 293527374
3093 293527374 293487148 293419075 293313808 293164654 292976990 292776527 292604523 292500019 292478333 292517490 292566414
3104 292566414 292570438 292500877 292370453 292224350 292111912 292056026 292039471 292016373 291941853 291798973 291608429
3115 291608429 291413956 291254616 291142445 291059017 290971584 290857639 290720596 290587883 290492916 290454960 290467548
3126 290467548 290502739 290526409 290515099 290463486 290382690 290289536 290195961 290102997 289999943 289870243 289699726
3137 289699726 289485264 289240742 288996353 288789597 288649635 288581028 288557434 288529854 288447838 288284321 288049126
$$ packed form
3060B94815502o1130j07079j03760n3501J8521P6370R3460O6662J7528k1667k9011
3071B94711895p248J7490J2837l6469j15261j83429j98574j42079l3054P9460J41983
3082B94247551J25084L8261p6828j69449k05822j83181j25180o4697k4986j2646k0733
3093B93527374m0226o8073j05267j49154j87664k00463j72004j04504k1686L9157M8924
3104B92566414M024o9561j30424j46103j12438n5886j6555k3098p4520j42880j90544
3115B91608429j94473j59340j12171q3428q7433j13945j37043j32713r4967l7956J2588
3126B90467548L5191K3670j1310n1613q0796r3154r3575r2964j03054j29700j70517
3137B89699726k14462k44522k44389k06756j39962o8607k3594k7580q2016j63517k35195
$$ plain form
3148 288049126 287783051 287535572 287338142 287189903 287063904 286929817 286777248 286625843 286513290 286471043
3158 286471043 286501522 286572399 286632366 286636581 286569176 286446877 286304531 286171589 286054363 285934601 285784702
3169 285784702 285588169 285353947 285114307 284908943 284762897 284672680 284606724 284521179 284381886 284181385
3179 284181385 283941917 283702450 283497753 283339348 283209763 283072720 282894535 282665024 282405834 282160892
3189 282160892 281973534 281862183 281807938 281763020 281674137 281510391 281278286 281015358 280766983 280558186
3199 280558186 280378647 280189991 279950886 279645748 279298897 278965149 278701534 278536358 278453560 278400860
3209 278400860 278316364 278158379 277921696 277632980 277331886 277049179 276795788 276565857 276347828 276134777
3219 276134777 275926437 275724335 275525570 275321350 275102100 274865417 274619350 274380131 274163036 273974209
$$ packed form
3148B88049126k66075k47479j97430j48239j25999j34087j52569j51405j12553m2247
3158B86471043L0479P0877N9967M215o7405j22299j42346j32942j17226j19762j49899
3169B85784702j96533k34222k39640k05364j46046r0217o5956q5545j39293k00501
3179B84181385k39468k39467k04697j58405j29585j37043j78185k29511k59190k44942
3189B82160892j87358j11351n4245m4918q8883j63746k32105k62928k48375k08797
3199B80558186j79539j88656k39105l05138l46851l33748k63615j65176q2798n2700
3209B78400860q4496j57985k36683k88716l01094k82707k53391k29931k18029k13051
3219B76134777k08340k02102j98765k04220k19250k36683k46067k39219k17095j88827
$$ plain form
3229 273974209 273807087 273644352 273464909 273250561 272990894 272685490 272344837 271988602 271641960 271328297
3239 271328297 271062050 270844288 270664368 270507660 270363903 270230827 270109997 269997482 269876842 269720345
3249 269720345 269500389 269204674 268846798 268463840 268103256 267804089 267583637 267435188 267336044 267261505
3259 267261505 267194843 267131348 267074661 267030354 266999607 266976852 266949425 266900196 266810722 266664696 266451721
3270 266451721 266169796 265826416 265437393 265023479 264607277 264210186 263850822 263544464 263301029 263123245
3280 263123245 263003960 262924671 262857685 262771702 262640285 262450905 262209530 261939697 261674385 261442413
3290 261442413 261257305 261111126 260977764 260825176 260629444 260385017 260106163 259818726 259547215 259303188
3300 259303188 259080677 258858337 258608150 258305779 257939072 257513447 257052460 256593113 256175976 255831928
$$ packed form
3229B73974209j67122j62735j79443k14348k59667l05404l40653l56235l46642l13663
3239B71328297k66247k17762j79920j56708j43757j33076j20830j12515j20640j56497
3249B69720345k19956k95715l57876l82958l60584k99167k20452j48449r9144p4539
3259B67261505o6662o3495n6687m4307l0747k2755k7427m9229q9474j46026k12975
3270B66451721k81925l43380l89023m13914m16202l97091l59364l06358k43435j77784
3280B63123245j19285p9289o6986q5983j31417j89380k41375k69833k65312k31972
3290B61442413j85108j46179j33362j52588j95732k44427k78854k87437k71511k44027
3300B59303188k22511k22340k50187l02371l66707m25625m60987m59347m17137l44048
$$ plain form
3310 255831928 255569267 255367661 255183315 254963913 254669933 254289932 253843632 253370495 252909336 252480354
3320 252480354 252078342 251679726 251259651 250807114 250331440 249857655 249413319 249016285 248668365 248356934
3330 248356934 248061886 247762718 247442455 247089310 246695709 246258469 245778599 245261288 244715843 244154243
3340 244154243 243590794 243041840 242523975 242049999 241622887 241229591 240840988 240419292 239933071 239372730
3350 239372730 238758011 238133125 237550259 237048302 236638622 236301804 235997086 235678310 235308723 234869709
3360 234869709 234361992 233801422 233211670 232616138 232031517 231463909 230909748 230361519 229814701 229271584
3370 229271584 228739605 228224030 227721233 227218361 226700993 226164627 225621872 225098190 224618168 224190655
3380 224190655 223802433 223426609 223038216 222628860 222209167 221798439 221410923 221048279 220704041 220375309
$$ packed form
3310B55831928k62661k01606j84346k19402k93980l80001m46300m73137m61159m28982
3320B52480354m02012l98616m20075m52537m75674m73785m44336l97034l47920l11431
3330B48356934k95048k99168l20263l53145l93601m37240m79870n17311n45445n61600
3340B44154243n63449n48954n17865m73976m27112l93296l88603m21696m86221n60341
3350B39372730o14719o24886n82866n01957m09680l36818l04718l18776l69587m39014
3360B34869709n07717n60570n89752n95532n84621n67608n54161n48229n46818n43117
3370B29271584n31979n15575n02797n02872n17368n36366n42755n23682m80022m27513
3380B24190655l88222l75824l88393m09356m19693m10728l87516l62644l44238l28732
$$ plain form
3390 220375309 220070515 219805584 219589195 219406948 219218063 218967609 218611565 218138447 217577133 216986637
3400 216986637 216432915 215965958 215606575 215346184 215156631 215003605 214858055 214702835 214534149 214358711
3410 214358711 214187870 214030380 213887329 213751011 213608112 213446083 213259048 213049202 212826157 212602367
3420 212602367 212389965 212198048 212032032 211893120 211779060 211685448 211608276 211545906 211498947 211467113 211444778
3431 211444778 211419964 211378841 211314812 211236858 211169319 211140671 211166096 211233406 211302204 211320171 211247978 211081276
3443 211081276 210856152 210636024 210486755 210451851 210540886 210732899 210990219 211274319 211554756 211811161
3453 211811161 212031517 212210960 212353725 212474804 212597694 212746410 212934570 213158321 213398361 213630981
3463 213630981 213841934 214034519 214226151 214436626 214675102 214935513 215203743 215468884 215731297 215999012
$$ packed form
3390B20375309l04794k64931k16389j82247j88885k50454l56044m73118n61314n90496
3400B16986637n53722m66957l59383k60391j89553j53026j45550j55220j68686j75438
3410B14358711j70841j57490j43051j36318j42899j62029j87035k09846k23045k23790
3420B12602367k12402j91917j66016j38912j14060r3612p7172o2370m6959l1834k2335
3431B11444778k4814m1123o4029p7954o7539k8648K5425O7310O8798J7967p2193j66702
3443B11081276k25124k20128j49269l4904Q9035J92013K57320K84100K80437K56405
3453B11811161K20356J79443J42765J21079J22890J48716J88160K23751K40040K32620
3463B13630981K10953J92585J91632K10475K38476K60411K68230K65141K62413K67715
$$ plain form
3473 215999012 216275501 216548481 216790028 216971455 217083302 217147713 217212410 217329350 217528629 217806053
3483 217806053 218127880 218450680 218741608 218987980 219195347 219379673 219562702 219771481 220037060 220385571
3493 220385571 220821781 221314812 221800079 222200680 222461262 222574120 222580566 222546959 222528477 222545643 222586689
3504 222586689 222632542 222685318 222779255 222965679 223282299 223728085 224260445 224816475 225343742 225820980
3514 225820980 226257420 226672974 227075214 227448025 227758923 227977982 228097057 228136406 228138809 228155041 228231335
3525 228231335 228401833 228685474 229082603 229570103 230099087 230604534 231029015 231353092 231615601 231903667
3535 231903667 232309971 232874298 233542500 234174004 234603043 234725132 234561272 234257431 234016304 233997917
3545 233997917 234245644 234682865 235175800 235620403 235997334 236363297 236795826 237337780 237984543 238716507
$$ packed form
3473B15999012K76489K72980K41547J81427J11847O4411O4697J16940J99279K77424
3483B17806053L21827L22800K90928K46372K07367J84326J83029K08779K65579L48511
3493B20385571M36210M93031M85267M00601K60582J12858O446l3607j8482J7166M1046
3504B22586689M5853N2776R3937J86424L16620M45786N32360N56030N27267M77238
3514B25820980M36440M15554M02240L72811L10898K19059J19075L9349K403J6232P6294
3525B28231335J70498K83641L97129M87500N28984N05447M24481L24077K62509K88066
3535B31903667M06304N64327O68202O31504M29039J22089j63860l03841k41127j8387
3545B33997917K47727M37221M92935M44603L76931L65963M32529N41954O46763P31964
$$ plain form
3555 238716507 239539490 240486755 241565304 242681828 243612919 244065151 243814106 242848358 241428261
3564 241428261 240011673 239074287 238916645 239556828 240757751 242160034 243444042 244440250 245156097
3573 245156097 245732212 246369457 247256432 248505383 250096779 251845493 253418121 254425831 254578991
3582 254578991 253838730 252480164 251011715 249973068 249707794 250228767 251246605 252337227 253150578
3591 253150578 253546162 253600616 253511753 253481236 253646317 254079304 254817600 255871754 257193394 258634663
3601 258634663 259949684 260867100 261207333 260981312 260408497 259839077 259617310 259949207 260825653 262022667
3611 262022667 263168640 263864422 263834248 263072758 261927948 261047764 261158371 262725811 265650196
3620 265650196 269171696 272090225 273243713 272028923 268699799 264279308 260123749 257362652 256494427
$$ packed form
3555B38716507Q22983R47265J078549J116524R31091M52232k51045r65748j420097
3564B41428261j416588r37386j57642O40183J200923J402283J284008R96208P15847
3573B45156097N76115O37245Q86975J248951J591396J748714J572628J007710J53160
3582B54578991p40261j358566j468449j038647k65274N20973J017838J090622Q13351
3591B53150578L95584N4454q8863l0517J65081M32987P38296J054154J321640J441269
3601B58634663J315021R17416L40233k26021n72815n69420k21767L31897Q76446J197014
3611B62022667J145973O95782l0174p61490j144810q80184J10607J567440K924385
3620B65650196L521500K918529J153488j214790l329124m420491m155559k761097q68225
$$ plain form
3629 256494427 257312298 259144001 261231022 263041134 264395657 265423985 266435184 267785473 269757805
3638 269757805 272435875 275580692 278579998 280562229 280702057 278611717 274615574 269721756 265255928
3647 265255928 262319641 261350060 262009449 263447227 264767551 265442543 265472984 265267620 265368290 266193790
3657 266193790 267910042 270426846 273454075 276567097 279278831 281147251 281912518 281602936 280524445
3666 280524445 279103184 277650433 276193752 274495163 272263126 269433384 266337376 263642712 262093544
3675 262093544 262199821 264043217 267279167 271287766 275356674 278803692 281035881 281605797 280317459
3684 280317459 277356529 273347073 269242973 266047516 264473038 264706039 266393223 268840904 271305714
3693 271305714 273228340 274328346 274580669 274154396 273371811 272675018 272540340 273306255 274967403
$$ packed form
3629B56494427Q17871J831703K087021J810112J354523J028328J011199J350289J972332
3638B69757805K678070L144817K999306J982231J39828k090340l996143m893818m465828
3647B65255928k936287r69581O59389J437778J320324O74992L0441k05364J00670Q25500
3657B66193790J716252K516804L027229L113022K711734J868420P65267l09582j078491
3666B80524445j421261j452751j456681j698589k232037k829742l096008k694664j549168
3675B62093544J06277J843396L235950M008599M068908L447018K232189N69916j288338
3684B80317459k960930m009456m104100l195457j574478K33001J687184K447681K464810
3693B71305714J922626J100006K52323m26273p82585o96793j34678P65915J661148
$$ plain form
3702 274967403 277060452 278758392 279186230 277828236 274819317 270953331 267387352 265184269 264913845
3711 264913845 266491165 269292488 272453747 275189686 277003155 277740612 277530518 276676922 275560532
3720 275560532 274567299 274034214 274198399 275144501 276755486 278686924 280390549 281218872 280622196
3729 280622196 278399448 274902611 271062241 268147469 267295017 268993855 272788467 277395306 281227207
3738 281227207 283087082 282671051 280609264 278025055 275871849 274438610 273304863 271749401 269334621
3747 269334621 266289787 263451118 261802807 261910667 263596973 266043396 268242321 269514637 269797554
3756 269797554 269567108 269482841 269988575 271090660 272402172 273380604 273602104 272935257 271562881 269889355
3766 269889355 268398666 267517719 267504768 268373165 269870968 271540909 272865810 273458023 273207855
$$ packed form
3702B74967403K093049J697940M27838j357994l008919l865986l565979k203083k70424
3711B64913845J577320K801323L161259K735939J813469P37457k10094q53596j116390
3720B75560532r93233n33085J64185R46102J610985J931438J703625Q28323n96676
3729B80622196k222748l496837l840370k914772q52452J698838L794612M606839L831901
3738B81227207J859875m16031k061787k584209k153206j433239j133747j555462k414780
3747B69334621l044834k838669j648311J07860J686306K446423K198925J272316K82917
3756B69797554k30446q4267N05734J102085J311512R78432K21500o66847j372376j673526
3766B69889355j490689q80947j2951Q68397J497803J669941J324901N92213k50168
$$ plain form
3775 273207855 272313786 271170483 270171642 269537430 269260025 269186993 269175587 269210262 269407616 269916191
3785 269916191 270792084 271945457 273195152 274386845 275478916 276524944 277561245 278488026 279045906
3794 279045906 278927002 277960148 276243572 274127579 272045155 270301304 268963585 267929821 267122612
3803 267122612 266661320 266868591 268083210 270387707 273438435 276527081 278859959 279895401 279543915
3812 279543915 278121510 276109009 273887177 271618614 269329777 267103767 265215912 264094105 264116077
3821 264116077 265377998 267596493 270218258 272677116 274637394 276077957 277174244 278069248 278692417
3830 278692417 278750610 277899628 275986328 273205395 270068932 267203579 265099678 263966694 263775520
3839 263775520 264445438 266026516 268719997 272677822 277678738 282893143 286945763 288339005 286092262
$$ packed form
3775B73207855q94069j143303r98841o34212k77405p3032j1406L4675J97354N08575
3785B69916191Q75893J153373J249695J191693J092071J046028J036301R26781N57880
3794B79045906j18904r66854j716576k115993k082424j743851j337719j033764q07209
3803B67122612m61292K07271J214619K304497L050728L088646K332878J035442l51486
3812B79543915j422405k012501k221832k268563k288837k226010j887855j121807K1972
3821B64116077J261921K218495K621765K458858J960278J440563J096287Q95004O23169
3830B78692417N8193q50982j913300k780933l136463k865353k103901j132984j91174
3839B63775520O69918J581078K693481L957825N000916N214405M052620J393242k246743
$$ plain form
3848 286092262 280292072 272247257 264114571 258122520 255736275 257145786 261303387 266465282 270954170
3857 270954170 273777046 274840088 274728432 274231148 273886509 273765469 273555813 272846489 271429367
3866 271429367 269458351 267400608 265828857 265174847 265562534 266790142 268445454 270083847 271376553
3875 271376553 272173023 272473526 272358608 271929779 271291981 270562897 269871616 269324036 268948669 268672504
3885 268672504 268367424 267959309 267536793 267373829 267823162 269116840 271181030 273578587 275629959
3894 275629959 276662407 276267738 274448395 271594830 268328571 265297165 263007507 261742496 261554184
3903 261554184 262304993 263729630 265503273 267309036 268891830 270085812 270811958 271057472 270860500
3912 270860500 270310555 269554214 268781891 268179798 267862911 267829552 267973251 268152256 268273964 268335667
$$ packed form
3848B86092262n800190q044815q132686n992051k386245J409511M157601N161895M488888
3857B70954170K822876J063042j11656m97284l44639j21040k09656p09324j417122
3866B71429367j971016k057743j571751o54010L87687J227608J655312J638393J292706
3875B71376553P96470L00503j14918m28829o37798p29084o91281n47580l75367k76165
3885B68672504l05080m08115m22516j62964M49333J293678K064190K397557K051372
3894B75629959J032448l94669j819343k853565l266259l031406k289658j265011j88312
3903B61554184P50809J424637J773643J805763J582794J193982P26146K45514j96972
3912B70860500n49945p56341p72323o02093l16887l3359J43699J79005J21708O1703
$$ plain form
3922 268335667 268391972 268475227 268531055 268426952 268036404 267345314 266504478 265783310 265446758 265624447
3932 265624447 266247826 267087097 267859421 268348198 268474560 268298645 267964458 267624607 267377090 267235374
3942 267235374 267138119 266992130 266730099 266355515 265951138 265642414 265534306 265658588 265961838 266339226
3952 266339226 266688328 266946774 267095051 267135849 267076454 266932583 266743069 266570225 266471882 266459675 266481438
3963 266481438 266450424 266306572 266063461 265798531 265591469 265460072 265350113 265192280 264976864 264776230
3973 264776230 264687042 264735565 264833298 264833488 264651203 264343872 264069443 263941555 263905201 263755379 263311386
3984 263311386 262608967 261924496 261563339 261555233 261527157 260933056 259532852 257737694 256418667 256099796
3994 256099796 255949173 253287354 244182491 225095558 194832878 155726099
$$ packed form
3922B68335667N6305Q3255N5828j04103l90548o91090q40836p21168l36552J77689
3932B65624447O23379Q39271P72324M88777J26362j75915l34187l39851k47517j41716
3942B67235374r7255j45989k62031l74584m04377l08724j08108J24282L03250L77388
3952B66339226L49102K58446J48277M0798n9395j43871j89514j72844r8343j2207K1763
3963B66481438l1014j43852k43111k64930k07062j31397j09959j57833k15416k00634
3973B64776230q9188M8523R7733J90j82285l07331k74429j27888l6354j49822m43993
3984B63311386p02419o84471l61157q106k8076n94101j400204j795158j319027l18871
3994B56099796j50623k661819r104863j9086933l0262680l9106779
$$ plain form
4000 155726099
$$ packed form
4000A55726099
##END=$$ End of the data block
