##TITLE=$$ Begin of the data block
##JCAMP-DX=5.00 $$ ACD/SpecManager v 10.08
##SPECTROMETER/DATA SYSTEM=16PC
##DATE=Wed Sep 04 12:44:26 2013
##DATA TYPE=INFRARED SPECTRUM
##DATA CLASS=XYDATA
##ORIGIN=
##OWNER=
##NPOINTS=3601
##FIRSTX=400.00000000
##LASTX=4000.00000000
##MAXX=4000.00000000
##MINX=400.00000000
##MAXY=38.67346954
##MINY=15.41280460
##XFACTOR=1.0000000000
##YFACTOR=0.000000100000000
##FIRSTY=17.68952179
##DELTAX=1.00000000
##XUNITS=1/CM
##YUNITS=TRANSMITTANCE
##XYDATA=(X++(Y..Y))
400 176895218 222637939 260180035 286404247 301522121 308265324 310299416 310717335 311246071
408 311246071 312291946 313500996 314369583 314601727 314184284 313330307 312419434 311948185 312414188 314105186
418 314105186 316881008 320112839 322882309 324377518 324272118 322864304 320894814 319166584 318198929
427 318198929 318107796 318730145 319855843 321384811 323318100 325631790 328165054 330622063 332685051
436 332685051 334147263 334970436 335242882 335095367 334655571 334069901 333548965 333362503 333748398 334782410
446 334782410 336303825 337971344 339434738 340525208 341341019 342170601 343295898 344794579 346462021
455 346462021 347899170 348714638 348729668 348076248 347145615 346417007 346255531 346770020 347788773 348955193
465 348955193 349893074 350365028 350355148 350045357 349706841 349570770 349749069 350240326 351003761 352036591
475 352036591 353392601 355121422 357170868 359328346 361258698 362633896 363282776 363271332 362859383
484 362859383 362360306 361988258 361787720 361678429 361577110 361502457 361587639 361989326 362754936 363742523
494 363742523 364654198 365173798 365129585 364586639 363812790 363137321 362779503 362742271 362822838 362730904 362246056
505 362246056 361334076 360167007 359046974 358277245 358045731 358369217 359113426 360065193 361016846 361823730
515 361823730 362419014 362793388 362962799 362947769 362773247 362482948 362149391 361866684 361722832 361764488
525 361764488 361975937 362285347 362598534 362843208 362998352 363091164 363163757 363228722 363242455 363116951 362768097
536 362768097 362177811 361433716 360719109 360250359 360183563 360535126 361155243 361774139 362105370 361964226
546 361964226 361346741 360431023 359496994 358798790 358448944 358371124 358344574 358119469 357545700 356650314
556 356650314 355624123 354726715 354160423 353977280 354065285 354214287 354220924 353977280 353500748 352899284
566 352899284 352298737 351775322 351324501 350875893 350339127 349655266 348831329 347944946 347119598 346480865
576 346480865 346108093 346000290 346071968 346181984 346187401 345997276 345602722 345067444 344486923 343938751 343450050
587 343450050 342996559 342525101 341980324 341319237 340509300 339522209 338340340 336975212 335491219 334010963
597 334010963 332691460 331677361 331053276 330819435 330903206 331197472 331604996 332068596 332578163 333158684
607 333158684 333852081 334699135 335727539 336943130 338325844 339833488 341412888 343015518 344607315
616 344607315 346166344 347667351 349066849 350302353 351314659 352080841 352638016 353075523 353492012
625 353492012 353940430 354392281 354749680 354901505 354795265 354479446 354089661 353784332 353667717 353747787
635 353747787 353953323 354195480 354430618 354680138 354996147 355400085 355845718 356238213 356501427 356642189
645 356642189 356759453 356980553 357363663 357839546 358241844 358418541 358347931 358172722 358114052 358317833
655 358317833 358744812 359198837 359495697 359661827 360011368 361007118 362957382 365727196 368665695 370840912
665 370840912 371485710 370414886 368168526 365784874 364317093 364353828 365799294 368007011 370164566
674 370164566 371695518 372465057 372716599 372827263 373059006 373447189 373859100 374142189 374247246 374251022
684 374251022 374286766 374448891 374740562 375089912 375407562 375641594 375793762 375902290 376011543 376151848
694 376151848 376335297 376557465 376797638 377016678 377163467 377193909 377096672 376908302 376703453 376561966
704 376561966 376530724 376603432 376731529 376858368 376954155 377029572 377119789 377249603 377402382 377514648 377502174
715 377502174 377305946 376932259 376462822 376022339 375717506 375575104 375517540 375395432 375068817 374498405
725 374498405 373796158 373201218 372985611 373334656 374262047 375603180 377088814 378455582 379537430
734 379537430 380296593 380792885 381122169 381365700 381572533 381769943 381980209 382223434 382507629 382818413
744 382818413 383126144 383406219 383660545 383919296 384218407 384568329 384936943 385263901 385499229 385639839
754 385639839 385737495 385868568 386082382 386360435 386615677 386734695 386642227 386349373 385957336 385611420
764 385611420 385427094 385428543 385531158 385581474 385434799 385032578 384438324 383810883 383324928 383079071 383039055
775 383039055 383047752 382900276 382443581 381649628 380622711 379539833 378560448 377755585 377093277 376479378
785 376479378 375823784 375086594 374283371 373452873 372619743 371781387 370928383 370081520 369313431 368735199
795 368735199 368450356 368501358 368840332 369342003 369851456 370244789 370473099 370572701 370641594 370794029 371111069
806 371111069 371605034 372209206 372798233 373233910 373420334 373345604 373088684 372784081 372559929 372478828
816 372478828 372516174 372587662 372610703 372563248 372502480 372530632 372727966 373093071 373531075 373896713 374067993
827 374067993 374006920 373770714 373468895 373195610 372979202 372780914 372538795 372227821 371893387 371635284
837 371635284 371550026 371666222 371912041 372137947 372181091 371939545 371414680 370703239 369945335 369260216
847 369260216 368703384 368264809 367903023 367588921 367331696 367172012 367148437 367261772 367460060 367656670
857 367656670 367770805 367766037 367664146 367524567 367402191 367308464 367200012 367000275 366643066 366110687 365444756
868 365444756 364724922 364027939 363391838 362805214 362224998 361610909 360955772 360296059 359699593 359241066
878 359241066 358979340 358948021 359157753 359604416 360273361 361135330 362139053 363207626 364246864 365164871
888 365164871 365897751 366428337 366789131 367045784 367266579 367491531 367715569 367895813 367978783 367936134
898 367936134 367788315 367601509 367456970 367408600 367450180 367514114 367504578 367348747 367039146 366641884 366264343
909 366264343 365998535 365871010 365826378 365754547 365547180 365151138 364591942 363954048 363331261 362776260
919 362776260 362277298 361774635 361204834 360546112 359837227 359157982 358582573 358133011 357761078 357370453
929 357370453 356867752 356215668 355455475 354687920 354020386 353511772 353143768 352837410 352502060 352091026
939 352091026 351631508 351211128 350931854 350856934 350981522 351243591 351565704 351902695 352266617 352714577
949 352714577 353308716 354071045 354961586 355890961 356760292 357505379 358121452 358655052 359170952 359712639
959 359712639 360278358 360824203 361288910 361625900 361823349 361905022 361912804 361884804 361840057 361776619 361681862
970 361681862 361544533 361363144 361145515 360903625 360648346 360387039 360124779 359865685 359610596 359352150
980 359352150 359069824 358728828 358286896 357707138 356972275 356094589 355116234 354099808 353110313 352196541
990 352196541 351376991 350637016 349937401 349230537 348478317 347662621 346785583 345860519 344899635 343907356
1000 343907356 342883568 341834259 340781517 339764862 338829231 338004112 337285118 336629906 335972939
1009 335972939 335254211 334447937 333577347 332707825 331920738 331281471 330816231 330507431 330307770 330164680
1019 330164680 330042572 329933624 329855194 329837914 329912758 330102768 330419388 330862122 331415596 332044868
1029 332044868 332692223 333281822 333735924 333999481 334063339 333972969 333815613 333686295 333648376 333706436 333806343
1040 333806343 333864670 333813362 333638496 333392029 333171387 333074989 333157883 333407860 333755417 334109230 334400558
1051 334400558 334612045 334778328 334958191 335195847 335491600 335798378 336046486 336182747 336203728 336163330
1061 336163330 336148872 336237373 336453018 336751747 337039795 337221642 337250252 337153168 337017670 336942177 336978989
1072 336978989 337101860 337217712 337219124 337048378 336736259 336391792 336146774 336083984 336191826 336370392
1082 336370392 336486893 336450043 336259995 336005783 335811768 335764885 335864067 336020927 336111145 336044807 335815811
1093 335815811 335502663 335220337 335051918 335000648 334987106 334895210 334638062 334208641 333686066 333196297
1103 333196297 332848129 332679672 332644653 332641945 332572174 332389603 332120667 331843414 331639595 331548080 331545525
1114 331545525 331562347 331523857 331392365 331187096 330972252 330822067 330783081 330853844 330990868 331136169 331249619
1125 331249619 331328926 331408958 331541748 331771164 332113037 332552261 333054695 333587303 334134827 334704208
1135 334704208 335316353 335988960 336723366 337502136 338299942 339101067 339912033 340759544 341673355 342663727
1145 342663727 343707771 344755630 345754814 346678772 347541962 348389130 349264374 350177307 351087074 351916466
1155 351916466 352588615 353063393 353354568 353515244 353601799 353640175 353614044 353482590 353217468 352833176
1165 352833176 352393761 351987991 351686478 351504555 351390991 351249275 350981369 350532417 349914131 349196663
1175 349196663 348473396 347817688 347251396 346742058 346227608 345655708 345015182 344342232 343697662 343126945
1185 343126945 342626762 342138519 341575012 340866737 340002823 339040718 338079033 337205772 336452332 335779114
1195 335779114 335103340 334351196 333505707 332621002 331794128 331110611 330596504 330203438 329837074 329409943
1205 329409943 328888130 328305626 327738037 327254410 326875648 326564102 326249542 325872917 325422974 324942627
1215 324942627 324502869 324160118 323921738 323739204 323531876 323228683 322806129 322302132 321801109 321396065
1225 321396065 321146660 321052742 321055908 321067352 321010208 320855255 320632439 320411415 320262260 320215416 320244865
1236 320244865 320283165 320261574 320151215 319982166 319827881 319764709 319829845 320003777 320225868 320433464 320599442
1247 320599442 320745468 320924263 321182785 321529694 321925735 322300644 322584457 322733459 322739105 322619438
1257 322619438 322401924 322113075 321777802 321426392 321099167 320842285 320693474 320667648 320750160 320903549
1267 320903549 321086044 321270943 321457405 321666145 321922836 322238655 322598953 322967987 323306427 323593140
1277 323593140 323837013 324071541 324332390 324632034 324946442 325222168 325404549 325469284 325441628 325389633
1287 325389633 325394249 325512047 325749817 326064568 326388321 326662788 326866493 327019501 327166100 327346077
1297 327346077 327571678 327821884 328058243 328250771 328398857 328535042 328707352 328950157 329262009 329604034
1307 329604034 329924126 330191231 330420799 330670509 331006088 331454353 331973343 332460899 332801743 332929344
1317 332929344 332865753 332716599 332621613 332687531 332941284 333327026 333745651 334111137 334391289 334615288
1327 334615288 334847717 335149651 335547905 336024055 336522942 336971779 337301445 337466393 337458725 337314758
1337 337314758 337106285 336916580 336808968 336801147 336862411 336935730 336972313 336956482 336904411 336836433 336744118
1348 336744118 336576805 336262169 335750084 335052223 334248123 333448677 332735710 332112427 331495285 330755081
1358 330755081 329785194 328560219 327155151 325716362 324401741 323321991 322507553 321912270 321444511
1367 321444511 321006355 320524445 319963684 319325733 318639297 317948589 317304687 316759892 316364021 316159668
1377 316159668 316173592 316404018 316807251 317292442 317733536 318004341 318028984 317827492 317528534 317333126
1387 317333126 317432632 317915020 318704319 319572296 320224266 320425224 320105133 319389782 318541031 317836628
1397 317836628 317451935 317401371 317562237 317759075 317853737 317795181 317609768 317354202 317072048 316784286
1407 316784286 316515007 316323891 316309395 316565723 317110786 317827282 318461037 318693829 318267593 317107735
1417 317107735 315382080 313461475 311787376 310699368 310299454 310417404 310700111 310786762 310486393
1426 310486393 309866734 309205303 308822575 308885345 309288597 309685898 309658604 308935452 307544708 305819988
1436 305819988 304257946 303308010 303197327 303867569 305028229 306280956 307252846 307700481 307576580
1445 307576580 307061043 306539841 306504517 307365189 309227276 311745052 314166145 315605049 315449924
1454 315449924 313700676 311035194 308530560 307160835 307333946 308728981 310527172 311902943 312486324
1463 312486324 312526913 312674179 313520412 315194607 317253418 318924351 319544353 318925095 317439861
1472 317439861 315803471 314697113 314461365 315014362 316001816 317055130 317993279 318865585 319841175
1481 319841175 321034546 322380943 323628922 324451714 324617996 324138260 323309174 322620239 322544060 323293991
1491 323293991 324672585 326113663 326938591 326727638 325614052 324315491 323835564 324953957 327764091
1500 327764091 331522217 334922104 336677399 336119576 333503571 329870987 326560822 324633751 324497871
1509 324497871 325883522 328115463 330486908 332531242 334086266 335188255 335911446 336265182 336191330
1518 336191330 335634193 334619942 333299408 331937408 330855446 330344048 330564537 331472092 332805023
1527 332805023 334171410 335222816 335840492 336225853 336816063 338034782 339998093 342343102 344303322
1536 344303322 345023880 343972168 341232491 337526398 333938484 331479683 330696983 331507645 333317032
1545 333317032 335343971 336990585 338088226 338917274 340003967 341787071 344305801 347057533 349112549
1554 349112549 349469376 347517929 343404694 338105087 333125687 329930534 329341164 331195221 334443703
1563 334443703 337651443 339656448 340061150 339313354 338358421 338068123 338763466 340079155 341216545
1572 341216545 341417694 340385666 338428383 336274757 334692802 334129906 334556084 335558319 336596985
1581 336596985 337268639 337445488 337252312 336931763 336692619 336617355 336657906 336696739 336626701 336406937 336073532
1592 336073532 335708466 335386162 335127182 334885254 334576454 334136543 333571548 332964516 332426109 332015610
1602 332015610 331687469 331311607 330769005 330068398 329396629 329046822 329243507 329960365 330853157 331374779
1612 331374779 331032982 329656410 327516174 325222702 323443985 322593536 322651520 323207169 323685722
1621 323685722 323632927 322913284 321743546 320574112 319896030 320060539 321161461 322992210 325073547
1630 325073547 326752815 327382050 326554108 324323006 321297226 318507481 317046585 317604733 320120659
1639 320120659 323752289 327232132 329465179 330072975 329580269 329110298 329724731 331759644 334542732
1648 334542732 336685295 336825180 334422379 330158424 325688248 322857246 322800446 325415077 329488945
1657 329488945 333392372 335928230 336863174 336872444 336988678 337926826 339696732 341699715 343190460
1666 343190460 343765259 343561249 343070107 342742882 342687416 342675819 342441139 342026138 341903305 342738113
1676 342738113 344921761 348173637 351494598 353550339 353300819 350537148 346028938 341203766 337528534
1685 337528534 335917130 336445732 338476219 341066208 343414574 345114403 346127739 346565285 346454811
1694 346454811 345656204 343968964 341342735 338037109 334606743 331700630 329779320 328909378 328755264
1703 328755264 328778267 328536110 327919769 327196312 326833878 327198334 328285599 329634857 330478134 330065536
1713 330065536 328015709 324521942 320313034 316375332 313559666 312252617 312265701 312994118 313760300
1722 313760300 314164143 314252701 314417992 315082455 316355343 317869549 318910370 318779678 317194881
1731 317194881 314490547 311496639 309150620 308055286 308224335 309148808 310130997 310682545 310759373
1740 310759373 310711708 311002789 311879425 313194008 314473896 315185680 315031395 314109554 312862110 311853333
1750 311853333 311511726 311967793 313051701 314420815 315728397 316744671 317390461 317704144 317791367
1759 317791367 317796669 317896996 318287888 319132481 320476875 322175674 323885498 325158730 325612183 325098419
1769 325098419 323788986 322124214 320648003 319804592 319791622 320524788 321712189 322985916 324029350
1778 324029350 324658241 324851227 324740334 324570618 324627647 325133858 326138268 327451096 328676147 329356575
1788 329356575 329183846 328170395 326683502 325304298 324568596 324718208 325593224 326724701 327577019
1797 327577019 327812500 327439651 326774635 326251068 326186676 326633987 327382812 328096237 328494911 328486366
1807 328486366 328180580 327799339 327545700 327508278 327647934 327856407 328040199 328174744 328300972 328480797
1817 328480797 328747482 329086456 329451981 329796944 330087662 330292969 330364532 330237007 329863548 329266663
1827 329266663 328566017 327950478 327597771 327589722 327879791 328339958 328858185 329416389 330088043 330946846
1837 330946846 331947861 332871284 333386116 333214722 332304993 330902100 329464417 328461838 328166046
1846 328166046 328546371 329321976 330130615 330710564 330996666 331093597 331161919 331301041 331499901 331675835
1856 331675835 331762772 331783485 331855545 332124329 332663651 333403778 334133263 334579239 334531517 333947220 332984390
1867 332984390 331943970 331147499 330808830 330959282 331458931 332079048 332610817 332941856 333073845 333084259
1877 333084259 333068428 333096237 333199005 333379364 333622437 333897057 334152603 334324036 334354553 334225082
1887 334225082 333971291 333671303 333409042 333235245 333150291 333120384 333110619 333110886 333137321 333212471 333343887
1898 333343887 333520470 333726501 333956909 334215927 334496231 334757729 334930687 334952888 334819984 334613075
1908 334613075 334473228 334529953 334822121 335262680 335673943 335877266 335784874 335441322 334991341 334598274
1918 334598274 334362411 334286499 334300003 334319954 334305153 334272614 334272270 334342270 334476891 334624825 334719009 334716606
1930 334716606 334627380 334514503 334466705 334556274 334800262 335144615 335479050 335679588 335660095 335411301 335007057
1941 335007057 334573326 334235191 334066544 334068108 334181442 334328423 334451675 334533463 334586830 334628448 334656525
1952 334656525 334648018 334577293 334441757 334275856 334141541 334098549 334172134 334334984 334516525 334633713 334628601
1963 334628601 334494286 334276161 334048996 333882904 333813286 333830757 333892593 333949585 333971977 333961449 333943558
1974 333943558 333945465 333974762 334011612 334021034 333976555 333883591 333783493 333736305 333788071 333940926 334142914 334305763
1986 334305763 334342804 334209709 333926201 333569489 333240700 333021240 332940712 332969627 333039894 333081093 333053093
1997 333053093 332960052 332840080 332738876 332682724 332665253 332654305 332613449 332524681 332399979 332274818 332188225
2008 332188225 332161102 332183876 332219849 332223511 332161140 332026901 331844444 331656227 331505432 331420288 331405716
2019 331405716 331446190 331515083 331585464 331637650 331660004 331647263 331597404 331511383 331395874 331265945 331144943
2030 331144943 331059418 331030312 331065063 331154213 331273956 331394501 331488914 331539116 331537514 331485825 331392403 331271248
2042 331271248 331140709 331020966 330929146 330873451 330848274 330835991 330814629 330769348 330701599 330632019 330592346
2053 330592346 330611572 330701714 330849724 331021004 331171265 331262703 331276588 331216545 331102676 330960960 330812569
2064 330812569 330669823 330538902 330425797 330340385 330295143 330297585 330342178 330407753 330463448 330481339 330449600
2075 330449600 330378380 330294914 330229683 330201187 330208817 330235863 330262680 330279121 330291023 330314789 330364532 330439835
2087 330439835 330522194 330583000 330598755 330565834 330504646 330450783 330437546 330478363 330558777 330642853 330690727 330678215
2099 330678215 330608177 330508995 330419083 330368118 330362778 330385399 330405617 330397606 330355186 330295143 330247841 330240746
2111 330240746 330282364 330356598 330428658 330461578 330433121 330345688 330224915 330107269 330023270 329985733 329986382 330003548
2123 330003548 330014572 330006790 329980965 329946518 329913216 329882698 329849052 329803505 329743614 329678001 329623871 329598045
2135 329598045 329605522 329633636 329655190 329639778 329568024 329441833 329284515 329131470 329015045 328951378 328935699
2146 328935699 328946419 328957405 328951149 328926620 328897820 328884201 328898430 328937492 328983383 329012108 329007149 328968468
2158 328968468 328912430 328861465 328829460 328812523 328790321 328738632 328645554 328521805 328399048 328315468 328298988
2169 328298988 328354034 328461838 328590813 328711319 328806343 328873215 328918419 328949089 328968544 328975830 328969154 328948097
2181 328948097 328913918 328868332 328811417 328743172 328666496 328590240 328529167 328499298 328511124 328563576 328641891 328721428
2193 328721428 328775749 328786469 328750343 328680382 328601036 328537941 328506737 328505821 328516846 328513260 328474503 328397827
2205 328397827 328302612 328222961 328192062 328224945 328308563 328405685 328470688 328470535 328399887 328283310 328161926 328072815
2217 328072815 328030205 328020172 328011360 327975082 327904549 327821579 327765732 327772141 327850609 327976646 328102493 328179855
2229 328179855 328182755 328118362 328019066 327923622 327856865 327821579 327804832 327792053 327779846 327776985 327794685 327833481
2241 327833481 327876892 327897415 327871361 327795067 327690010 327595444 327549438 327570381 327647057 327743034 327813644 327825928
2253 327825928 327772903 327675705 327572594 327500076 327476196 327492142 327517853 327517433 327466698 327365150 327235031 327109871
2265 327109871 327017746 326968269 326949577 326934662 326894112 326807861 326671753 326497498 326308708 326134453 326003151
2276 326003151 325938225 325954781 326057816 326242256 326494293 326792831 327110481 327415237 327673264 327855873
2286 327855873 327947159 327951241 327892838 327810020 327741394 327712936 327733116 327795906 327892151 328020363 328191833 328427200
2298 328427200 328746719 329159088 329652977 330193710 330726242 331183548 331500206 331630173 331563835 331340637
2308 331340637 331049576 330816383 330775681 331031227 331615334 332457581 333380928 334137726 334485245 334280396
2318 334280396 333552322 332511902 331474075 330720177 330360107 330272713 330164528 329725609 328799210 327469368
2328 327469368 326013832 324750404 323872261 323368492 323068695 322761383 322288742 321545525 320396080
2337 320396080 318607693 315909481 312205238 307841358 303743210 301264744 301740036 305909824 313501434
2346 313501434 323196907 333038712 341099739 346113243 347784576 346681671 343814430 340145531 336269341
2355 336269341 332363625 328360596 324182091 319890881 315695992 311850300 308531246 305781784 303533058
2364 303533058 301673603 300116081 298824234 297801857 297064419 296617813 296453629 296556473 296913280
2373 296913280 297519398 298379879 299507580 300916843 302610493 304562416 306702843 308917961 311068630
2382 311068630 313024235 314696064 316055374 317127628 317967529 318629856 319150867 319546680 319825668
2391 319825668 320002937 320107536 320177689 320247688 320334930 320434189 320523605 320578308 320586891 320560303 320530090 320534325
2403 320534325 320598793 320722847 320877151 321016006 321097870 321104507 321047096 320958672 320876007 320822029 320797958
2414 320797958 320788422 320774345 320746651 320710716 320681305 320671387 320680847 320693512 320683594 320627670 320518456 320370560
2426 320370560 320216179 320091667 320020218 319999275 319999828 319979038 319900455 319752483 319555340 319351368 319184952
2437 319184952 319080887 319034023 319013138 318979187 318903732 318780632 318624783 318460083 318305931 318169842 318048191
2448 318048191 317933102 317819099 317705307 317593422 317483501 317373123 317259789 317144070 317031384 316928616
2458 316928616 316838360 316755295 316666813 316560516 316432152 316290436 316153622 316040192 315958576 315902576 315855770
2469 315855770 315801525 315732937 315655117 315579567 315513821 315454235 315387688 315300331 315189400 315068512 314962749
2480 314962749 314895687 314876251 314892769 314917660 314919777 314877300 314784985 314652901 314500790 314350624 314221516
2491 314221516 314127121 314073086 314055424 314059105 314061699 314040222 313980408 313882103 313757629 313623943 313492584 313364849
2503 313364849 313234253 313094997 312949219 312807732 312683220 312580624 312492142 312401409 312293758 312166748
2513 312166748 312032852 311911793 311817741 311749496 311690979 311621990 311533127 311434460 311353283 311319847 311350651
2524 311350651 311437359 311548882 311644993 311694374 311688137 311641102 311582470 311539955 311527061 311538506 311556931 311563301
2536 311563301 311548252 311515350 311477451 311448345 311435261 311436138 311442871 311446629 311442661 311430740 311412735 311390057 311362972
2549 311362972 311332607 311303616 311284103 311282539 311302738 311339951 311381588 311411629 311417027 311391697 311337605 311262074
2561 311262074 311175556 311089268 311014767 310961876 310936089 310934982 310947075 310955868 310947247 310917053 310873890 310832996
2573 310832996 310806332 310793648 310781307 310750751 310691986 310612297 310534763 310486183 310480690 310510712 310549469 310565548
2585 310565548 310539875 310475674 310395088 310325508 310283794 310267792 310260677 310242844 310206051 310159073 310122452 310115795
2597 310115795 310144863 310196075 310241356 310251064 310207539 310112476 309984856 309850731 309731007 309634190 309555702
2608 309555702 309485722 309417839 309354115 309303055 309271927 309258976 309250717 309227161 309172993 309086761 308984203 308891640
2620 308891640 308833714 308821754 308848896 308894348 308933887 308950233 308938789 308905773 308861790 308815346 308769321 308721142
2632 308721142 308666706 308603764 308534145 308463707 308400269 308350525 308317738 308299770 308289394 308278084 308259621 308233891
2644 308233891 308207703 308190384 308188133 308199234 308213902 308219700 308208656 308181362 308145390 308108273 308070374 308023987
2656 308023987 307958870 307872658 307777443 307696476 307652702 307653313 307682343 307705784 307688751 307614422 307494488 307363853
2668 307363853 307263584 307220402 307235317 307285786 307339420 307370396 307369385 307343102 307306175 307271461 307244511 307223511
2680 307223511 307203541 307179432 307147427 307105064 307050743 306985016 306911736 306838188 306772346 306719799 306681843 306656971
2692 306656971 306644020 306645374 306666107 306708717 306768093 306828728 306869640 306872540 306830845 306752319 306654644 306555481
2704 306555481 306464729 306382446 306302814 306222000 306141491 306067009 306003246 305949287 305899563 305849380 305801525 305767841
2716 305767841 305763454 305796585 305860367 305933094 305987053 306001968 305974083 305916290 305849018 305787640 305734596 305680237
2728 305680237 305611572 305522480 305419006 305317135 305234203 305180340 305154762 305147991 305148048 305147018 305142784 305137730 305134888
2741 305134888 305134697 305134811 305131016 305119915 305100155 305072079 305037212 304996929 304952698 304905815 304857979 304811535 304769325
2754 304769325 304734592 304709892 304695377 304687214 304676819 304652481 304603558 304525948 304425869 304319534 304227180 304164696
2766 304164696 304135590 304129562 304127350 304111557 304076290 304030590 303994331 303986912 304016399 304074001 304137402 304180889
2778 304180889 304186172 304149952 304082661 304001827 303923016 303854084 303794479 303739471 303685741 303634758 303592644 303565769
2790 303565769 303556709 303560867 303568993 303571014 303561916 303544922 303529510 303525505 303535671 303550701 303551369 303517170 303437500
2803 303437500 303320541 303192387 303086567 303028278 303020878 303043728 303061504 303041782 302970486 302855892 302720985
2814 302720985 302587433 302462368 302336254 302192478 302022095 301834335 301655121 301514301 301430359 301399727
2824 301399727 301399784 301400223 301377621 301323223 301240940 301138573 301018848 300876560 300703220 300494976 300257721 300005703
2836 300005703 299754372 299511967 299276066 299035378 298777637 298496761 298196068 297886391 297578964 297279034
2846 297279034 296982594 296678295 296354523 296007576 295647278 295297909 294991531 294756756 294607391 294536247
2856 294536247 294518356 294522800 294527817 294531517 294551373 294611931 294726734 294883232 295041218 295146313 295152187 295041828
2868 295041828 294836693 294589081 294363098 294211597 294161587 294210854 294335480 294501667 294675255 294826756
2878 294826756 294932632 294976521 294952717 294870148 294753075 294635487 294548969 294509449 294509201 294518528 294498806 294418888
2890 294418888 294268627 294061642 293826694 293593006 293376427 293173733 292967548 292737865 292473488 292177773
2900 292177773 291866207 291556702 291260624 290975704 290687618 290376225 290024681 289627342 289192753 288741665
2910 288741665 288299713 287888813 287519073 287185307 286869678 286549530 286208611 285845757 285476837 285128574
2920 285128574 284826202 284581242 284386482 284221420 284065533 283912106 283774757 283680267 283652725 283696556
2930 283696556 283789234 283889027 283954697 283966141 283935852 283902073 283910847 283993263 284153099 284369717 284611950
2941 284611950 284855461 285091152 285321732 285550461 285770607 285964260 286111202 286201687 286244850 286265793
2951 286265793 286291637 286336670 286392517 286432514 286425571 286352463 286215839 286037769 285847816 285669403 285511398
2962 285511398 285370102 285238876 285118332 285020714 284965763 284969635 285035515 285149670 285288048 285428066 285559673
2973 285559673 285690060 285837326 286019325 286242008 286494331 286753387 286994228 287200909 287370777 287511902
2983 287511902 287635021 287747269 287849560 287941055 288025742 288116188 288232327 288394661 288614941 288890362
2993 288890362 289202576 289522381 289818020 290062714 290240879 290350494 290402603 290418739 290425491 290447598 290501137
3004 290501137 290587559 290691662 290784912 290832825 290806637 290694122 290506878 290280170 290064888 289912090 289856644
3015 289856644 289904499 290030632 290188808 290329857 290421028 290457401 290460758 290466919 290507221 290594616 290718994
3026 290718994 290854015 290969524 291043911 291069622 291051922 291003437 290938835 290872879 290820274 290796776 290816021
3037 290816021 290884056 290992966 291119175 291228523 291288071 291280003 291210690 291109600 291017265 290967369 290971241
3048 290971241 291013470 291060200 291077766 291051102 290992584 290936146 290919647 290964279 291062489 291179905 291270618 291297569
3060 291297569 291248055 291136684 290996723 290864449 290765095 290707092 290684280 290684299 290696583 290716534 290744858 290783138
3072 290783138 290830097 290879898 290923786 290953007 290962219 290950584 290921116 290878410 290827007 290769920 290709057 290645828
3084 290645828 290581093 290514507 290444393 290367355 290280399 290182915 290078621 289974804 289880314 289801731 289741096
3095 289741096 289695721 289660091 289627571 289591560 289544659 289478550 289385948 289264641 289122524 288978367 288857708
3106 288857708 288782425 288760643 288780956 288815308 288829632 288796844 288706398 288564949 288390331 288201981 288013000
3117 288013000 287828655 287649937 287478905 287323112 287194843 287106705 287064667 287062626 287080631 287089272 287058315
3128 287058315 286967945 286817036 286624756 286424046 286248970 286121178 286042042 285993805 285949764 285887127 285797138
3139 285797138 285686493 285570679 285464039 285371437 285285912 285193691 285081177 284942169 284780369 284608021
3149 284608021 284440918 284293270 284172955 284078770 284001122 283924465 283832531 283713894 283565407 283392391 283204803
3160 283204803 283011322 282815647 282615795 282408543 282194939 281983891 281790104 281627235 281499596 281397419
3170 281397419 281299019 281179447 281022282 280827675 280612488 280401936 280216904 280062523 279925442 279780293
3180 279780293 279602642 279382229 279128304 278865738 278622971 278418903 278256073 278122520 278000698 277877007
3190 277877007 277746449 277609329 277464333 277302589 277108955 276869507 276581154 276257057 275923386 275608807
3200 275608807 275332794 275098343 274893703 274700069 274500237 274284573 274051476 273804016 273547649 273289051
3210 273289051 273036728 272800522 272588291 272401428 272232399 272065868 271885357 271680717 271452599 271211395
3220 271211395 270970821 270740337 270520535 270303917 270079918 269840508 269584122 269315929 269045792 268785477
3230 268785477 268545856 268334198 268151093 267988434 267829094 267650509 267431831 267161865 266843834 266494884
3240 266494884 266139545 265801430 265496311 265230713 265003834 264811554 264648304 264506130 264371910 264227810
3250 264227810 264054356 263838215 263578701 263289948 262996712 262724209 262488403 262290325 262117920 261954536
3260 261954536 261787872 261616669 261449566 261298370 261169147 261056728 260944595 260811119 260638504 260420094
3270 260420094 260163174 259886341 259612846 259363003 259148293 258968735 258813362 258663406 258497601 258297634
3280 258297634 258052826 257763443 257440319 257102299 256771450 256467381 256202850 255981274 255796108 255632801
3290 255632801 255471649 255292912 255082226 254835186 254559574 254273167 253997345 253748436 253530178 253330650
3300 253330650 253125172 252884789 252586479 252221069 251797256 251337700 250871887 250426254 250016518 249644527
3310 249644527 249301071 248972416 248647785 248323250 248000412 247681198 247361755 247030945 246674671 246284180
3320 246284180 245862808 245425949 244993229 244576855 244173050 243762684 243321705 242834759 242305374 241755924
3330 241755924 241217556 240716667 240264187 239853706 239467621 239085503 238692150 238279934 237848568 237402687
3340 237402687 236950207 236499710 236057568 235623493 235187683 234732494 234238644 233694763 233104706 232487545
3350 232487545 231871185 231280556 230728321 230211296 229714642 229220257 228714638 228192768 227656803 227111893
3360 227111893 226561661 226005669 225439301 224855881 224249763 223619633 222970867 222315960 221671944 221055622
3370 221055622 220477734 219939365 219431629 218939381 218447018 217942657 217419968 216877441 216317348 215745754
3380 215745754 215173931 214619293 214103184 213644295 213250599 212913361 212607269 212298965 211959305 211575336
3390 211575336 211154575 210720558 210301056 209915447 209566784 209242783 208923206 208591328 208242607 207887001
3400 207887001 207545033 207238808 206982384 206775227 206601601 206435852 206252346 206035805 205787296 205523815
3410 205523815 205269203 205042171 204845600 204663734 204470158 204240685 203966827 203661175 203352070 203070831
3420 203070831 202838650 202659950 202524490 202415905 202320709 202233028 202153530 202085514 202031918 201993465 201969872
3431 201969872 201959362 201959209 201964512 201970196 201973495 201976109 201982288 201993694 202003212 201993446 201943798 201843758 201704884
3444 201704884 201563282 201469402 201468506 201581860 201799126 202084160 202391491 202683411 202939682 203157883 203346653
3455 203346653 203518028 203682804 203849049 204022961 204209118 204410553 204629230 204866257 205120754 205388317
3465 205388317 205658760 205917511 206152172 206362057 206564159 206790161 207071209 207418327 207810421 208198795
3475 208198795 208529282 208769302 208924007 209032078 209142246 209287109 209469986 209672661 209876728 210081863
3485 210081863 210308437 210581398 210910130 211277847 211650505 211998787 212316704 212622700 212942352 213284378
3495 213284378 213627644 213931084 214159851 214311733 214425430 214563408 214779797 215091515 215470505 215859871
3505 215859871 216205063 216481037 216702023 216911030 217157516 217476349 217877178 218346825 218859062 219384308
3515 219384308 219896393 220373459 220797539 221152935 221426735 221610203 221702347 221715546 221680508 221647949 221681175
3526 221681175 221838627 222150688 222602081 223132133 223658905 224118729 224501915 224861641 225286446 225845718
3536 225845718 226538124 227274742 227911949 228321609 228460255 228396835 228281345 228269920 228449574 228806152
3546 228806152 229251156 229688091 230073299 230434685 230841675 231354256 231990337 232734108 233571587 234515743
3556 234515743 235589142 236765938 237915554 238799706 239150982 238803387 237806625 236451588 235179710
3565 235179710 234415264 234402981 235129795 236361675 237764950 239044170 240036144 240734844 241260738 241802902
3575 241802902 242554131 243644962 245081043 246703167 248203316 249215412 249463978 248906040 247787647
3584 247787647 246567936 245735950 245606804 246202679 247275944 248452969 249413013 250006618 250269032
3593 250269032 250349255 250419350 250619106 251047459 251771355 252816010 254129009 255549145 256822033 257678738
3603 257678738 257949276 257653961 257018642 256402569 256167183 256541252 257530651 258901939 260245724 261111355
3613 261111355 261183586 260448036 259269695 258314476 258302155 259667645 262285442 265418205 267957993
3622 267957993 268879147 267694359 264686394 260794506 257214718 254917431 254315853 255216389 257026558
3631 257026558 259072552 260863457 262211208 263212814 264156113 265400753 267247047 269792995 272808399
3640 272808399 275700588 277644348 277878456 276060658 272498436 268106251 264072113 261382294 260440216
3649 260440216 260969448 262233582 263435822 264080944 264131222 263922806 263936901 264569550 265997086 268154297
3659 268154297 270782433 273501911 275894222 277599621 278419456 278380184 277708111 276699905 275550079
3668 275550079 274238644 272564030 270320091 267516041 264500790 261903229 260409813 260497684 262258587
3677 262258587 265385094 269290104 273272133 276646481 278828259 279402027 278212547 275461063 271734982
3686 271734982 267904854 264883232 263334026 263462200 264984379 267283382 269657097 271539917 272619095
3695 272619095 272845249 272387753 271582699 270871773 270701447 271365585 272838230 274693584 276201210
3704 276201210 276599770 275442295 272842369 269483089 266368828 264433632 264192066 265586395 268074932
3713 268074932 270889149 273321762 274925556 275571747 275393085 274674969 273753490 272949142 272530842
3722 272530842 272690048 273504696 274890518 276559544 278024330 278690319 278047905 275919209 272650375
3731 272650375 269123592 266513023 265838432 267498417 271024532 275217972 278643818 280252533 279810715
3740 279810715 277909355 275552845 273568401 272182331 271000385 269385052 266976681 264025745 261326828
3749 261326828 259796886 259959984 261649742 264099846 266353741 267744102 268170681 268044910 267974148
3758 267974148 268390980 269335842 270481548 271344585 271538143 270939064 269713554 268230820 266929779
3767 266929779 266189365 266228008 267038498 268374596 269811268 270881424 271252346 270862560 269944458 268908253
3777 268908253 268142872 267841358 267946110 268237858 268502922 268670387 268836460 269175339 269809856 270734711
3787 270734711 271837177 272983723 274093914 275139751 276075611 276765537 276985779 276523056 275312595
3796 275312595 273516273 271473713 269545937 267950897 266703281 265702667 264907322 264464378 264687080
3805 264687080 265873394 268072567 270952950 273870144 276111259 277180424 276967525 275717697 273843288
3814 273843288 271712303 269541187 267438545 265530205 264048405 263298912 263515930 264705563 266592579
3823 266592579 268722858 270667133 272202892 273359299 274300671 275126743 275726471 275789375 274977036
3832 274977036 273152065 270520744 267593613 264982872 263155956 262295628 262344913 263192482 264852734
3841 264852734 267487831 271218739 275823097 280523605 284058228 285081825 282751026 277211533 269711170
3850 269711170 262235394 256794758 254679012 256016693 259829140 264528637 268601971 271157475 272110653
3859 272110653 271983185 271477795 271073990 270839806 270511608 269751053 268410645 266663113 264942226
3868 264942226 263746681 263423233 264035149 265366764 267037125 268652020 269918499 270687408 270933743
3877 270933743 270713196 270131512 269332256 268486576 267760715 267262726 266995220 266855965 266703777 266466179
3887 266466179 266225452 266220951 266745071 267973995 269821682 271901131 273628197 274427509 273948269 272194309
3897 272194309 269516735 266483688 263694229 261613121 260481930 260317516 260971642 262210846 263780975
3906 263780975 265441208 266973801 268187389 268931522 269127045 268798828 268087749 267221203 266443043
3915 266443043 265928402 265725498 265756531 265879364 265975227 266011238 266040573 266141434 266337852 266556358 266650658
3926 266650658 266484413 266021252 265368176 264742737 264378223 264417305 264846363 265503120 266149578 266574516
3936 266574516 266676846 266493988 266166286 265857430 265671864 265608654 265575809 265454025 265174675 264765530
3946 264765530 264339809 264036083 263945599 264070625 264334316 264627800 264861412 264989872 265006180 264923172
3956 264923172 264763412 264562550 264372272 264246864 264214554 264256001 264312267 264324493 264275627 264198666 264140320
3967 264140320 264107971 264048328 263885174 263591404 263235130 262950649 262844715 262909088 263014030 263001671 262809238
3978 262809238 262520504 262292023 262206364 262179356 262015057 261582623 260967331 260440331 260228939 260254345
3988 260254345 260081768 259202271 257492733 255478001 254056511 253678627 253410416 250550690 241281128
3997 241281128 222259865 192440205 154128046
4000 154128046
##END=$$ End of the data block
