##TITLE=PLA $$ Begin of the data block
##JCAMP-DX=5.00 $$ ACD/SpecManager v 10.08
##SPECTROMETER/DATA SYSTEM=Alpha
##DATE=12 Mar 2014 10:59:36
##DATA TYPE=INFRARED SPECTRUM
##DATA CLASS=XYDATA
##ORIGIN=
##OWNER=
##NPOINTS=1765
##FIRSTX=399.75695801
##LASTX=3997.56933594
##MAXX=3997.56933594
##MINX=399.75695801
##MAXY=0.81840038
##MINY=0.40438700
##XFACTOR=1.0000000000
##YFACTOR=1.000000000000000e-9
##FIRSTY=0.65703136
##DELTAX=2.03957629
##XUNITS=1/CM
##YUNITS=ARBITRARY UNITS
##XYDATA=(X++(Y..Y))
399.8F57031357j429438j558960o61731k08258q12113j069069j57416R43720N91993
$$ 657031357 655601919 654042959 653381228 653172970 652360857 651291788 651134372 652078092 652670085
418.1F52670085j153171j409649q93236j093566r55999m09782m83334q71599p20143
$$ 652670085 651516914 650107265 649214029 648120463 647164464 646754682 646271348 645399749 644679606
436.5F44679606j48118j788l35455l46839q7917j80066m51386n75482n26548n29110
$$ 644679606 644531488 644529700 644194245 643847406 643759489 643579423 643128037 642552555 642026007 641496897
456.9F41496897p49290p68721o35207n60403m89116o18755o35207m67420p56383j031875
$$ 641496897 640747607 639978886 639343679 638783276 638294160 637675405 637040198 636572778 635816395 634784520
477.3F34784520n75126k9683l30329r05454n19097K01047o6400p20918m23252J95801
$$ 634784520 634209394 634179711 633849382 632943928 632424831 632625878 632559478 631838560 631415308 631611109
497.7F31611109j13785o46353k84672J73926m46200j182914o84261j10507o84560j232206
$$ 631611109 631497324 630850971 630566299 630740225 630294025 629111111 628426850 628316343 627631783 626399577
518.1F26399577n34356K60174j21057o45876j34885K24829n51820j116276l60072L10720
$$ 626399577 625865221 626125395 626004338 625358462 625223577 625448406 624896586 623780310 623420238 623730958
538.4F23730958n89431j502693p45594k3961q42393j462876o67930k28763j111149
$$ 623730958 623141527 621638834 620893240 620869279 620026886 618564010 617896080 617667317 616556168
556.8F16556168j389444k4557Q64148r2387p70152O7830L29435p89940j197160j54912
$$ 616556168 615166724 615142167 616006315 615913928 615143776 615211606 615541041 614751101 613553941 613399029
577.2F13399029L65257m46856o63698M90487R25183p6413m23849N31972P92444l20614
$$ 613399029 613764286 613317430 612653732 613144219 614069402 613992989 613569140 614101112 614893556 614572942
597.6F14572942q07047J28925M06087p64132j322389m70399k6942p29918q85070M65990
$$ 614572942 613765895 613894820 614300907 613536775 612214386 611743987 611717045 610987127 610102057 610568047
618F10568047J528203J193225J064837J804531J962364J104831Q72434J816094K135694
$$ 610568047 612096250 613289475 614354312 616158843 618121207 619226038 620098472 621914566 624050260
636.3F24050260J187086P79152J565039J882076R75728M42147J135409J327336J75476
$$ 624050260 625237346 626016498 627581537 629463613 630439341 630881488 632016897 633344233 633519709
654.7F33519709o02543q9348L00765l08930o48678L99232J687408P29084L38018J482427
$$ 633519709 632917166 632827818 633128583 632819653 632170975 632570207 634257615 634986699 635324717 636807144
675.1F36807144K311289J687527J099169J696825K118111J309812N94616J146912J696587
$$ 636807144 639118433 640805960 641905129 643601954 645720065 647029877 647624493 648771405 650467992
693.5F50467992R28819R6619O69360J427353R65595M09126J066029J753986J126409
$$ 650467992 651396811 651493430 652162790 653590143 654555738 654964864 656030893 657784879 658911288
711.8F58911288L78310Q36254J421690Q69929K61248Q72969J701415J413822P53820
$$ 658911288 659289598 660125852 661547542 662417471 662678719 663551688 665253103 666666925 667420745
730.2F67420745J046240J617313J157820L67999P10189J495183J175761L89636P09354
$$ 667420745 668466985 670084298 671242118 671610117 672320306 673815489 674991250 675380886 676090240
748.5F76090240J557589J387537O63757R68993J875102J671434P80642Q27551J435756
$$ 676090240 677647829 679035366 679699123 680668116 682543218 684214652 684995294 685822845 687258601
766.9F87258601J141131L02553L46124J013101Q50200P0274J86145J037479J089513
$$ 687258601 688399732 688702285 689048409 690061510 690911710 690981984 691168129 692205608 693295121
785.2F93295121L26216K78831R85980Q33571k10166m63545J90556J16408q84593j218557
$$ 693295121 693621337 693900168 694886148 695719719 695509553 695046008 695236564 695352972 694468379 693249822
805.6F93249822o53088p22170j567126j642584p02143k37405n31912o9559J427949
$$ 693249822 692596734 691874564 690307438 688664854 687962711 687725306 687193394 687123835 688551784
824F88551784K313852K053738K070546K804935K808749J686454J010120J325369J214623
$$ 688551784 690865636 692919374 694989920 697794855 700603604 702290058 703300178 704625547 705840170
842.3G05840170K62022J2637J001775J804590J806855K236963L542244M171670L446638
$$ 705840170 706102192 706114829 707116604 708921194 710728049 712965012 716507256 720678926 724125564
860.7G24125564K821088L012657K746046J375556K68161L55482N69403K8968l38852
$$ 724125564 726946652 729959309 732705355 734080911 734349072 734704554 735273957 735302925 734964073
879.1G34964073J50382M10199l07023r47714o87063m22120q95083j250744q58068n87583
$$ 734964073 735114455 735524654 735217631 734269917 733582854 733160734 732265651 731014907 730156839 729569256
899.4G29569256j039564j166284j67549P45296M18842l62098o04212p25210j414657
$$ 729569256 728529692 727363408 727195859 727941155 728359997 727997899 727393687 726668477 725253820
917.8G25253820k169072k195478j931131k125680k392530k037824j441419j358926
$$ 725253820 723084748 720889270 718958139 716832459 714439929 712402105 710960686 709601760
934.1G09601760j547992j417041j256108j636267k236486k258479j783788j690329
$$ 709601760 708053768 706636727 705380619 703744352 701507866 699249387 697465599 695775270
950.4F95775270k156138k529919k631486k922952l418088l528595l215074l156960
$$ 695775270 693619132 691089213 688457727 685534775 682116687 678588092 675373018 672216058
966.8F72216058l498793l683686l570438l744185m520416n312800n664170n949199
$$ 672216058 668717265 665033579 661463141 657718956 653198540 647885740 642221570 636272371
983.1F36272371o374717o480396o121933n797327n655348n154431m043043k943277
$$ 636272371 629897654 623417258 617295325 611497998 605842650 600688219 596645176 593701899
999.4E93701899k467811k324700j975954j756191k154827k673388k739668k805412
$$ 593701899 591234088 588909388 586933434 585177243 583022416 580349028 577609360 574803948
1015.7E74803948l441214m236281m509628m379451m337669m278302l733337k683401
$$ 574803948 571362734 567126453 562616825 558237374 553899705 549621403 545888066 543204665
1032E43204665j337051L74973K196490L114939K437890P96377p10368j798689k668023
$$ 543204665 541867614 542242587 544439077 547554016 549991906 550788283 550077915 548279226 545611203
1050.4E45611203l199995l072738k235234q25048J070440L068268M446924M779935
$$ 545611203 542411208 539338470 537103236 536278188 537348628 540416896 544863820 549643755
1066.7E49643755M332125L764272L323018K719880K003610J691103J808285J812876
$$ 549643755 553975880 557740152 561063170 563783050 565786660 567477763 569286048 571098924
1083E71098924J619994J726568K189159K476156K373874K206922K227783K149046J660227
$$ 571098924 572718918 574445486 576634645 579110801 581484675 583691597 585919380 588068426 589728653
1101.4E89728653J030803M95613j59562q48412q51274J10030J118005J273393J036525
$$ 589728653 590759456 591255069 591095507 590247095 589395821 589505851 590623856 591897249 592933774
1119.7E92933774J270115J921833K497494K912700L318251L470182L163755K780318
$$ 592933774 594203889 596125722 598623216 601535916 604854167 608324349 611488104 614268422
1136F14268422K615273K360821J658499P43568Q9586l83556j077175j784325j985431
$$ 614268422 616883695 619244516 620903015 621646583 621736169 621352613 620275438 618491113 616505682
1154.4F16505682j899242k081513k186716j375139K23339J652062K512395L190279
$$ 616505682 614606440 612524927 610338211 608963072 609186411 610838473 613350868 616541147
1170.7F16541147L798187L943980L655255L446042L311575K734363J772761J056731
$$ 616541147 620339334 624283314 627938569 631384611 634696186 637430549 639203310 640260041
1187F40260041O70373J02461o41764r91702r47237j080692j412451j461208j193344
$$ 640260041 640930414 641032875 640391111 639399409 638452172 637371480 635959029 634497821 633304477
1205.4F33304477r89974r24945p24375l43442n4240J35839N12659R56893R89437N80609
$$ 633304477 632314503 631389558 630665183 630321741 630267501 630403340 630915999 631872892 632862329 633442938
1225.8F33442938K01106L4213j93476n04136n23806k85625k84195n75483p19071n73515
$$ 633442938 633644044 633678257 633484781 632980645 632456839 632171214 631887019 631311536 630592465 630018950
1246.2F30018950m66943m79520l30984l7492Q8633M6849J94013O02066R15111J002550
$$ 630018950 629552007 629072487 628741503 628704011 628792644 628839493 629033506 629635572 630550683 631553233
1266.6F31553233J146316J445830J594484J478136J427352J620352J876176K095699
$$ 631553233 632699549 634145379 635739863 637217999 638645351 640265703 642141879 644237578
1282.9F44237578K348006K520084K313852J796127J455009J460135J397073J012504
$$ 644237578 646585584 649105668 651419520 653215647 654670656 656130791 657527864 658540368
1299.2F58540368O19590M25816K15769j54138m91142n96702n56648m36366l0279N99742
$$ 658540368 659159958 659585774 659801543 659647405 659156263 658559561 658002913 657566547 657536268 658136010
1319.6F58136010R43780Q05259M66168J21891l12507q05437r99332o41644K3007N50330
$$ 658136010 659079790 659885049 660351217 660473108 660160601 659355164 658355832 657714188 657737195 658287525
1340F58287525P95841R63033J009404O64890R5308l20911n18978o70016p85649p37011
$$ 658287525 659083366 660046399 661055803 661720693 661816001 661495090 660976112 660306096 659520447 658783436
1360.4F58783436o47068q29458j107336j061022p39276m08828j48952L7610J04070
$$ 658783436 658136368 657306910 656199574 655138552 654399276 653990448 653841496 653879106 653983176
1378.7F53983176j32084m49062k11238K92718R5427n27918q46625j103937j561880
$$ 653983176 653851092 653402030 653190792 653483510 653578937 653051019 652204394 651100457 649538577
1397.1F49538577j980186k064466j967609k049089k152741k049148j889288j818538
$$ 649538577 647558391 645493925 643526316 641477227 639324486 637275338 635386050 633567512
1413.4F33567512j690268j384497j116455j075506r28879n24640r3996K57313M84943
$$ 633567512 631877244 630492747 629376292 628300786 627371907 626847267 626753271 627010584 627495527
1431.8F27495527O93321J197696J324892O92308M67539M81427L30567K24590K83421
$$ 627495527 628188848 629386544 630711436 631403744 631871283 632352710 632683277 632907867 633191288
1450.1F33191288L98337N49436J253962K002478J456499J204312J843214K568722L016531
$$ 633191288 633589625 634139061 635393023 637395501 638852000 640056312 641899526 644468248 647484779
1468.5F47484779M022599N588114N520761M114807L019154K175748J477838O97314
$$ 647484779 651507378 657095492 662616253 666731060 669750214 671925962 673403800 674101114
1484.8F74101114j83880j312435k522647l116727l490329l815770l275275k264619
$$ 674101114 673917234 672604799 670082152 666965425 663475096 659659326 656384051 654119432
1501.1F54119432j513898r70900p60258j383960k143562k580821k536655k055526j373767
$$ 654119432 652605534 651634634 650874376 649490416 647346854 644766033 642229378 640173852 638800085
1519.5F38800085p29144j88947K89440O02246N31912O03139Q36551M60684L43144J347721
$$ 638800085 638070941 637881994 638171434 638773680 639305592 639908731 640745282 641205966 641549110 642896831
1539.9F42896831J716137J141012J096964J355052J716792J719415J418650J167536
$$ 642896831 644612968 645753980 646850944 648205996 649922788 651642203 653060853 654228389
1556.2F54228389J423061R05276o90818j250565j437188k050519k998948l446877l893077
$$ 654228389 655651450 656556726 655865908 654615343 653178155 651127636 648128688 644681811 640788734
1574.5F40788734n110383n571425n465865n841911o239891o580532o788551o926299
$$ 640788734 635678351 630106926 624641061 618799150 612559259 605978727 599190176 592263877
1590.9E92263877p037937p108212o901681o504119o202876n925656n467116m985869
$$ 592263877 585225940 578117728 571216047 564711928 558509052 552583396 547116280 542130411
1607.2E42130411m727006m467190m057586l855347l842712l148436k482892k086579
$$ 542130411 537403405 532936215 528878629 525023282 521180570 518032134 515549242 513462663
1623.5E13462663j549125r43601l18289J88768Q29279J844287K027631J648426J866460
$$ 513462663 511913538 510969937 510651648 510840416 511669695 513513982 515541613 517190039 519056499
1641.8E19056499K244890L109336L522217K468944L168463N187750L648400K821088
$$ 519056499 521301389 524410725 527932942 530401886 533570349 538758099 542406499 545227587
1658.2E45227587L681958M726767M980028M384279M953206N895853N143940N252600
$$ 545227587 548909545 553636312 558616340 563000619 567953825 573849678 578993618 584246218
1674.5E84246218N979657N305529M789531N694568P688404O597697N086363N455255
$$ 584246218 590225875 595531404 600320935 606015503 613703907 620301604 625387967 630843222
1690.8F30843222N307794N984723O681979O295621O857872N339861M113138M272878
$$ 630843222 636151016 642135739 648817718 655113339 661971211 667311072 671424210 675697088
1707.1F75697088L670812L050506K763569K789617L224552K751529J802385J857996
$$ 675697088 679367900 682418406 685181975 687971592 691196144 693947673 695750058 697608054
1723.4F97608054K313673K342701K266646K280652L059745L183901K205849K576828
$$ 697608054 699921727 702264428 704531074 706811726 709871471 713055372 715261221 717838049
1739.7G17838049L340185L486395L708243M254758N138517N369126M423380M082322
$$ 717838049 721178234 724664629 728372872 732627630 737766147 743135273 747558653 751640975
1756.1G51640975M192114L746927L383517K822459K457142K489388K255559K153695
$$ 751640975 755833089 759580016 762963533 765785992 768243134 770732522 772988081 775141776
1772.4G75141776K029001J574457J335084J384140J520037J514733J225114R95934
$$ 775141776 777170777 778745234 780080318 781464458 782984495 784499228 785724342 786720276
1788.7G86720276J264989J603544J178622P93398J014411J250982J012683P71821R42767
$$ 786720276 787985265 789588809 790767431 791560829 792575240 793826222 794838905 795610726 796553493
1807G96553493J095891R25958P12931Q16822R62496P82370N55516P11500R35555P02798
$$ 796553493 797649384 798575342 799288273 800105095 801067591 801849961 802405477 803116977 804052532 804755330
1827.4H04755330N20527O72281O72937M64618L58164N01394O74487O51121M26471L45886
$$ 804755330 805275857 805948138 806621075 807085693 807443857 807945251 808619738 809270859 809697330 810043216
1847.8H10043216M67598L91007K27272L39925N14269M08233K13921L19779N22136M47929
$$ 810043216 810510814 810901821 811129093 811469018 811983287 812391520 812605441 812925220 813447356 813895285
1868.2H13895285J63555J15276L05414K71380Q2552J64032L76225L03149Q7500J44124
$$ 813895285 814058840 814174116 814479530 814750910 814833462 814997494 815373719 815676868 815764368 815908492
1888.6H15908492L30269K37465L7670Q9228K63095K23160L5763N3823K37763K43365
$$ 815908492 816238761 816476226 816513896 816603124 816866219 817089379 817125142 817178965 817416728 817660093
1909H17660093M3989q822J62721K11119P034q4877J05917J38581p6234q7381J32621
$$ 817660093 817704082 817695260 817857981 818069100 818076134 817991257 818097174 818235755 818159521 818072140 818204761
1931.5H18204761J78873l2306j17898L3498J33455k0087j71005m6552Q1003l8743j63019
$$ 818204761 818383634 818351328 818233430 818266928 818400383 818380296 818209291 818162739 818243742 818204999 818041980
1953.9H18041980m7862P8618n1379k01702n8174J25348j1921k17974r2268R8944l8922
$$ 818041980 817994118 818072736 818021357 817819655 817761481 817886829 817874908 817656934 817564666 817663610 817624688
1976.3H17624688k15769p4565J18136j6093k40803j68025K8431m1961k51413j76251
$$ 817624688 817408919 817334354 817452490 817436397 817195594 817027569 817056000 817014039 816762626 816586375
1996.7H16586375L0101o2406k82228j93775J0371p2062k67386j89782P511o6519k98262
$$ 816586375 816616476 816554070 816271842 816078067 816088438 816016376 815748990 815559208 815566719 815500200 815201938
2019.2H15201938k74539m7922o9141k70069k31385l1591p6055l01004k69830l5822
$$ 815201938 814927399 814879477 814810336 814540267 814308882 814277291 814201236 813900232 813630402 813594580
2039.6H13594580l8803k36034j93775J1921p391j96219j79231L6121L7908j72794j60515
$$ 813594580 813555777 813319743 813125968 813137889 813130498 812934279 812755048 812791169 812829077 812656283 812495768
2062H12495768O2168O0022j52052j80960J0908N5194j23203j65880O855L6240j63496
$$ 812495768 812557936 812617958 812465906 812284946 812295854 812351048 812227845 812061965 812068820 812105060 811941564
2084.4H11941564k24709o3956j2994j70708k25603o9201j0014j69277k43425r6977
$$ 811941564 811716855 811652899 811639905 811469197 811243594 811174393 811164379 810995102 810751677 810654700
2104.8H10654700l0697j68025k30372q7321j5735j50145j98423m5360J3888j15454
$$ 810654700 810624003 810455978 810225606 810138285 810122550 809972405 809773982 809728622 809742510 809627056
2125.2H09627056j72019l2306P4804l4272j29879l8564N0008k861p2658j0371Q7082
$$ 809627056 809455037 809422731 809497535 809463263 809333384 809294820 809344828 809341967 809269309 809258938 809346020
2147.7H09346020K5988r8169n5254O0797L3736m3869J0550Q9229M0114k5809N0187
$$ 809346020 809372008 809273839 809218585 809279382 809313118 809269249 809279799 809369028 809409142 809383333 809433520
2170.1H09433520J59144J05679m768K3305J27375J13249J5736L1531J23560J09077
$$ 809433520 809592664 809698343 809693575 809716880 809844255 809957504 809973240 810004771 810128331 810237408
2190.5H10237408J8954J9848R8110R2506Q166R060Q7917Q7201m351k9504N2929Q4281
$$ 810237408 810256362 810276210 810374320 810466826 810474992 810484052 810571969 810659170 810654819 810625315 810678244 810762525
2215H10762525N900l7193J8656L2068l3796l4630L4630M7386j7941n1737K2590Q4340
$$ 810762525 810768425 810731232 810749888 810781956 810748160 810713530 810748160 810795546 810777605 810725868 810748458 810832798
2239.4H10832798J0729n0246K4974Q2433O437p1942k3008N5731L3259k8253m708N6982
$$ 810832798 810843527 810793281 810818255 810900688 810907125 810835183 810812175 810867906 810901165 810872912 810868204 810925186
2263.9H10925186K9444m1723j7583N2213L0637l8981j4365N8413p16j10387j05143
$$ 810925186 810954630 810912907 810895324 810947537 810978174 810939193 810924828 810983241 810982525 810872138 810766995
2286.3H10766995o6042q7440j07527o7591j6869l9517j26124j60575j19388j05917
$$ 810766995 810700953 810613513 810505986 810438395 810421526 810382009 810255885 810095310 809975922 809870005
2306.7H09870005j46509j64091j21892j11460j99318k44737j52945r1076j67966k19345
$$ 809870005 809723496 809559405 809437513 809326053 809126735 808881998 808729053 808637977 808470011 808250666
2327.1H08250666j13190o6101k20060l11792k12968j08123j11877j8180K07663J8179
$$ 808250666 808137476 808071375 807851315 807539523 807326555 807218432 807106555 807088375 807296038 807314217
2347.5H07314217m70340o22332l38376l6239N424j00315j12176j05560j37031n3048
$$ 807314217 806843877 806221545 805883169 805846930 805852354 805752039 805639863 805534303 805397272 805344224
2367.9H05344224K4259j8418q2314q8930m3213n4896j44661j83940j68263j69218j88768
$$ 805344224 805368483 805350065 805267751 805178821 805135608 805080712 804936051 804752111 804583848 804414630 804225862
2390.4H04225862j91331j68741j56462j89841k29895k28524k14994k13087k22861k21491
$$ 804225862 804034531 803865790 803709328 803519487 803289592 803061068 802846074 802632987 802410126 802188635
2410.8H02188635k21014k53320k88248k92420k88189k93553k95579k99811l20375l30568
$$ 802188635 801967621 801714301 801426053 801133633 800845444 800551891 800256312 799956501 799636126 799305558
2431.2G99305558l23236l37064l44694l28541l27527l14713k82287k93791l56496m00483
$$ 799305558 798982322 798645258 798300564 797972023 797644496 797329783 797047496 796753705 796397209 795996726
2451.5G95996726l89517l41654l10719l34978l82006m05908m07934m03404m06027m11153
$$ 795996726 795607209 795265555 794954836 794619858 794237852 793831944 793424010 793020606 792614579 792203426
2471.9G92203426m17232m35174m33921m27425m46082m69923m78208m57406m31537m48525
$$ 792203426 791786194 791351020 790917099 790489674 790043592 789573669 789095461 788638055 788206518 787757993
2492.3G87757993m98891m95613m33027m36485n19932n48422n01037m70757m66406m55916
$$ 787757993 787259102 786763489 786330462 785893977 785374045 784825623 784324586 783853829 783387423 782931507
2512.7G82931507m38214m36783m56869m55201m15802m04060m56392m81546m22538l85761
$$ 782931507 782493293 782056510 781599641 781144440 780728638 780324578 779868186 779386640 778964102 778578341
2533.1G78578341m34220m59373m24087m10974m38392m41969l87430l64422m11928m33564
$$ 778578341 778144121 777684748 777260661 776849687 776411295 775969326 775581896 775217474 774805546 774371982
2553.5G74371982m12166m05908m31240m39286l87967l63707m39882m87626m29511m02153
$$ 774371982 773959816 773553908 773122668 772683382 772295415 771931708 771491826 771004200 770574689 770172536
2573.9G70172536m57823m73320m03822l90887m81725n23150m58360m03106m51326n00322
$$ 770172536 769714713 769241393 768837571 768446684 767964959 767441809 766983449 766580343 766129017 765628695
2594.3G65628695m36604l91066m75704n53012n06699m43757m74989n27442m91380m31657
$$ 765628695 765192091 764801025 764325321 763772309 763265610 762821853 762346864 761819422 761328042 760896385
2614.7G60896385m78387n52774n23924m69745n03421n69581n73576n41031n43535n64098
$$ 760896385 760417998 759865224 759341300 758871555 758368134 757798553 757224977 756683946 756140411 755576313
2635.1G55576313n39422n02706n44548o11365n92053n51462n62489n81324n69940n40197
$$ 755576313 755036891 754534185 753989637 753378272 752786219 752234757 751672268 751090944 750521004 749980807
2655.5G49980807n32925n60641n62132m98950m56452n20409n93185n37991m69864n07772
$$ 749980807 749447882 748887241 748325109 747826159 747369707 746849298 746256113 745718122 745248258 744740486
2675.9G44740486n36024m97997m82738n41628n69343m86970m25399m79042n41925n19932
$$ 744740486 744204462 743706465 743223727 742682099 742112756 741625786 741200387 740721345 740179420 739659488
2696.3G39659488m82440n00917n22971m90070m40299m45843m92334m87626m36246m33445
$$ 739659488 739177048 738676131 738153160 737663090 737222791 736776948 736284614 735796988 735360742 734927297
2716.7G34927297m69506m35233l48628l50237m25875m40955l82483l38495l46124l38256
$$ 734927297 734457791 734022558 733673930 733323693 732897818 732456863 732074380 731735885 731389761 731051505
2737.1G31051505k91467k61843k71976k85030k65538k84255l59654l66390l08335l24070
$$ 731051505 730760038 730498195 730226219 729941189 729675651 729391396 729031742 728665352 728357017 728032947
2757.5G28032947m21524m49241l79741l80099m59850m62293l95715l93987n13315o08683
$$ 728032947 727611423 727162182 726782441 726402342 725942492 725480199 725084484 724690497 724177182 723568499
2777.9G23568499n51701n15103n93662o31929n52475n29885o79374p83026p26044o96481
$$ 723568499 723016798 722501695 721908033 721276104 720723629 720193744 719514370 718731344 718005300 717308819
2798.3G17308819p95245q86738q59082q03351q24273r04202r58443r55165j010358
$$ 717308819 716513574 715626836 714767754 713964403 713140130 712235928 711277485 710322320 709311962
2816.6G09311962j129269j146853j119018j215398j368404j420200j429438j587093
$$ 709311962 708182693 707035840 705916822 704701424 703333020 701912820 700483382 698896289
2832.9F98896289j879335k146303k460838l014803l676891m180610m432976m316926
$$ 698896289 697016954 694870651 692409813 689395010 685718119 681537509 677104533 672787607
2849.3F72787607l582180k186715o38426L78072O78421N50746K22862k86042q32618
$$ 672787607 669205427 667018712 666380286 666758358 667436779 667987525 668210387 667924345 667091727
2867.6F67091727j024127p87854o07252o61433o71327o49750q19802j142860j421273
$$ 667091727 666067600 665279746 664672494 664011061 663339734 662689984 661870182 660727322 659306049
2886F59306049j580059j699746j780867j703978j537204j468301j496791j505197j509964
$$ 659306049 657725990 656026244 654245377 652541399 651004195 649535894 648039103 646533906 645023942
2904.3F45023942j682818k055705k443432k802313l238857l605186l571094l017902
$$ 645023942 643341124 641285419 638841987 636039674 632800817 629195631 625624537 622606635
2920.6F22606635k102613j063228j0490R30190J511752J812220K137184K418578K436280
$$ 622606635 620504022 619440794 619430304 620360494 621872246 623684466 625821650 628240228 630676508
2939F30676508K274215K079010J806617J349330P74443L47018J39177K3842O676J99735
$$ 630676508 632950723 635029733 636836350 638185680 638960123 639307141 639446318 639470160 639476836 639676571
2959.4F39676571N91278R36687J109123J219869J346826J459003J425087J293123J308918
$$ 639676571 640267849 641204536 642313659 643533528 644880354 646339357 647764444 649057567 650366485
2977.8F50366485J362741J172423R50695R42707R16421P22289M64976K18391K1160
$$ 650366485 651729226 652901649 653852344 654795051 655711472 656433761 656898737 657117128 657138288
2996.1F57138288k29061n26785o41644o53208p82490q61525p02381n54860o23703o84917
$$ 657138288 656909227 656382442 655740798 655087590 654305100 653443575 652741194 652186334 651562631 650877714
3016.5F50877714o05643n72264o66976q09133r26673r47237r30071r71615j048923
$$ 650877714 650272071 649699807 649032831 648223698 647297025 646349788 645419717 644448102 643399179
3034.9F43399179j103044j108467j134694j194536j224399j237929j219869j197040
$$ 643399179 642296135 641187668 640052974 638858438 637634039 636396110 635176241 633979201
3051.2F33979201j224398j242817j266241j281202j195430j082242j025617j044393
$$ 633979201 632754803 631511986 630245745 628964543 627769113 626686871 625661254 624616861
3067.5F24616861j118600j135469j056790r20057q18074q89182j040995j071274j035870
$$ 624616861 623498261 622362792 621306002 620385945 619567871 618678689 617637694 616566420 615530550
3085.8F15530550j025021j027703j071691j079560j002848r77039j023591j052618
$$ 615530550 614505529 613477826 612406135 611326575 610323727 609346688 608323097 607270479
3102.2F07270479j048445j037658j057803j127065j128316j028835j002193j092672
$$ 607270479 606222034 605184376 604126573 602999508 601871192 600842357 599840164 598747492
3118.5E98747492j259089j419604j417458j303851j252175j287937j326859j306295
$$ 598747492 597488403 596068799 594651341 593347490 592095315 590807378 589480519 588174224
3134.8E88174224j249552j276612j422227j502871j454055j420200j379550j284182
$$ 588174224 586924672 585648060 584225833 582722962 581268907 579848707 578469157 577184975
3151.1E77184975j352846j590372j662373j538396j442194j471341j550853j531064
$$ 577184975 575832129 574241757 572579384 571040988 569598794 568127453 566576600 565045536
3167.4E65045536j481355j551509j602828j536429j507401j554847j598776j608193
$$ 565045536 563564181 562012672 560409844 558873415 557366014 555811167 554212391 552604198
3183.7E52604198j583457j548647j561046j613021j620293j605987j602233j577437
$$ 552604198 551020741 549472094 547911048 546298027 544677734 543071747 541469514 539892077
3200.1E39892077j541495j543760j576841j552224j494169j509190j561165j558244
$$ 539892077 538350582 536806822 535229981 533677757 532183588 530674398 529113233 527554989
3216.4E27554989j510143j489640j533448j564086j525342j479328j435101j367271
$$ 527554989 526044846 524555206 523021758 521457672 519932330 518453002 517017901 515650630
3232.7E15650630j379251j450718j407325j296759j243055j228749j225949j224756
$$ 515650630 514271379 512820661 511413336 510116577 508873522 507644773 506418824 505194068
3249E05194068j199126j175165j185775j206816j212328j212537j221866j200884j112491
$$ 505194068 503994942 502819777 501634002 500427186 499214858 498002321 496780455 495579571 494467080
3267.4D94467080j032740j068235j159250j191736j181930j137525j066506j036763
$$ 494467080 493434340 492366105 491206855 490015119 488833189 487695664 486629158 485592395
3283.7D85592395j061171j082897j035810r75430j017600j134157j200676j155615
$$ 485592395 484531224 483448327 482412517 481437087 480419487 479285330 478084654 476929039
3300D76929039j050294r72330j031220j222879j387894j431674j388222j351923j381158
$$ 476929039 475878745 474906415 473875195 472652316 471264422 469832748 468444526 467092603 465711445
3318.4D65711445j461596j517802j543522j655221j815528j866221j825541j768232
$$ 465711445 464249849 462732047 461188525 459533304 457717776 455851555 454026014 452257782
3334.7D52257782j724750j808643j954138j943618j837045j698494j510769j467526
$$ 452257782 450533032 448724389 446770251 444826633 442989588 441291094 439780325 438312799
3351D38312799j580924j609802j503915j392960j389862j403063j254737j128734j285165
$$ 438312799 436731875 435122073 433618158 432225198 430835336 429432273 428177536 427048802 425763637
3369.3D25763637j543343j532406j290083j153290j140505j110852j042098r60409
$$ 425763637 424220294 422687888 421397805 420244515 419104010 417993158 416951060 415990651
3385.7D15990651q29608o57558p08133r80735j026034p35671n51760p59065r94116
$$ 415990651 415161043 414503485 413795352 412814617 411788583 411052912 410501152 409742087 408747971
3404D08747971q43823n69254m81695m76390m69178m64171l94732k97427k28793j24752
$$ 408747971 407904148 407334894 406853199 406376809 405907631 405443460 405048728 404751301 404522508 404397756
3424.4D04397756j0759P1556J04755J88440L27676K41995j7524k4288K40415M67896
$$ 404397756 404386997 404458553 404563308 404751748 405079424 405321419 405303895 405279607 405520022 405987918
3444.8D05987918N66125N58347N60105O31928P10368Q16018R41664R32783R14335J134664
$$ 405987918 406554043 407112390 407672495 408304423 409014791 409830809 410772473 411705256 412619591 413754255
3465.2D13754255J320719J126141Q21948Q44419J061171J260817J346797J231015J184374
$$ 413754255 415074974 416201115 417023063 417867482 418928653 420189470 421536267 422767282 423951656
3483.6D23951656J342356J398355J349032J406043J520396J612871J601249J593143
$$ 423951656 425294012 426692367 428041399 429447442 430967838 432580709 434181958 435775101
3499.9D35775101J668662J577377J356393J401633J690507J884163J835197J708686
$$ 435775101 437443763 439021140 440377533 441779166 443469673 445353836 447189033 448897719
3516.2D48897719J714379J855195K080678K062679J786351J771599K000719K126336
$$ 448897719 450612098 452467293 454547971 456610650 458397001 460168600 462169319 464295655
3532.5D64295655K243937K332031K177269K139687K378911K545416K441883K226651
$$ 464295655 466539592 468871623 471048892 473188579 475567490 478112906 480554789 482781440
3548.8D82781440K266854K493769K494752K482087K704739K798647K588958K707958
$$ 482781440 485048294 487542063 490036815 492518902 495223641 498022288 500611246 503319204
3565.1E03319204L464997L524780K809524K673209L015220L187299L296852L405392
$$ 503319204 506784201 510308981 513118505 515791714 518806934 521994233 525291085 528696477
3581.5E28696477L252805L293276L829479L732502L061831L237784L822386L898621
$$ 528696477 531949282 535242558 539072037 542804539 545866370 549104154 552926540 556825161
3597.8E56825161L830910L813147L507853L373325L958463M265905M057526M006446
$$ 556825161 560656071 564469218 567977071 571350396 575308859 579574764 583632290 587638736
3614.1E87638736L733158M103243M890323M208267L127932L129304N018174N958796
$$ 587638736 591371894 595475137 600365460 604573727 607701659 610830963 615849137 621807933
3630.4F21807933M155815L616631L971576M044056M159212L975630L500879L838241
$$ 621807933 625963748 629580379 633551955 637596011 641755223 645730853 649231732 653069973
3646.7F53069973N551696N786657L514230K934754M249096M155398L297448L160774
$$ 653069973 658621669 664408326 667922556 670857310 675106406 679261804 682559252 685720026
3663F85720026K912820K663016L501654L785252K521933L169179L624916K147197J752258
$$ 685720026 688632846 691295862 694797516 698582768 701104701 704273880 707898796 710045993 711798251
3681.4G11798251J795768J661480K297342L056764K241791J217365J072585J109124
$$ 711798251 713594019 715255499 717552841 720609605 722851396 724068761 725141346 726250470
3697.7G26250470J164138J530588J414716P43031O10471J193941J877725J276076K59995
$$ 726250470 727414608 728945196 730359912 731102943 731713414 732907355 734785080 736061156 736321151
3716.1G36321151K15352O33657P95781O97136O69778M29451K13206O27518J264333
$$ 736321151 736536503 737170160 737965941 738663077 739332855 739762306 739975512 740603030 741867363
3734.4G41867363J372993N05805o38544l94702J279652J059175L4809R17494J136720
$$ 741867363 743240356 743746161 743107617 742712915 743992567 745051742 745086551 746004045 747140765
3752.8G47140765L2783k50697L30150N36382J24872J32501K81215M34875N73516J51634
$$ 747140765 747173548 746922851 747253001 747789383 747914255 748046756 748327971 748762846 749336362 749487996
3773.2G49487996j42693J73449O27875M25876K9802J74165K49624Q4817l6597l3796
$$ 749487996 749345303 749518752 750146627 750572503 750602305 750776470 751026094 751110911 751074314 751040518
3793.6G51040518K65599J99437O3956P28487L56734j43945M20570J05620n64814l16322
$$ 751040518 751306117 751505554 751569510 752297997 752654731 752510786 752931356 753036976 752472162 752155840
3814G52155840N24164L67105K07364P27535O318m20332j64271r2506P3016O6041J52231
$$ 752155840 752680004 753047109 753254473 753982008 753988326 753567994 753403723 753311217 753384233 753450274 753602505
3836.4G53602505N24401L09408l3677l9875l25024q17955q16047P31409J888156J27434
$$ 753602505 754126906 754436314 754402637 754362762 754037738 753219783 752403736 753135145 755023301 755150735
3856.8G55150735r27806o13212O1870L41415j49906m3154M19677L7908j91092l57807
$$ 755150735 754222929 753609717 753671587 754013002 753863096 753819942 754239619 754277527 754086435 753728628
3877.2G53728628j57952K64346k4676J52350J08480m12226L3319K05040m59611n01990
$$ 753728628 753570676 753835022 753810346 753962696 754071176 753658950 753692269 753897309 753437698 752935708
3897.6G52935708N0187L41654L93688J68443l22282l95656k03908j90198j3292K65718
$$ 752935708 752985895 753327549 753721237 753889680 753567398 753171742 752967834 752777636 752764344 753030062
3918G53030062Q7738k41935j42158O0j86861j41203J79529J20163j88589k97785j94907
$$ 753030062 753117800 752875865 752733707 752733767 752546906 752405703 752585232 752705395 752516806 752219021 752024114
3940.4G52024114O0022M5717j64211j7762R3221q9883j41859o7294j08361j14203l6120
$$ 752024114 752084136 752129853 751965642 751947880 752041101 751951218 751809359 751742065 751633704 751519501 751483381
3962.9G51483381k5749J3232M7922o1333j16348j8836j0490p0155j311Q1182K443j07884
$$ 751483381 751457632 751470864 751518786 751457453 751341105 751322269 751311779 751241624 751240313 751321495 751323938 751216054
3987.3G51216054p8738K027L9577R477n0962
$$ 751216054 751137316 751139343 751178920 751188397 751137435
3997.5G51137435
$$ 751137435
##END=$$ End of the data block
