##TITLE=PHB Puro $$ Begin of the data block
##JCAMP-DX=5.00 $$ ACD/SpecManager v 10.08
##SPECTROMETER/DATA SYSTEM=Alpha
##DATE=03 Dec 2014 11:51:22
##DATA TYPE=INFRARED SPECTRUM
##DATA CLASS=XYDATA
##ORIGIN=
##OWNER=
##NPOINTS=1765
##FIRSTX=399.76428223
##LASTX=3997.64306641
##MAXX=3997.64306641
##MINX=399.76428223
##MAXY=1.00209534
##MINY=0.01568652
##XFACTOR=1.0000000000
##YFACTOR=0.000000010000000
##FIRSTY=1.00000000
##DELTAX=2.03961372
##XUNITS=1/CM
##YUNITS=ARBITRARY UNITS
##XYDATA=(X++(Y..Y))
399.8 100000000 100209534 100028443 99674237 99751776 100000000 99749863 99240655 99159068 99248397 98777086
420.2 98777086 98202527 97984934 97651398 96948254 96613050 97163564 97837520 97897816 97799486 98030239
440.6 98030239 98135948 97738326 97404152 97442079 97198761 96224815 94956595 93660212 92543000 92512155
461 92512155 93912894 95908713 97281218 97734326 97983927 98383301 98369569 97855711 97532171 97536814
481.3 97536814 97240281 96556032 96101856 95894617 95326090 94374102 93611717 93009204 91944569 90237480
501.7 90237480 88287330 85955995 82493359 77858657 72880179 68978810 67991042 70910424 76347667
520.1 76347667 81623316 85245001 87366164 89040697 90913433 92675698 94054449 95373875 96683496
538.5 96683496 97511786 97856718 98305875 98957115 99276501 99227166 99374640 99771309 99887383 99682593
558.9 99682593 99698812 99981099 100000000 99711710 99613214 99738550 99575365 99080694 98729753 98543280
579.3 98543280 98036283 97213483 96570927 96131265 95443934 94504350 93832964 93527043 93186814 92813462
599.6 92813462 92848688 93261749 93503314 93405890 93314683 93255311 92791533 91825175 90802592 89992064
620 89992064 89272112 88841003 89223188 90398324 91687334 92697978 93670839 94731617 95527762 95953882
640.4 95953882 96438181 97158056 97723460 97957170 98260230 98820764 99238622 99311060 99428523 99781531
660.8 99781531 99954152 99717700 99323553 99031168 98537850 97527957 96349329 95725048 95884901 96543503
681.2 96543503 97437888 98329216 98782766 98626930 98309439 98224622 98192525 98046410 98096812 98530281
701.6 98530281 98945463 98991883 98928577 99056613 99113208 98809570 98451430 98389262 98397577 98176020 97948676
724.1 97948676 98016483 98177189 98104519 97976685 98103207 98290837 98208523 98034281 98128086 98343319 98322439
746.5 98322439 98196793 98321116 98569900 98590076 98497123 98652273 98968512 99093652 99096179 99316376 99677438
768.9 99677438 99804288 99740714 99843132 100080419 100093579 99897552 99863338 100000000 99997449 99797589 99768895
791.4 99768895 99926901 99913251 99700934 99638098 99745971 99663079 99313360 99001741 98767650 98251826
811.8 98251826 97352326 96332401 95118517 92966872 88846570 82999104 79215044 81256509 86695147
830.1 86695147 90675288 91836983 90938675 89649236 90266848 92865771 95231920 96234715 96461338
848.5 96461338 96494758 96296185 95791978 95296383 95087099 95049715 95061165 95315450 95884603 96362454
868.9 96362454 96351033 95957279 95445466 94761848 93790793 92701393 91599965 90124416 87760329
887.2 87760329 84217578 79429227 74230903 71079946 72017562 75933158 79844791 81938034 82040256
905.6 82040256 80615240 78930759 79031760 81444067 84417337 86305970 86703104 85763925 83642435
923.9 83642435 80533195 77564424 76514179 77327168 77762121 76633346 75626153 76883858 79841602
942.3 79841602 82014018 81926101 79718101 76268488 73087329 71763855 72230291 72802055 72294658
960.7 72294658 70791292 68773085 66446960 63672203 60117137 55257285 48473975 40229306 33571038
979 33571038 32717940 39050025 49931064 61519814 71357322 78728145 83842975 87169307 89283854
997.4 89283854 90721083 91688418 92186928 92360735 92417699 92326510 91939110 91311282 90586394 89693975
1017.8 89693975 88469785 86943126 85205406 83127123 80467480 77106816 72965705 67912292
1034.1 67912292 61785120 54306304 45544931 37013459 31227016 28965357 28015181 25775728 21962756
1052.4 21962756 18153022 15910487 15869513 17911452 21621548 26591349 32521862 39064983 45603555
1070.8 45603555 51283371 55332547 57454127 58005422 57777441 57476085 57342571 57184601 56589824
1089.2 56589824 55038524 52090877 47782052 42872953 38798481 37332591 39575058 44908974
1105.5 44908974 51515913 57727438 62475890 65113527 65305287 62945038 58185065 51579988 44014904
1123.8 44014904 36403337 29528478 24195519 21333148 21682765 25237107 30926701 37127167 42679697
1142.2 42679697 47333857 51433676 55435395 59490532 63267344 66177213 67725343 67635018 65839934
1160.5 65839934 62532920 58131140 53092384 47805756 42635465 37918615 33887440 30665120
1176.9 30665120 28305382 26818591 26165405 26259968 26993999 28251478 29910037 31848672 33972034
1195.2 33972034 36232632 38603216 41019821 43374747 45523116 47257090 48293421 48368350 47387430
1213.6 47387430 45423216 42631438 39424101 36416137 33674461 30707800 27836370 26690102
1229.9 26690102 28768885 34001952 40742975 46869510 50987655 52754861 52423006 50456780 47394592
1248.2 47394592 43669567 39467832 34813499 29830629 25012213 21373975 19993846 20732792 21890473
1266.6 21890473 21736324 19946975 17295042 14589876 12215455 10394280 9445197 9564622 10328051
1285 10328051 10770416 10538652 10307197 10713586 11882681 13725300 15907389 17948778 19588019
1303.3 19588019 20872772 22024101 23293325 24931408 27145800 30001053 33470786 37424734
1319.6 37424734 41548198 45589584 49406087 52861214 55872583 58407283 60444391 61911476
1336 61911476 62628037 62345940 61016649 59010458 57174826 56364501 56378549 56140202 54900128 53078431
1356.4 53078431 52092665 52848738 54683125 55934972 55757231 54308408 52312410 50019348 45702228
1374.7 45702228 38450322 31406251 28842700 31502643 36541891 41808587 46412086 50056487
1391 50056487 53360146 56616783 59079218 59957576 59389216 58958972 60237956 62717348 64993048
1409.4 64993048 66701657 67887187 68675220 69259435 69826871 70396554 71037304 71792436 72592282
1427.7 72592282 73385650 74076533 74563646 74687743 74011737 72347099 70009345 67826807 66111302
1446.1 66111302 63963962 61347359 59436816 58731329 58661401 58957684 60187137 62464309 65935886
1464.5 65935886 69840044 73040676 75835550 78708154 81093365 82698256 83866608 84788883 85574597
1482.8 85574597 86254364 86854601 87384301 87839806 88229418 88581693 88910234 89201951 89486009 89759332
1503.2 89759332 90008640 90230018 90423638 90597439 90761137 90946156 91183764 91444087 91697299 91944039
1523.6 91944039 92193341 92443436 92663550 92880183 93132538 93390304 93626267 93867433 94091213 94276154
1544 94276154 94437158 94597471 94785494 94976294 95144671 95296496 95447743 95568854 95669711 95786685
1564.4 95786685 95931983 96079630 96186393 96270907 96356243 96415442 96428639 96430284 96433258 96432310 96401685 96348691
1588.9 96348691 96308565 96277702 96213251 96100622 95977747 95849037 95693135 95504856 95304370 95086628
1609.3 95086628 94843245 94592166 94295222 93929982 93650627 93447685 93212402 92974293 92723948 92469853
1629.7 92469853 92320192 92279285 92229867 92118835 92020738 91945517 91885823 91789615 91689020 91672742 91659129
1652.1 91659129 91537845 91451728 91412467 91336894 91181964 91005653 90905929 90790355 90566242 90269500
1672.5 90269500 89776742 88967848 87896711 86359382 83130825 77390647 74428451 75564826 77495712
1690.9 77495712 77964664 76498830 73905545 71245813 67955482 64312202 59513003 52919918 45682225
1709.2 45682225 37972242 29671150 20629999 11233533 4790212 2246983 1568652 1656616 2108468
1727.6 2108468 2677553 3304460 4070737 4868568 5432544 5976085 6572367 7192191 7961893 9106573
1748 9106573 11161496 14311774 18136621 22859004 28218001 33272281 38112241 42175201 45392805
1766.3 45392805 48327315 50988287 53515613 55683279 57367110 58874148 60339648 61680990
1782.6 61680990 62920314 64069301 65084535 66026980 66948855 67728209 68352264 68901300 69398558
1801 69398558 69882083 70369607 70911974 71534908 72239316 72949356 73627847 74312645 75010771 75689209
1821.4 75689209 76323408 76928121 77460676 77931654 78362072 78786784 79244417 79722399 80172378 80584544
1841.8 80584544 80992156 81366056 81684196 81984395 82302821 82616234 82905388 83178234 83454061 83716148
1862.2 83716148 83946472 84157199 84348685 84514958 84647244 84773731 84908354 85037285 85141844 85251439
1882.6 85251439 85403961 85583013 85749787 85909629 86097634 86292112 86463439 86617041 86781126 86940932
1903 86940932 87070692 87178916 87286758 87394017 87486857 87575394 87668705 87763423 87826955 87850499 87858152
1925.4 87858152 87847960 87797880 87731487 87702948 87738520 87841117 88013303 88259137 88538045 88789243 88998872
1947.9 88998872 89187235 89354986 89483237 89580601 89684367 89805543 89915961 90007335 90095240 90188140
1968.3 90188140 90273988 90357178 90464401 90599775 90736198 90859240 90985215 91119605 91239214 91329032
1988.7 91329032 91410518 91499126 91578656 91635734 91687864 91752404 91815138 91859710 91897708 91945904 91993082 92024821
2013.1 92024821 92048740 92079806 92113853 92135793 92149979 92173278 92203814 92228276 92256504 92305529 92362809 92403555
2037.6 92403555 92428231 92450213 92467475 92470843 92470914 92491090 92532885 92574501 92607987 92654866 92730159 92815268
2062.1 92815268 92893648 92974907 93063676 93144095 93207175 93263382 93314391 93340683 93328339 93292487 93257719 93232292
2086.6 93232292 93216813 93220758 93247998 93282926 93309808 93338585 93393153 93471402 93551415 93630171 93721807 93816978
2111 93816978 93892592 93945909 93986189 94012928 94023901 94040555 94090188 94172150 94261259 94344801 94432384 94525999
2135.5 94525999 94605148 94661272 94712079 94765687 94806904 94825763 94839251 94862717 94888729 94907266 94932866 94979173
2160 94979173 95029718 95067590 95103383 95149791 95190656 95209867 95213628 95211029 95195854 95162040 95123762 95103884
2184.5 95103884 95104229 95109105 95119441 95144475 95179987 95216250 95260483 95325577 95400149 95460057 95506287 95556521
2208.9 95556521 95606989 95637017 95640045 95629293 95608622 95570767 95522690 95481789 95451546 95428050 95417702 95431697
2233.4 95431697 95472109 95528322 95592904 95667988 95753080 95833260 95894718 95941621 95982957 96016580 96038169 96053171
2257.9 96053171 96068031 96080667 96083605 96078295 96074337 96068829 96049660 96027863 96028382 96054870 96094292 96138102 96189541
2284.4 96189541 96251887 96315765 96370244 96419728 96466374 96497923 96509773 96512568 96511519 96495074 96459198 96427691
2308.9 96427691 96422076 96428829 96425247 96408898 96389073 96365213 96328700 96292311 96271664 96259016 96248126 96244150
2333.3 96244150 96248913 96258336 96269834 96288419 96320415 96381950 96462989 96507478 96486127 96423453 96352249 96283966
2357.8 96283966 96243560 96243382 96271384 96326208 96418041 96536851 96647435 96738565 96834987 96945554 97048247
2380.2 97048247 97126669 97192025 97251898 97291070 97302330 97305596 97316116 97318572 97303510 97291511 97300297 97317511
2404.7 97317511 97327852 97342408 97377926 97420990 97444487 97451895 97460121 97456747 97422147 97378707 97364646 97378993
2429.2 97378993 97396410 97420335 97473496 97542959 97593606 97625023 97662145 97702485 97723150 97732413 97768033 97833818
2453.7 97833818 97894478 97937846 97982132 98024416 98035735 98012573 97983950 97958100 97910428 97843945 97800803 97797102
2478.1 97797102 97801214 97791308 97782987 97786558 97785622 97772837 97772348 97796816 97819519 97820467 97821528 97839248 97852027 97846121
2506.7 97846121 97842103 97853225 97860366 97847879 97828299 97819448 97813541 97797841 97786790 97798389 97823489 97848588
2531.2 97848588 97886878 97950417 98017931 98062497 98090094 98112702 98117691 98089379 98039269 97995073 97960103 97925490
2555.6 97925490 97908306 97934109 97998118 98074812 98156106 98250622 98347396 98421073 98473531 98523796 98573363 98611844
2580.1 98611844 98641884 98678648 98726308 98770159 98802817 98835623 98873758 98904544 98919380 98928493 98938566 98938930
2604.6 98938930 98926461 98915917 98913068 98906893 98892194 98875183 98859096 98834646 98796266 98755455 98725230 98703665
2629.1 98703665 98682082 98665810 98667240 98686099 98708338 98722208 98728085 98725671 98703247 98658407 98610306 98569262
2653.5 98569262 98532015 98506105 98509383 98547530 98603362 98659569 98714805 98767328 98805654 98822176 98820525 98805922
2678 98805922 98777139 98735327 98694575 98670584 98661840 98659867 98666674 98682880 98699921 98712367 98724842 98742938 98761910
2704.5 98761910 98766333 98753941 98741257 98729283 98705214 98676926 98660201 98648840 98632747 98618627 98621625 98641300
2729 98641300 98657441 98663223 98672032 98687172 98695582 98692530 98686868 98683518 98680997 98697531 98767602 98893982 99038237
2755.5 99038237 99167240 99276060 99365240 99427998 99461770 99480593 99500108 99516475 99520254 99519163 99522030 99518067
2780 99518067 99494451 99453998 99399102 99322695 99235725 99175322 99168074 99195468 99215370 99207842 99176073 99121338
2804.5 99121338 99037057 98937917 98862314 98819536 98782402 98735809 98686773 98640007 98589379 98529279 98465806 98407412
2828.9 98407412 98358834 98337018 98361367 98417711 98465198 98476779 98452634 98395616 98297215 98163372 98026347
2851.4 98026347 97906876 97786075 97632200 97417927 97091061 96560216 95720780 94512534 93028343
2869.7 93028343 91605049 90683407 90462393 90772963 91310751 91880357 92419612 92903775 93287981 93526679
2890.1 93526679 93606555 93539929 93356258 93105495 92857271 92668444 92544931 92460030 92384988 92272753
2910.5 92272753 92045343 91626519 90956742 89966583 88501495 86235940 82862473 78682947 74612981
2928.9 74612981 71238708 68812740 67992890 69222587 71926874 75103086 78095132 80632275 82619977
2947.2 82619977 84060550 85012025 85515755 85587299 85231358 84386551 82879329 80531359 77481127
2965.6 77481127 74328834 71529877 68811548 66010153 64014763 63736880 64803684 66124672 67059803
2984 67059803 67608839 67969853 68219984 68246669 67938435 67628092 68145281 69963139 72470087 74574137
3004.4 74574137 75835037 76739085 78073871 80132264 82532698 84752816 86561996 87978148 89087617
3022.7 89087617 89960784 90656531 91229850 91707832 92105371 92440075 92723286 92976731 93209207 93410426
3043.1 93410426 93579656 93723601 93859667 93997240 94128221 94247788 94351524 94445974 94547838 94651890
3063.5 94651890 94743264 94812500 94852453 94873750 94902867 94961220 95034701 95082027 95097154 95106655 95113748 95112193
3088 95112193 95106184 95096874 95094937 95118243 95168853 95228714 95281541 95336479 95406687 95478314 95531923 95587480 95666873
3114.5 95666873 95740861 95781136 95781749 95749903 95723462 95731026 95755410 95760453 95745635 95748013 95778847 95800555 95781595
3141 95781595 95744193 95716166 95693743 95684284 95692909 95682305 95626760 95554811 95496702 95450735 95406520 95359111
3165.5 95359111 95304686 95244932 95186943 95131570 95079821 95034510 94988054 94934839 94881010 94830042 94777018 94717121
3189.9 94717121 94652957 94590050 94527394 94464183 94407737 94363016 94324982 94284260 94235075 94184142 94138300 94087362
3214.4 94087362 94025886 93961573 93894374 93822438 93754917 93700093 93654871 93618637 93583971 93520558 93430966 93352503
3238.9 93352503 93289524 93235713 93196774 93149549 93069154 92983621 92926306 92882633 92823511 92750055 92680478 92618269
3263.4 92618269 92560500 92519075 92496753 92458105 92384595 92297173 92207533 92118996 92037112 91965723 91901535 91838050
3287.8 91838050 91780263 91722369 91643929 91537958 91409570 91285855 91203022 91150284 91070300 90930802 90757859
3310.3 90757859 90589309 90435916 90288073 90141636 89995956 89852792 89710212 89540458 89335293 89123321
3330.7 89123321 88923103 88740528 88569230 88373274 88139409 87894928 87645245 87398314 87173963 86942649
3351.1 86942649 86674786 86395103 86129361 85876858 85621578 85356331 85100472 84858304 84607393 84340042
3371.5 84340042 84068710 83808804 83565229 83329469 83095866 82872885 82672524 82500803 82354033 82211620
3391.9 82211620 82056570 81899154 81757367 81623000 81469822 81301296 81147993 81014490 80880457 80740356
3412.3 80740356 80598319 80453718 80301100 80123788 79900855 79602885 79173225 78519827 77553010 76342297
3432.7 76342297 75285369 74891740 75236160 75897878 76477861 76875854 77161723 77411240 77655727 77896869
3453.1 77896869 78132308 78362149 78595173 78848463 79111964 79354948 79593289 79871094 80176312 80462450
3473.4 80462450 80717403 80951762 81179190 81417012 81649995 81862926 82073438 82280630 82471842 82654381
3493.8 82654381 82840794 83036029 83231807 83418775 83615726 83821094 84004992 84163219 84314430 84479338
3514.2 84479338 84653080 84822160 84983552 85137850 85297084 85468566 85640168 85805011 85966396 86128116
3534.6 86128116 86297607 86476547 86661398 86848730 87033576 87217051 87403524 87590277 87782812 87980002
3555 87980002 88174522 88376361 88598067 88831347 89053309 89274752 89515203 89757460 89997435 90248281
3575.4 90248281 90508223 90771699 91042042 91315335 91584599 91849041 92108274 92361480 92619002 92881697
3595.8 92881697 93136775 93383676 93632162 93877196 94107234 94337440 94575465 94798595 95003825 95195735
3616.2 95195735 95375377 95560586 95751631 95935857 96090496 96217692 96367759 96521950 96664351 96804988
3636.6 96804988 96935922 97062927 97201937 97344118 97463262 97550285 97645485 97760236 97862548 97963876
3657 97963876 98072267 98167336 98254758 98351008 98438621 98501259 98580217 98649234 98661304 98698163 98777974 98856890
3681.5 98856890 98946333 99049932 99144828 99206614 99254578 99314409 99376011 99430591 99465871 99486929 99529517
3703.9 99529517 99593270 99650609 99661756 99633813 99649948 99697888 99734306 99758875 99772263 99773562 99786896 99828380
3728.4 99828380 99867177 99881071 99874920 99876440 99918622 99962270 99936455 99879354 99900001 99904466 99833786 99800712
3752.9 99800712 99825501 99839228 99831969 99844784 99874902 99898618 99910212 99906027 99914682 99946547 99979037 99999899
3777.3 99999899 100000000 99992043 99985409 99977136 99977785 99986821 99992245 99985868 99978501 99981725 99955213 99919325 99934059 99937600
3805.9 99937600 99928933 99957716 99995071 100002050 99991244 99987692 99945742 99903172 99910265 99903399 99870324 99831998 99815661
3832.4 99815661 99833709 99822265 99774176 99773490 99805206 99829870 99856687 99886161 99872911 99753922 99665916 99714959
3856.9 99714959 99777174 99798667 99788290 99798232 99831963 99835020 99825937 99832726 99857521 99894750 99908501 99918741
3881.4 99918741 99929398 99903691 99875289 99850541 99823850 99829584 99849600 99844468 99811053 99770594 99742991 99758172
3905.8 99758172 99808156 99853975 99890387 99917310 99922574 99921232 99939781 99963278 99971849 99979198 99986941 99983507 99982178
3932.3 99982178 99994159 100008082 100015950 100012434 100002515 100000000 99997944 99994040 99998587 100002372 99995768 99990571 99986285 99961692
3960.9 99961692 99923545 99887604 99841177 99782199 99732685 99703509 99688500 99681604 99685025 99709857 99748272 99775660
3985.4 99775660 99792618 99809909 99827057 99848890 99880248 99911690
3997.6 99911690
##END=$$ End of the data block
