##TITLE=PHB ind $$ Begin of the data block
##JCAMP-DX=5.00 $$ ACD/SpecManager v 10.08
##SPECTROMETER/DATA SYSTEM=Alpha
##DATE=03 Dec 2014 11:51:26
##DATA TYPE=INFRARED SPECTRUM
##DATA CLASS=XYDATA
##ORIGIN=
##OWNER=
##NPOINTS=1765
##FIRSTX=399.76428223
##LASTX=3997.64306641
##MAXX=3997.64306641
##MINX=399.76428223
##MAXY=1.00053513
##MINY=0.30112076
##XFACTOR=1.0000000000
##YFACTOR=0.000000010000000
##FIRSTY=1.00000000
##DELTAX=2.03961372
##XUNITS=1/CM
##YUNITS=ARBITRARY UNITS
##XYDATA=(X++(Y..Y))
399.8A00000000p5990l49176q8221L11518K01869k42931m61757k64388P0202J12450
$$ 100000000 99924010 99574834 99486613 99798131 100000000 99757069 99295312 99030924 99101126 99213576
420.2I9213576l53712o11895l09163J25640J92029k7448j21176J38515L99220K08401
$$ 99213576 98859864 98247969 97938806 98064446 98256475 98229027 98107851 98246366 98645586 98853987
440.6I8853987k59524m49669j77634Q2826j41048p23338j114094j072228m47393M54247
$$ 98853987 98594463 98144794 97967160 98049986 97908938 97185600 96071506 94999278 94551885 95006132
461I5006132Q97157Q74788Q03333P23148L61889j40994l18671j00422J44113O1368
$$ 95006132 95903289 96778077 97581410 98304558 98666447 98525453 98206782 98106360 98250473 98311841
481.3I8311841k93815m80765k90972n7816j43510n05883p45845o55484n25570p50124
$$ 98311841 98018026 97537261 97246289 97188473 97044963 96539080 95793235 95137751 94612181 93862057
501.7I3862057j278997j771497k114553k402979k719456k499187r78780J552165L403163
$$ 93862057 92583060 90811563 88697010 86294031 83574575 81075388 80096608 81648773 85051936
520.1H5051936L376710K240652J213056Q93247J147056J340800J064104O17701M89718
$$ 85051936 88428646 90669298 91882354 92775601 93922657 95263457 96327561 96945262 97434980
538.5I7434980O42532O46394L25114r817j8680K15864L32499J38235j45662j68956
$$ 97434980 98077512 98723906 99049020 99039203 99020523 99236387 99568886 99707121 99561459 99392503
558.9I9392503Q9002K71577R9939k15030k60490j6397J32948m3833l49629m29166k41196
$$ 99392503 99481505 99753082 99853021 99637991 99377501 99361104 99494052 99450219 99100590 98671424 98430228
581.3I8430228q5932k16007m97317o02585m22103j79171j71429l33870l18038m196
$$ 98430228 98344296 98128289 97630972 97028387 96606284 96427113 96255684 95921814 95603776 95599580
601.7I5599580K86537K43193o1738k98590k88236k25633l94577p33555q69989n77223
$$ 95599580 95886117 96129310 96067572 95768982 95480746 95255113 94860536 94126981 93256992 92679769
622.1I2679769J2380N18655O87165O54310O94662Q11231P69967M98533K40564K39373
$$ 92679769 92692149 93210804 93897969 94552279 95246941 96058172 96828139 97326672 97567236 97806609
642.5I7806609M30298N07414L16143P3916O7341K62308L52812J70249r9194j63293
$$ 97806609 98236907 98744321 99060464 99134380 99201721 99464029 99816841 99987090 99887896 99724603
662.9I9724603m4555k2805k55453n11682o83659o94073l43203J76519N05513N40161
$$ 99724603 99680048 99657243 99401790 98890108 98206449 97512376 97169173 97345692 97851205 98391366
683.3I8391366M87858M09114J74940j55783l09437j38760J67126K80708J40548n138
$$ 98391366 98879224 99288338 99463278 99307495 98998058 98859298 99026424 99307132 99447680 99442542
703.7I9442542M8279J94210J69087o4201k53564k04712j7714O2465n6231j90442j26672
$$ 99442542 99490821 99685031 99854118 99789917 99536353 99331641 99313927 99376392 99320161 99129719 99003047
726.1I9003047Q5574J91808P1680j14148j28621L9541J60194P2187j00779j16855N4389
$$ 99003047 99088621 99280429 99352109 99237961 99109340 99148881 99309075 99381262 99280483 99163628 99218017
748.5I9218017J93924J17987p2992j27602K9815K01761J66941j8751q8984N5766K12735
$$ 99218017 99411941 99529928 99456936 99329334 99359149 99560910 99727851 99709100 99620116 99675882 99888617
771I9888617J64896m5431j63328n7113J10519J01840n4210j83142j01018Q2249J17570
$$ 99888617 100053513 100008082 99844754 99787641 99898160 100000000 99945790 99762648 99661630 99743879 99861449
793.4I9861449m6003j94877j39755K8205O3431j18017l36969l87860l10468l36898
$$ 99861449 99815446 99620569 99480814 99509019 99572450 99454433 99117464 98729604 98419136 98082238
813.8I8082238o09439j036024j589430k587354l538084k160603J566553L665442K646583
$$ 98082238 97472799 96436775 94847345 92259991 88721907 86561304 88127857 91793299 94439882
832.2I4439882P99507m89134p32326L46523J496351J467961P38162J13690j96648k17539
$$ 94439882 95239389 94750255 94017929 94364452 95860803 97328764 98066926 98180616 97983968 97766429
852.6I7766429j23882j26755k25491k20531j2684K39516K71523L4356k43128l52841
$$ 97766429 97642547 97515792 97290301 97069770 97057086 97296602 97568125 97602481 97359353 97006512
873I7006512l37106l80105n56457p55870q76767j040620j498591k340579l230572l235632
$$ 97006512 96669406 96289301 95732844 94976974 94100207 93059587 91560996 89220417 85989845 82754213
893.4H2754213j471424J277589K884454K562386J359284J94358p45856r57352R7847
$$ 82754213 81282789 82560378 85444832 88007218 89366502 89560860 88815004 87857652 87955499
911.7H7955499J445019J693368R79757L6305q84425j708299k184737j742250l55082
$$ 87955499 89400518 91093886 92073643 92109948 91225523 89517224 87332487 85590237 85235155
930.1H5235155O26266J92219o47366l48717R46992J659102J032000k16919j327675
$$ 85235155 85861421 86053640 85406274 85057557 86004549 87663651 88695651 88478732 87151057
948.4H7151057j967001j726926n93328M11206M00645k83689r67657j435471j740694
$$ 87151057 85184056 83457130 82863802 83275008 83675653 83391964 82424307 80988836 79248142
966.8G9248142k073562k694124l747600m985225n361754l427351P63613M939837P042855
$$ 79248142 77174580 74480456 70732856 65747631 60385877 56958526 57722139 62661976 69704831
985.1F9704831P033473N905634M448712L053659J916796J153183P41553M96918K32673
$$ 69704831 76738304 82643938 87092650 90146309 92063105 93216288 93957841 94454759 94687432
1003.5I4687432o1935k59602l14337l45534m82941p09397q95363r82272j063931j265335
$$ 94687432 94625497 94365895 94051558 93706024 93223083 92513686 91618323 90636051 89572120 88306785
1023.9H8306785j590318j944613k293367k695733l172076l723222m390591m901123
$$ 88306785 86716467 84771854 82478487 79782754 76610678 72887456 68496865 63595742
1040.2F3595742m490662k800351r29856n17708j602662k638626k460143j161972N49984
$$ 63595742 59105080 56304729 55374873 54857165 53254503 50615877 48155734 46993762 47543746
1058.6D7543746K087867L199918L892272M267478M358936M118055L482717K477789
$$ 47543746 49631613 52831531 56723803 60991281 65350217 69468272 72950989 75428778
1074.9G5428778J323998L68404j46371k50053k01750k83891o50775j315582k145511
$$ 75428778 76752776 77121180 76974809 76724756 76523006 76239115 75588340 74272758 72127247
1093.2G2127247k878755l181088k630240q98707J579195L561533M220891L757023K695370
$$ 72127247 69248492 66067404 63437164 62538457 64117652 67679185 71900076 75657099 78352469
1111.6G8352469J358670r4241j565337k926296l970075m511106m534107m143399l338927
$$ 78352469 79711139 79616898 78051561 75125265 71155190 66644084 62109977 57966578 54627651
1129.9E4627651j979429l8296K110440L708965M195731L755290L053313K608043K508515
$$ 54627651 52648222 52609926 54720366 58429331 62625062 66380352 69433665 72041708 74550223
1148.3G4550223K499414K272332J725453R46247M3810r03225j791412k485531k889008
$$ 74550223 77049637 79321969 81047422 81993669 82037479 81134254 79342842 76857311 73968303
1166.7G3968303l012973k942216k744794k432150j984703j429558q43728l04842J50150
$$ 73968303 70955330 68013114 65268320 62836170 60851467 59421909 58578181 58273339 58423489
1185E8423489N39506Q75968J127952J264149J295727J292652J313693J320749J226735
$$ 58423489 58962995 59838963 60966915 62231064 63526791 64819443 66133136 67453885 68680620
1203.4F8680620R79567N83809O0773n63305j218003j819659k290719k460885k255565
$$ 68680620 69660187 70243996 70304769 69741464 68523461 66703802 64413083 61952198 59696633
1221.7E9696633k025104k010423j633531k18838J926124L821450M664964M220909K885884
$$ 59696633 57671529 55661106 54027575 53808737 55734861 59556311 64221275 68442184 71328068
1240.1G1328068J303577j37496j313305k151030k648801k956539l236455l456133l377700
$$ 71328068 72631645 72494149 71180844 69029814 66381013 63424474 60188019 56731886 53354186
1258.4E3354186k664310j261750L7959J94014p58750j783293k153269j969498j584721
$$ 53354186 50689876 49428126 49466085 49660099 48901349 47118056 44964787 42995289 41410568
1276.8D1410568j034557j93638P53945J190153P18230J9669j5092M50066R43592J374472
$$ 41410568 40376011 40182373 40936318 42126471 42844701 42864370 42849278 43299344 44242936 45617408
1297.2D5617408J592013J455185J139277Q99219Q18819Q49801R72009J204592J515228
$$ 45617408 47209421 48664606 49803883 50703102 51521921 52371722 53343731 54548323 56063551
1315.6E6063551J842224K086544K139014K080405K026135J970577J861519J652276
$$ 56063551 57905775 59992319 62131333 64211738 66237873 68208450 70069969 71722245
1331.9G1722245J374722J092672P92986L37523l62736j009625j060158l84772K75892
$$ 71722245 73096967 74189639 74982625 75320148 74957412 73947787 72887629 72502857 72778749
1350.2G2778749K07127m51708r44257n77176M46540J200295R41116N5849p34997j017844
$$ 72778749 72985876 72534168 71589911 71012735 71459275 72659570 73600686 73656535 72921538 71903694
1370.6G1903694j141280k489370m661215m851627k126986J226992K814084K986145
$$ 71903694 70762414 68273044 63611829 58760202 56633216 57860208 60674292 63660437
1386.9F3660437K591276K044553J830422J774621J329119M42129m11564l86298O15329
$$ 63660437 66251713 68296266 70126688 71901309 73230428 73672557 73260993 72874695 73490024
1405.3G3490024J406490J367790J129955R20075O71798M51285M06742M54920N25886
$$ 73490024 74896514 76264304 77394259 78314334 78986132 79437417 79844159 80299079 80824965
1423.7H0824965N66989M94105M35805M40145L80820J87522k84928r59223j431031j263684
$$ 80824965 81391954 81886059 82321864 82762009 83142829 83330351 83045423 82086200 80655169 79391485
1444.1G9391485q30280j054788j516086j282626o14798k46144l4654N39357J138282
$$ 79391485 78561205 77506417 75990331 74707705 74092907 73846763 73812109 74351466 75489748
1462.4G5489748J846569K180386J777619J453900J492113J400197J103371Q48866O20496
$$ 75489748 77336317 79516703 81294322 82748222 84240335 85640532 86743903 87592769 88213265
1480.8H8213265M63438L83228L75712M08131L97140K86680K11144K86626L70950K83074
$$ 88213265 88676703 89059931 89435643 89843774 90240914 90527594 90738738 91025364 91396314 91679388
1501.2I1679388J11687j5252J30677L80397K97045J33276N1350J23322K17062K36636
$$ 91679388 91791075 91775823 91906500 92286897 92583942 92717218 92768568 92891890 93108952 93345588
1521.6I3345588K11728J77831K44200K94447K24441J44476J05411N8352J29831L17198
$$ 93345588 93557316 93735147 93979347 94273794 94498235 94642711 94748122 94806474 94936305 95253503
1542I5253503K74498J74611J42050J87803K02476R8521n5987q3589K63381L46929J74594
$$ 95253503 95528001 95702612 95844662 96032465 96234941 96333462 96277475 96193886 96457267 96804196 96978790
1564.4I6978790L3474q548J20962K02215P4994n3137M47Q5807J12223O1190o0785j26910
$$ 96978790 97012264 97003716 97124678 97326893 97401887 97348750 97349197 97435004 97547227 97608417 97547632 97420722
1588.9I7420722o1494L5459K9707q0806j63776j30117l0106j5873j28031k32636k02281
$$ 97420722 97359228 97394687 97424394 97343588 97179812 97049695 97019589 97003716 96875685 96643049 96440768
1611.3I6440768j26564j63669k40004j99491j54274p8792K909q2606j81603j47987
$$ 96440768 96314204 96150535 95910531 95711040 95556766 95477974 95480883 95398277 95216674 95068687
1631.7I5068687o6477N9754J23262J3763p5603p6621l9578L2938k945j47027m2259
$$ 95068687 95002210 95061964 95185226 95198989 95123386 95046765 95007187 95040125 95037180 94890153 94847894
1654.1I4847894J75148O7931j43849k92975k21515j05667j94627l54117m06665n21111
$$ 94847894 95023042 95090973 94947124 94654149 94432634 94326967 94132340 93778223 93371558 92850447
1674.5I2850447o52755q20517j261634k450996l782034j621110Q60626J012790j87945
$$ 92850447 92197692 91377175 90115541 87664545 83882511 82261401 83122027 84134817 83946872
1692.9H3946872j587910k308798k327925k878844k950543l523827m488111m608428
$$ 83946872 82358962 80050164 77722239 74843395 71892852 68369025 63880914 59272486
1709.2E9272486m733068n045831n633971o376025m939717k147976k83822Q79168J414058
$$ 59272486 54539418 49493587 43859616 37483591 32543874 30395898 30112076 30991244 32405302
1727.6C2405302J461881J323754J321915J202064P87226O73771O68367N98699O09321
$$ 32405302 33867183 35190937 36512852 37714916 38502142 39175913 39844280 40442979 41052300
1745.9D1052300P83244J312968J939538K214300K526868K760908K605891K563530K231759
$$ 41052300 41835544 43148512 45088050 47302350 49829218 52590126 55196017 57759547 59991306
1764.3E9991306J783711J602912J474243J509088J407016J104617R32395Q99393Q84413
$$ 59991306 61775017 63377929 64852172 66361260 67768276 68872893 69805288 70704681 71589094
1782.6G1589094Q63237P87437O39212N64718O35576O31595M97877L75677L21811L60942
$$ 71589094 72452331 73239768 73878980 74443698 75079274 75710869 76208746 76584423 76906234 77267176
1803G7267176L96693L97151L74872L92413M48114M87667M87703M39769L81893L67838
$$ 77267176 77663869 78061020 78435892 78828305 79276419 79764086 80251789 80691558 81073451 81441289
1823.4H1441289M15677L94380L19320K89714K99067L32212L68130L29793K26241J92255
$$ 81441289 81856966 82251346 82570666 82860380 83159447 83491659 83859789 84189582 84415823 84608078
1843.8H4608078K73675L22896K78938K08300J75375K10416K50554K33954J66154J08683
$$ 84608078 84881753 85204649 85483587 85691887 85867262 86077678 86328232 86562186 86728340 86837023
1864.2H6837023J01036J46306K03383J64920R2983Q6194J32561J41496R2351N0926
$$ 86837023 86938059 87084365 87287748 87452668 87545651 87631845 87764406 87905902 87998253 88049179
1884.6H8049179O4689J25206J82205J62870R8264R7001J46120J71781J35529O7276
$$ 88049179 88113868 88239074 88421279 88584149 88682413 88779414 88925534 89097315 89232844 89300120
1905H9300120L5882P4017J33639J28603O0946J4615N8556J09684R3049K6560l7527
$$ 89300120 89336002 89410019 89543658 89672261 89733207 89747822 89806378 89916062 90009111 90035671 89998144
1927.5H9998144l9578O944L1037J6605J9920P0942J54340K16097J92332J22785R5839
$$ 89998144 89958566 89965510 89996547 90013152 90033072 90104014 90258354 90474451 90666783 90789568 90885407
1949.9I0885407J20938J39427J05828M7660L2919P3189J08421Q4573L3992J9229N5569
$$ 90885407 91006345 91145772 91251600 91299260 91332179 91405368 91513789 91598362 91632354 91651583 91707152
1972.3I1707152J09494J22958Q2434M8822P2133J17320J18828O4045J1331K6309Q7017
$$ 91707152 91816646 91939604 92022038 92070860 92142993 92260313 92379141 92443186 92454517 92480826 92567843
1994.8I2567843J05036O4569J9390J7756N6904Q3536N9325Q756j0687J9544O3938O7061
$$ 92567843 92672879 92737448 92756838 92774594 92831498 92915034 92974359 92983115 92972428 92991972 93055910 93122971
2019.2I3122971K1046j2767J2136O0647O5422K1637j0145J2893O0945P0113K4951k2549
$$ 93122971 93144017 93131250 93143386 93204033 93269455 93291092 93280947 93293840 93354785 93424898 93449849 93427300
2043.7I3427300k0378K6452N7376L1322j1498r328M2474Q8799P9501L5179K1529N9306
$$ 93427300 93406922 93433374 93490750 93522072 93510574 93501246 93543720 93632519 93712020 93747199 93768728 93828034
2068.2I3828034R9039Q6481K9993o110J3596M5705L0118k7150o0719k6625M1610O6060
$$ 93828034 93927073 94013554 94043547 94037437 94051033 94096738 94126856 94099706 94038987 94012362 94053972 94120032
2092.7I4120032K3120k4974j1796N1522R1917P1108K6649K2430O7198R7853O5595N66
$$ 94120032 94143152 94118178 94106382 94157904 94249821 94320929 94347578 94370008 94437206 94535059 94600654 94601220
2117.1I4601220k7669R066O1912O5833K7424J0055M9216J00410R6440L9888j234J8579
$$ 94601220 94573551 94582617 94644529 94710362 94737786 94747841 94797057 94897467 94993907 95033795 95032561 95051140
2141.6I5051140O5380P0649K1285k2262j0127L8129O1083L2657q106n197M3505P6610
$$ 95051140 95116520 95187169 95208454 95186192 95176065 95214194 95275277 95307934 95299828 95294631 95338136 95414746
2166.1I5414746N0056m256j9163J6534M5252J7309m1466o1924j6635M2981M7153J919
$$ 95414746 95464802 95460546 95441383 95457917 95503169 95520478 95479012 95417088 95400453 95443434 95490587 95492506
2190.6I5492506k4557Q386O2627P1388K8265l088K0975P0268Q2815L7044j6159j8626
$$ 95492506 95467949 95476335 95538962 95610350 95638615 95635527 95656502 95726770 95809585 95846629 95830470 95811844
2215I5811844J7404L0458o908n8037o4075j7202K7377K2101j1581j2678L4851Q2654
$$ 95811844 95829248 95859706 95852798 95794761 95730686 95713484 95740861 95762962 95751381 95738703 95773554 95856208
2239.5I5856208Q0102L7349J0699L5262P3015O4725J6528j5157M554M6325N1659Q589
$$ 95856208 95936310 95973659 95984358 96019620 96092635 96157360 96173888 96158731 96163285 96209610 96261269 96269858
2264I6269858l2407k6167J3751L3403O002k8432j6880L3766O7223M9972R316J967L9447
$$ 96269858 96237451 96211284 96225035 96258438 96264440 96236008 96219128 96252894 96320117 96370089 96379405 96381372 96420819
2290.5I6420819P0130N1201L493j9747l04K5200J4496k7448n3644l0672J8394L7092
$$ 96420819 96490949 96542150 96545643 96525896 96525592 96550792 96565288 96537840 96484196 96453524 96471918 96509010
2315I6509010K682m1115m1521j895J9598j1880m7737l1102K1386M6409K2238j0878
$$ 96509010 96511692 96470577 96429056 96427161 96446759 96434879 96387142 96356040 96377426 96423835 96446073 96435195
2339.5I6435195j0025K9564P6294P5691K2066l8212n1976j5592k712l4613m4512O467
$$ 96435195 96425170 96454734 96531028 96606719 96628785 96590573 96538597 96523005 96520293 96485680 96441168 96447635
2363.9I6447635O5076P6956N5295M1711N4389Q1116Q9717O5494L3033K5153M3577N2988
$$ 96447635 96512711 96589667 96644962 96686673 96741062 96822178 96911895 96977389 97010422 97035575 97079152 97132140
2388.4I7132140K4224j8782k8306L28K6059J4555j7398k4140P123L9565L6526O944
$$ 97132140 97156364 97137582 97109276 97109604 97135663 97150218 97132820 97108680 97115803 97155368 97191894 97198838
2412.9I7198838r578O407K9022K0200j8341m4018k4420K2799M7254K9547K837R119
$$ 97198838 97189260 97195667 97224689 97244889 97226548 97182530 97158110 97180909 97228163 97257710 97260547 97269666
2437.4I7269666M5634O3478L6753j049n812K4510N2195M2802J2446M852K8407M8960
$$ 97269666 97315300 97378778 97415531 97414482 97408670 97433180 97485375 97528177 97540623 97545475 97573882 97622842
2461.8I7622842L3092j1235m0144k9266o628j0681l6627m2975j0497K9630L2622m310
$$ 97622842 97655934 97644699 97604555 97575289 97568661 97557980 97521353 97478378 97467881 97497511 97530133 97525823
2486.3I7525823l3343j7994K1124L6597J2380k0278j7738J8215L9297J8472j4335j6576
$$ 97525823 97492480 97474486 97495610 97532207 97544587 97524309 97506571 97524786 97564083 97582555 97568220 97551644
2510.8I7551644R400K6386Q554k6691l7098r447K2894K2918k373j0776J9193N7256
$$ 97551644 97561044 97587430 97595984 97569293 97532195 97522748 97545642 97568560 97566187 97555411 97574604 97631860
2535.3I7631860O0713K4891o580N72K3055J5837k3675n3132m4024q106J8376J5247
$$ 97631860 97692573 97717464 97710884 97711456 97734511 97750348 97726673 97673541 97629517 97621411 97639787 97655034
2559.7I7655034P701K9713P1311R0504O8891L1465J9705M0859N6297L9488Q947j896
$$ 97655034 97662735 97692448 97763759 97854263 97923154 97954619 97974324 98015183 98071480 98110968 98119915 98118019
2584.2I8118019K0146M7905M2760J2028k134J5069L6317L2532R83k9385k3073J0747
$$ 98118019 98138165 98186070 98228830 98240858 98238724 98253793 98290110 98322642 98323625 98294240 98271167 98281914
2608.7I8281914K4819R24k6881k2370M095J1241j4007m2063m0054r173J4817P010j2899
$$ 98281914 98306733 98307657 98280776 98258406 98262501 98273742 98259735 98217672 98177618 98168445 98183262 98190272 98177373
2635.2I8177373p212K1374L5310J8013j6040l7467k8783j0640j4573l4624l7510o753
$$ 98177373 98170161 98191535 98226845 98244858 98228818 98191351 98162568 98151928 98137355 98102731 98065221 98058468
2659.7I8058468L5656N0068L2341J4031J7255L5537L8522J0395k1732k7036j0562J520
$$ 98058468 98094124 98144192 98176533 98190564 98207819 98243356 98281878 98292273 98270541 98243505 98232943 98234463
2684.1I8234463m554k0337j9306J0693L6877K8402J979n371J2583K8569J8781j1188
$$ 98234463 98229909 98209572 98190266 98200959 98237836 98266238 98268217 98262846 98275429 98303998 98322779 98311591
2708.6I8311591l0094j8722O610J1444j0741k7030j5533J0651K1231J741j8895o616
$$ 98311591 98281497 98262775 98269385 98280829 98270088 98243058 98227525 98238176 98259407 98261148 98242253 98235637
2733.1I8235637K5600L5334J1098j3447j1187Q744K0599J8400K2912N0992R0557J08653
$$ 98235637 98261237 98296571 98307669 98294222 98283035 98291779 98312378 98330778 98353690 98404682 98495239 98603892
2757.6I8603892Q7709M4387J6230K1559L7522L1054J770j9574j2547J0109J5211j0097
$$ 98603892 98691601 98735988 98752218 98773777 98811299 98842353 98844123 98824549 98812002 98822111 98837322 98827225
2782I8827225m0871m9072l5459k6000k9570k3287L439L0828L1822k276m8393o9571
$$ 98827225 98786354 98737282 98701823 98675823 98646253 98622966 98626405 98657233 98689055 98686779 98638386 98568815
2806.5I8568815n1093j9699j3155l0655m2164l1203j0240p814l0590n1558m5639j7816
$$ 98568815 98517722 98498023 98484868 98454213 98412049 98380846 98370606 98362792 98332202 98280644 98235005 98217189
2831I8217189L493k640k0230l3158n8115j07306j78587k51276k76762k29073j46645
$$ 98217189 98220682 98218042 98197812 98164654 98106539 97999233 97820646 97569370 97292608 97063535 96916890
2853.4I6916890q3399n0026m3565p6878j78736l76511o39272q32867p82502m57269
$$ 96916890 96833491 96783465 96739900 96663022 96484286 96107775 95468503 94635636 93853134 93395865
2873.8I3395865m4388K42144L49665L56173L33530K80988J88506Q6653N204n8383j21456
$$ 93395865 93351477 93593621 93943286 94299459 94632989 94913977 95102483 95189136 95194340 95135957 95014501
2896.3I5014501j77223j91933j55061r3442n2870o9064j35874k27875l37350m77195
$$ 95014501 94837278 94645345 94490284 94396842 94343972 94274908 94139034 93911159 93573809 93096614
2916.6I3096614o61391r17554j322788j885682k294600k216202j834053j308376l85994
$$ 93096614 92435223 91517669 90194881 88309199 86014599 83798397 81964344 80655968 80269974
2935H0269974P93714J627767J869869J728898J447201J138109Q35294N50091K87574
$$ 80269974 81063688 82691455 84561324 86290222 87737423 88875532 89710826 90260917 90548491
2953.4I0548491O0368j35398l76958p61514j270324j669974j683729j452506j439261
$$ 90548491 90608859 90473461 90096503 89334989 88064665 86394691 84710962 83258456 81819195
2971.7H1819195j541973j081615k9630Q14194R71871O94812L95494K28691J18995p8261
$$ 81819195 80277222 79195607 79165977 79980171 80952042 81646854 82042348 82271039 82390034 82311773
2992.1H2311773l75229m69625j3548Q04061J304918J127184O28781L90720O26439J060325
$$ 82311773 81936544 81466919 81453371 82257432 83562350 84689534 85318315 85709035 86335474 87395799
3012.5H7395799J289308J215953J008415Q15553O64699N22989L90809L11012K86537
$$ 87395799 88685107 89901060 90909475 91725028 92389727 92912716 93303525 93614537 93901074
3030.9I3901074K70569K20764J56540J36876J50877J47039J12790P2985O0136P1924
$$ 93901074 94171643 94392407 94548947 94685823 94836700 94983739 95096529 95169514 95229650 95301574
3051.3I5301574Q6481Q5509N8525L4482N0074Q6426R5904N4425l928j7053K3604O9463
$$ 95301574 95388055 95473564 95532089 95566571 95616645 95703071 95798975 95853400 95849472 95832419 95856023 95925486
3075.7I5925486O7151K2155k122J0627J6493J365k4611m4584k2495L3963O2197L5525
$$ 95925486 95992637 96014792 96012670 96023297 96039790 96041155 96016544 95971960 95949465 95983428 96045625 96081150
3100.2I6081150M398J9849N9306O3199K4623J0449M4399O8021M8482o467n5563m3106
$$ 96081150 96085548 96105397 96164703 96227902 96252525 96262974 96307373 96375394 96423876 96417409 96361846 96318740
3124.7I6318740J1021L4654J841l7246k4570K7693M8113K688m5759m3100r542K3710
$$ 96318740 96329761 96364415 96366256 96329010 96304440 96332133 96380246 96382934 96337175 96294075 96284533 96308243
3149.2I6308243K5565k3055p0137n8925k3723j4877k9624l9828l1977k1482k6602m6408
$$ 96308243 96333808 96310753 96240616 96181691 96157968 96143091 96113467 96073639 96041662 96020180 95993578 95947170
3173.6I5947170o0564m9019k0486r638k8658m8298m5508l1614k4980l6669o0761o5863
$$ 95947170 95886606 95837587 95817101 95807463 95778805 95730507 95684999 95653385 95628405 95591736 95530975 95465112
3198.1I5465112m0531j6338j6099l1930m3387l1584j6111k8861n6028p0393o1626l7163
$$ 95465112 95424581 95408243 95392144 95360214 95316827 95285243 95269132 95240271 95184243 95113850 95052224 95015061
3222.6I5015061k6775m1729n0014k7817o813l1054p5800q6808o5291l4785p200j0467
$$ 95015061 94988286 94946557 94896543 94868726 94861913 94830859 94755059 94668251 94602960 94568175 94560975 94550508
3247.1I4550508m8327o6471m2165k1582l9649o7592o5929m2957j7261N698M685l1662
$$ 94550508 94502181 94435710 94393545 94371963 94332314 94264722 94198793 94155836 94138575 94144273 94148958 94117296
3271.5I4117296o0511n7888n4026o2018p0232n9784l4404k1112k2721l4958n7632p6300
$$ 94117296 94056785 93998897 93944871 93882853 93812621 93752837 93718433 93697321 93674600 93639642 93582010 93505710
3296I3505710q6110q7905o9601m2325m6742q7476j28084j40345j25546j07729j00267
$$ 93505710 93419600 93331695 93262094 93219769 93173027 93085551 92957467 92817122 92691576 92583847 92483580
3318.4I2483580j08915j22732j24342j30462j39994j38259j42312j49274j40547j40488
$$ 92483580 92374665 92251933 92127591 91997129 91857135 91718876 91576564 91427290 91286743 91146255
3338.8I1146255j62989j88607k07657j94985j54972j57714k08127k31898k11382j84989
$$ 91146255 90983266 90794659 90587002 90392017 90237045 90079331 89871204 89639306 89427924 89242935
3359.2H9242935j82247j95771j94586j83820j90533k09492k16532k09194j98585j82885
$$ 89242935 89060688 88864917 88670331 88486511 88295978 88086486 87869954 87660760 87462175 87279290
3379.6H7279290j66422j62703j64449j44428j03224q6981j10107j29181j17106r7650
$$ 87279290 87112868 86950165 86785716 86641288 86538064 86451083 86340976 86211795 86094689 85997039
3400H5997039j03664j18852j15681j06799j01835r4664q9770r7079j13517j24406j30642
$$ 85997039 85893375 85774523 85658842 85552043 85450208 85355544 85265774 85168695 85055178 84930772 84800130
3422.5H4800130j67465k69944m41718o63298q25560p08586k52330K43276M59921M15868
$$ 84800130 84632665 84362721 83921003 83257705 82432145 81723559 81471229 81714505 82174426 82590294
3442.9H2590294K99847K24471J95462J82986J75214J72853J71334J68216J64366J59591
$$ 82590294 82890141 83114612 83310074 83493060 83668274 83841127 84012461 84180677 84345043 84504634
3463.2H4504634J60080J72943J86551J84297J75310J71905J69981J62303J55491J50776
$$ 84504634 84664714 84837657 85024208 85208505 85383815 85555720 85725701 85888004 86043495 86194271
3483.6H6194271J47903J52033J49388J33138J18393J20294J35762J41227J31917J36393
$$ 86194271 86342174 86494207 86643595 86776733 86895126 87015420 87151182 87292409 87424326 87560719
3504H7560719J45281J38384J33282J32322J26344J20825J24681J26498J17994J08707
$$ 87560719 87706000 87844384 87977666 88109988 88236332 88357157 88481838 88608336 88726330 88835037
3524.4H8835037J10924J34683J59824J54978J34468J28799J39892J49143J41460J26862
$$ 88835037 88945961 89080644 89240468 89395446 89529914 89658713 89798605 89947748 90089208 90216070
3544.8I0216070J32096J50943J57923J65694J63657J40792J38837J59896J44851R8413
$$ 90216070 90348166 90499109 90657032 90822726 90986383 91127175 91266012 91425908 91570759 91669172
3565.2I1669172J37699K39581K49433K12127J89155J76299J84542K03156J86974J42318
$$ 91669172 91806871 92046452 92295885 92508012 92697167 92873466 93058008 93261164 93448138 93590456
3585.6I3590456J56737K26968K25282J94454J99425J99485J85382J99068K00784J49381
$$ 93590456 93747193 93974161 94199443 94393897 94593322 94792807 94978189 95177257 95378041 95527422
3606I5527422J23287J48737J61553J71762J53893J20700J68419K10643J53040M3804
$$ 95527422 95650709 95799446 95960999 96132761 96286654 96407354 96575773 96786416 96939456 96983260
3626.4I6983260J5145J51122J99390J60318J35994J04737Q1236P0160K5094n4664l1846
$$ 96983260 96998405 97149527 97348917 97509235 97645229 97749966 97831202 97901362 97926456 97871792 97839946
3648.8I7839946J53493K01244J11478R0468J20455Q6355M2594K4974k5350o2024R304
$$ 97839946 97993439 98194683 98306161 98396629 98517084 98603439 98646033 98671007 98645657 98583633 98592937
3671.3I8592937Q553k6732R5939J55777J20389P9722J9806l8594j0240R7495J24920
$$ 98592937 98601490 98574758 98670697 98826474 98946863 99026585 99046391 99007797 98997557 99095052 99219972
3693.7I9219972Q2064L9202J686N031N2243L8052l5089q0699m440J09899R5641K4980
$$ 99219972 99302036 99341238 99342924 99347955 99400198 99438250 99403161 99322462 99318022 99427921 99523562 99548542
3718.2I9548542j5604j8841j1307J1724L2604r310q1802p6741M4579J20276M6664q5342
$$ 99548542 99532938 99514097 99502790 99514514 99547118 99537808 99456006 99379265 99423844 99544120 99590784 99505442
3742.7I9505442r4992O813m0859o3294Q6939J22446L2681j019N6952O3700J1510k0194
$$ 99505442 99410450 99417263 99376404 99313110 99400049 99522495 99555176 99554157 99611109 99674809 99686319 99666125
3767.1I9666125k1017L3915P7963M3428j4377k4825O515Q446J0007K9153K1022k700
$$ 99666125 99645108 99679023 99756986 99800414 99786037 99761212 99767727 99776173 99786180 99815333 99836355 99833655
3791.6I9833655l3319m9489l7516o4641m4048M5497L3503L8559P1609J6737o8283p4894
$$ 99833655 99800336 99750847 99713331 99648690 99604642 99650139 99683642 99722201 99793810 99810547 99742264 99667370
3816.1I9667370l2550n0294J2946Q4662M2034P86l2693n3453m7410o3920m1872M4996
$$ 99667370 99634820 99584526 99597472 99682134 99724168 99724954 99692261 99638808 99591398 99527478 99485606 99530602
3840.6I9530602Q2677Q6552O7121p314j37311k21831j2701J66970J07885M077n1356
$$ 99530602 99613279 99699831 99766952 99759638 99622327 99400496 99387795 99554765 99662650 99666727 99615371
3863I9615371j0764J3697j8645J2517N2542N9032L6335k1481j0151J1051m780J8620
$$ 99615371 99604607 99618304 99599659 99612176 99664718 99723750 99760085 99738604 99728453 99739504 99734724 99753344
3887.5I9753344J174k0635J7584P599n5790q2999m9353J4401Q8262J10489P4196L3891
$$ 99753344 99754518 99733883 99751467 99759066 99703276 99620277 99570924 99585325 99673587 99784076 99858272 99892163
3912I9892163o026m1884k4831K3454K5290Q607K1667J1748k1488m7M1270K5827q387
$$ 99892163 99886137 99844253 99819422 99842876 99868166 99876773 99898440 99910188 99888700 99888653 99929923 99955750 99947363
3938.5I9947363k4521j2374J9401J5187k396J2899K7191J7250m184k6042l5399j9026
$$ 99947363 99922842 99910468 99929869 99945056 99942660 99955559 99982750 100000000 99995816 99969774 99934375 99915349
3962.9I9915349n322k1273l6156k7854j1044L653O867j174N394K7853L3069J3673Q94
$$ 99915349 99910027 99888754 99852598 99824744 99813700 99817353 99824220 99823046 99828440 99856293 99889362 99903035 99903929
3989.5I9903929J1754K4766K2793J3888
$$ 99903929 99915683 99940449 99963242 99977130
3997.6I9977130
$$ 99977130
##END=$$ End of the data block
