##TITLE=$$ Begin of the data block
##JCAMP-DX=5.00 $$ ACD/SpecManager v 10.08
##SPECTROMETER/DATA SYSTEM=MB Serie
##DATE=28 May 2012 11:50:50
##DATA TYPE=INFRARED SPECTRUM
##DATA CLASS=XYDATA
##ORIGIN=
##OWNER=
##NPOINTS=3629
##FIRSTX=500.49096680
##LASTX=3999.10620117
##MAXX=3999.10620117
##MINX=500.49096680
##MAXY=107.51752472
##MINY=47.90696716
##XFACTOR=1.0000000000
##YFACTOR=0.000001000000000
##FIRSTY=98.16670227
##DELTAX=0.96433717
##XUNITS=1/CM
##YUNITS=ARBITRARY UNITS
##XYDATA=(X++(Y..Y))
500.5 98166702 98565315 98639854 98353165 98844505 99335327 98416626 98276688 99018158 99730804 99863159
510.1 99863159 98730209 98336197 98292206 97892166 97919342 97783981 97698563 98110390 98410805 98723572
519.8 98723572 98691986 98005157 97601730 97715050 97766754 98080765 98639496 99255043 99502617 98783318
529.4 98783318 98361755 98633842 98732140 97957260 97306847 97482597 97511246 97323990 97764824 98287560
539.1 98287560 97755554 97667877 98089485 98632874 99367973 98767548 97760689 97423393 97351746 97294373
548.7 97294373 96949188 96875908 97250984 97279068 97341194 97800453 97882431 97684875 97420731 97119659 97472504
559.3 97472504 98106918 98341652 98181023 97605026 97023949 97119461 97732140 97354523 96591270 96665253
569 96665253 96663948 96523697 96853378 97001976 96499237 96704147 97283165 97752625 98545113 98100357 97144432
579.6 97144432 97012352 96946022 96694389 96368248 96339104 96731163 96849533 96842537 97277168 97497749 97309280
590.2 97309280 97014458 96628433 96546829 96849388 97357674 97411407 96801460 96345947 96289963 96557739
599.8 96557739 96379700 95742645 95650002 95652168 95428192 95322456 95121719 94736046 94692566 94686157 94529633
610.4 94529633 94775017 94455185 93377602 92591644 92175125 91907616 91715828 91894630 92496246 93018555
620.1 93018555 93495140 94110992 94541725 94608475 94421227 94402916 94414482 94356956 94641899 94754395 94287201
630.7 94287201 93666145 93136467 92701614 92239731 91506874 90614586 89665321 88838722 88312363 87713501
640.3 87713501 86994453 86535858 86395744 86448433 86784630 87088730 87099472 87361015 87992973 88503876
650 88503876 88940262 89544746 90274178 91014130 91764114 92537376 93076920 93486870 93921921 94253510
659.6 94253510 94449257 94764130 95421844 95989372 96061287 96033058 96382576 96791512 96610092 96727440
669.3 96727440 96974632 96898796 96746117 96881477 97065643 97030426 97048073 97274467 97428482 97500160 97719147
679.9 97719147 97846603 97625214 97414482 97450562 97501900 97437241 97470596 97678932 97831902 97871376 97816933
690.5 97816933 97867172 98047417 98007339 97816689 97779877 97887383 97892525 97796829 97790436 97833107 97841255 97832535
702 97832535 97902672 97949348 97812950 97726189 97871857 97929588 97760780 97676003 97676788 97573219 97543877 97680084
713.6 97680084 97643150 97325142 97039299 96972343 96926262 96774536 96689583 96645439 96468620 96249100 96170181
724.2 96170181 96152351 96007759 95781830 95718582 95760506 95634964 95481064 95440216 95325912 95129295 94976814
734.8 94976814 94854477 94724388 94622826 94616974 94589821 94386818 94140862 94109962 94202812 94143913 94015030
745.4 94015030 93982674 93928772 93836777 93924370 94032936 93946648 93887711 93972145 93976234 93859344 93834183 93856659
757 93856659 93756462 93601097 93606911 93723396 93706520 93621513 93685875 93676872 93474907 93463188 93584335 93507034
768.6 93507034 93415741 93503632 93581985 93628777 93713051 93815666 93906746 93934517 93907280 93963013 94070404
779.2 94070404 94039116 94020493 94138557 94267273 94312897 94324593 94359268 94449211 94528023 94528877 94513283 94445763
790.8 94445763 94402527 94580353 94769699 94791451 94914902 95016220 94919098 94871666 94981430 95119400 95103249
801.4 95103249 94990509 95064308 95294022 95362839 95321625 95330246 95251526 95173958 95257690 95292831 95221512 95214066
812.9 95214066 95247787 95226677 95239304 95370697 95521278 95533485 95519234 95772247 95991707 95942863 95988449
823.5 95988449 96215378 96362061 96367485 96415710 96532578 96635872 96700844 96843941 96876404 96737328 96804329
834.2 96804329 97008720 97051880 96963249 97054207 97212440 97175491 97133636 97208771 97242912 97184425 97161179
844.8 97161179 97225174 97227676 97087524 97043800 97076103 96910110 96698341 96735367 96786499 96603851 96496262
855.4 96496262 96535286 96422043 96195717 96073212 96032272 95818993 95527466 95470070 95406242 95238869 95164124
866 95164124 95121765 95069160 95068222 95162964 95276878 95353584 95539635 95854416 96049118 96089851 96229057 96493752
877.6 96493752 96619026 96628075 96733559 96915192 97028641 97094963 97168205 97064545 96910728 96920151 96886917
888.2 96886917 96745766 96687912 96763596 96749054 96541695 96332771 96166145 95947609 95670311 95349998
897.8 95349998 94926796 94516113 94228195 93896729 93489540 93050781 92650375 92302361 91947220 91710922
907.4 91710922 91592590 91496346 91472618 91580139 91768890 91977486 92194313 92495422 92896721 93194382
917.1 93194382 93456123 93820946 94185036 94444023 94609856 94854927 95081085 95185867 95283340 95346710
926.7 95346710 95316490 95203575 95185493 95240501 95162231 95029327 95020195 95090988 95011055 94892807 94900307 94842606
938.3 94842606 94652374 94507645 94495674 94444038 94385902 94428703 94342384 94155190 94093895 94056458 93971329
948.9 93971329 93853508 93664734 93465652 93321587 93269157 93214149 93013618 92805740 92756111 92754753 92654564
959.5 92654564 92576454 92568657 92426010 92278915 92319420 92301353 92139496 92094238 92191750 92189194 92127991 92183945
971.1 92183945 92198738 92024742 91865067 91911842 91944084 91853081 91832230 91856339 91787689 91654579 91598022
981.7 91598022 91594490 91461617 91341667 91350006 91223717 90987663 90857590 90739433 90526741 90334358 90197906
992.3 90197906 89992645 89698296 89459114 89289917 89012665 88608833 88257851 87998283 87691101 87376938
1002 87376938 87155388 86916435 86666557 86546455 86530029 86528862 86585602 86751221 86967552 87189133 87460670
1012.6 87460670 87827576 88220825 88546585 88871689 89220306 89524467 89844109 90154442 90346718 90501404
1022.2 90501404 90778961 91018494 91023811 91021690 91094803 91091080 91046043 91067802 91090073 90965385 90844818
1032.8 90844818 90819626 90655464 90369659 90196922 90122757 89990791 89843353 89875694 90012863 90103287
1042.5 90103287 90171921 90224541 90300903 90371857 90488640 90644913 90713699 90758568 90889763 91057343 91071655
1053.1 91071655 91071846 91141571 91133087 91130058 91178055 91195633 91085823 90925896 90864159 90929276 91031258 91020958
1064.6 91020958 90974571 90999626 90990150 90928505 90793663 90601273 90475189 90363068 90216240 90167969 90200516
1075.2 90200516 90229836 90203438 90001717 89836388 89675568 89452171 89403374 89416000 89299767 89140709
1084.9 89140709 89157379 89110779 88866173 88831947 88856529 88676437 88599945 88715149 88676552 88392548 88167786
1095.5 88167786 88234131 88430199 88385597 88409592 88746346 88914635 88827728 88725578 88643288 88565567 88603996
1106.1 88603996 88707680 88799545 88947060 89246552 89557449 89593987 89519272 89491539 89587837 89798409 89940956
1116.7 89940956 89994080 90101257 90418045 90600578 90422867 90536674 90791481 90790306 90989189 91292755
1126.4 91292755 91494804 91563942 91531311 91748665 92146301 92202202 92184929 92640190 93063835 93130974 93245331
1137 93245331 93402855 93410088 93558266 93887650 94132370 94390236 94758141 95061401 95301567 95393555 95335091
1147.6 95335091 95491821 95754898 95890388 96004059 96176102 96355568 96432625 96243858 96249016 96443413
1157.2 96443413 96401375 96540520 96740944 96812836 96802231 96647331 96617424 96702873 96549080 96324875 96519783
1167.8 96519783 96860184 96868912 96743271 96680191 96586967 96606949 96732368 96788185 96893326 97078857 97190590
1178.4 97190590 97387527 97488876 97347771 97437614 97624008 97645248 97673401 97848808 98049370 98091492
1188.1 98091492 97914688 97910759 98163887 98207840 98340248 98581345 98677620 98754494 98724487 98673241 98671532
1198.7 98671532 98553101 98346542 98367104 98665108 98783394 98638023 98516464 98423492 98383202 98360977
1208.3 98360977 98239288 98158859 98131516 97983170 97966621 97955727 97656448 97473106 97406029 97222275 96985794
1218.9 96985794 96820740 96686028 96486946 96198845 95953377 95875374 95784584 95759064 95746399 95626396
1228.6 95626396 95544502 95493240 95472603 95391220 95263718 95169655 95136551 95311989 95524704 95585373 95590744
1239.2 95590744 95564545 95639320 95780540 95772575 95781235 95869667 95858971 95877975 95926186 95849312 95777046 95746590
1250.8 95746590 95705864 95625343 95527107 95457191 95366394 95183975 94978035 94908463 94865211 94715584 94564957
1261.4 94564957 94454086 94277122 94044754 93875076 93697830 93415627 93115395 92873337 92701363 92562241
1271 92562241 92364540 92138985 91881477 91599678 91408264 91216576 90963966 90727425 90444038 90097855
1280.7 90097855 89791161 89515953 89199394 88824692 88483078 88193230 87863007 87528412 87278915 87054794
1290.3 87054794 86805710 86654236 86572891 86416542 86236481 86122078 86052406 85996025 85986694 86021812 86034790
1300.9 86034790 86034058 86077751 86108742 86058342 86023750 86047729 86033981 85987328 85996918 86040230 85974258 85790344
1312.5 85790344 85639465 85493004 85318336 85154976 84936440 84622948 84276924 84010063 83730202 83399208
1322.1 83399208 83181633 83055344 82965950 83022583 83174156 83290405 83436348 83697174 84045372 84380821
1331.8 84380821 84691757 85059990 85459679 85819717 86148575 86465805 86684570 86822304 87033058 87293137
1341.4 87293137 87503510 87626648 87733559 87770226 87688766 87594063 87443840 87175789 86854156 86534302
1351.1 86534302 86196091 85813141 85374710 84889832 84400642 83870468 83262932 82691170 82174599 81469185
1360.7 81469185 80696579 79897499 78879677 78106613 77368080 76488937 75633446 74656464 73662186 72755829
1370.3 72755829 71780441 70834030 69746368 68433098 67306641 66368950 65423531 64404701 63479038
1379 63479038 62596340 61719593 60950153 60292835 59712788 59213249 58934677 58672089 58240410 58212971
1388.7 58212971 58444092 58670055 58986252 59536388 60214703 60699749 61229347 62113827 63159203 64081825
1398.3 64081825 64959152 66114777 67335266 68525826 69854126 71115730 72179489 73314362 74438995
1407 74438995 75485184 76480904 77441589 78299400 78980606 79597366 80140266 80469238 80665161 80728455
1416.6 80728455 80862892 80862633 79865669 79478416 79559944 79390488 79084068 78671173 78550964 78565155 78560249
1427.2 78560249 78655228 78724861 78618958 78651756 78766922 78786545 78853302 79144386 79211945 78282936 78139915
1437.8 78139915 78379364 78284286 78145828 77975929 77770012 77610321 77471245 77346771 77366539 77204376
1447.5 77204376 76821289 76795456 76869064 76828850 76684891 76675812 76831177 77076637 76998497 76146523 75979889
1458.1 75979889 76011917 76056656 76222069 76296951 76444504 76625313 76345612 76243340 76589638 76882378
1467.7 76882378 77128548 77530411 78098618 78463799 78514252 78724648 79462799 80154419 80343002 80706909
1477.4 80706909 81277390 81689034 81965744 82156410 82389168 82617981 82790390 83006577 83237434 83188484
1487 83188484 83122505 83305710 83072945 82633537 82775620 82965332 82963959 83156792 83059914 82483742 82700089
1497.6 82700089 82617760 82276466 82373459 82284439 82106789 82149353 82335007 82245453 81324478 80472351 80558296
1508.2 80558296 80670586 80587105 80636276 80338081 79943375 79862289 79615646 79426270 78739586 77993736
1517.9 77993736 78204742 78280655 77569672 76578697 76029854 75961876 75814331 75008675 74590034 74246727
1527.5 74246727 73522949 73109230 72848106 72447952 72145355 71312424 70077606 69783890 69485252 69281319
1537.2 69281319 69223709 68046127 66322517 66241920 65614868 64828804 64803238 64085419 63022312 62704308
1546.8 62704308 62342972 61905373 61091118 60095955 59708744 59506069 59002743 57664734 57099583 57272831
1556.5 57272831 57025265 55792625 54637985 53296436 53161804 53163025 52825203 52397343 51717628 51254379
1566.1 51254379 51037338 50948147 50585606 49523029 49224609 49223602 49011551 48909325 49097916 48807861
1575.7 48807861 47906967 48138657 48432526 48538174 48694202 48934944 49191833 49496712 49934361 50431774
1585.4 50431774 50950363 51536919 52215057 52917980 53642311 54432449 55275623 56129112 56964661 57851833
1595 57851833 58775616 59692146 60616135 61570908 62496681 63347275 64203690 65089508 65979279 66846230
1604.7 66846230 67676125 68454269 69184425 69819565 70359207 70965645 71595787 72167305 72677933 73255745
1614.3 73255745 73978310 74144714 73860321 74526672 75094658 75398384 75840248 76357506 76381393 76174110
1624 76174110 76636658 77207993 77507469 77405937 77440117 77741058 77918678 78034836 78219551 78706245
1633.6 78706245 78946747 78026268 78118248 78481247 78584679 78811333 78980438 79139168 79134705 79118317
1643.3 79118317 79525574 79777817 79307625 79168015 79265457 79416870 79847595 80637527 81444145 80038635
1652.9 80038635 78311188 79050217 79736420 79987564 80006149 80155685 80345459 80579704 80909622 80871552
1662.5 80871552 80956352 81522339 82053673 82698715 83662231 84389191 84723297 85563187 86400536 87208832
1672.2 87208832 88281792 89343086 89896103 90098076 90780319 91645988 92396164 92767906 93152306
1680.9 93152306 93955536 94652077 94850769 94817650 95212013 95555771 95704453 95999481 96355560 96549271
1690.5 96549271 96742271 97019966 97431473 97898575 97762199 97012054 97511131 98068886 98235985 97176590
1700.1 97176590 97418243 98627998 99217308 99416435 99498184 99704140 99843536 100069839 100395546 100376221
1709.8 100376221 100230515 100400681 100700188 100888008 100846222 101030609 101242249 101096268 101411530 101788086
1719.4 101788086 101732010 101657967 101833771 101972076 102087631 102203262 102282555 102407715 102510483 102503906
1729.1 102503906 102304001 102417015 102569733 102432709 101979576 102017609 102701996 103023354 103140717 103245705
1738.7 103245705 103105232 103068634 103297890 103445786 103265366 103108467 103169250 103209480 103265427 103322510
1748.4 103322510 103404343 103360924 103218178 103543488 103789429 103702423 103621109 103603470 103427254 103518028 103728233
1759 103728233 103795578 103856903 103799591 103715790 103656860 103675682 103686188 103653587 103570000 103512978 103883820 104215462
1770.5 104215462 104231010 104028450 103968147 104153152 104208359 104210899 104166222 104069695 104117027 104036293 103969734
1781.2 103969734 104140114 104237984 104134537 104082779 104297325 104421303 104306175 104204254 104250488 104292511
1790.8 104292511 104330627 104266617 104193336 104296913 104406136 104358315 104269165 104279549 104187958 104100052 104173355
1801.4 104173355 104188934 104294510 104458649 104505547 104514923 104458237 104462738 104546867 104508820 104362045 104334030
1812 104334030 104439789 104403984 104342476 104436234 104465660 104391258 104417152 104532051 104600037 104565865 104497147
1822.6 104497147 104547981 104535606 104398911 104465485 104554039 104574280 104541016 104413086 104424103 104506134 104508766
1833.2 104508766 104461929 104465790 104480263 104490837 104576317 104629677 104627991 104627594 104683762 104786583 104653976 104384476
1844.8 104384476 104484070 104636070 104593224 104527100 104585739 104597633 104577431 104588470 104591972 104619225 104611153 104552414
1856.4 104552414 104521317 104514900 104527527 104577705 104602798 104580765 104583702 104631821 104663918 104641312 104614487 104580734
1867.9 104580734 104489532 104448952 104493309 104529274 104553040 104565689 104556870 104533386 104560623 104582756 104522766 104495056
1879.5 104495056 104490196 104453354 104453957 104474052 104467239 104466766 104453606 104467697 104515320 104453423 104373123 104395020 104397087
1892.1 104397087 104385696 104396088 104377182 104346825 104359169 104410370 104418404 104402916 104402580 104342148 104295074 104280113
1903.6 104280113 104260742 104266045 104278893 104279556 104267487 104253448 104252213 104236351 104163589 104142990 104167633 104139786
1915.2 104139786 104185188 104193077 104055359 104071823 104136284 104149651 104126877 104054703 104082565 104120621 104078842
1925.8 104078842 104063446 104125305 104170677 104184097 104221863 104231743 104193039 104196861 104226532 104167084 104091377 104083931
1937.4 104083931 104128738 104133026 104122528 104203644 104168144 104099220 104214973 104264526 104180450 104133781 104112114
1948 104112114 104051331 104087410 104169022 104136314 104112801 104116669 104089653 104079422 104068886 104081108 104060226 103988663
1959.6 103988663 103987114 104074364 104153824 104131180 104094185 104091537 104099503 104142990 104130363 104056358 104023041 104003555
1971.1 104003555 104005623 104052010 104057922 104035492 104037415 104078575 104132179 104133095 104095573 104073181 104030464 103953766
1982.7 103953766 103950684 104023399 104056648 104061142 104064133 104019760 103978500 103967194 103926109 103858093 103823074 103830360
1994.3 103830360 103856026 103887794 103910172 103921623 103923553 103917839 103896614 103858292 103825356 103813446 103812866 103798180
2005.8 103798180 103800652 103803780 103772438 103746841 103747971 103739334 103720345 103733696 103740479 103706955 103649757 103639381
2017.4 103639381 103680519 103672783 103659447 103659233 103623116 103605484 103621460 103606102 103538857 103519463 103539520 103506447
2029 103506447 103488632 103493759 103460579 103448952 103464561 103438545 103407295 103411804 103428383 103447113 103430511 103363792
2040.6 103363792 103281845 103268051 103312737 103270439 103179436 103161011 103216682 103235748 103211845 103229614 103262451
2051.2 103262451 103233894 103146606 103099060 103059120 103030067 103037926 103056419 103093742 103057579 102999329 103014305 103009293
2062.7 103009293 102932365 102853233 102852524 102868118 102840530 102771309 102733154 102796432 102842094 102819527 102770370 102696785
2074.3 102696785 102616570 102566872 102566521 102540741 102463951 102426987 102451469 102449753 102450340 102490364 102470093 102385681
2085.9 102385681 102335724 102353867 102316826 102215523 102187126 102225891 102242073 102225044 102260674 102286987 102209381
2096.5 102209381 102088158 101977386 101939316 101912712 101882393 101874825 101846207 101884972 101915367 101872574 101823799
2107.1 101823799 101796349 101745750 101655602 101629189 101574837 101491081 101512360 101561127 101528664 101508255 101547462
2117.7 101547462 101524628 101440323 101340942 101286926 101284851 101243896 101178528 101171646 101199715 101165710 101164314 101207176
2129.3 101207176 101153984 101054390 100952888 100888893 100871666 100851311 100844872 100816093 100773964 100775612 100796516 100752922
2140.9 100752922 100655952 100617554 100589203 100543671 100530319 100510773 100477425 100462418 100439758 100385155 100353447
2151.5 100353447 100297409 100218765 100205963 100215591 100210220 100199699 100151215 100065552 100026970 100013756 99987267 99979736
2163 99979736 99965614 99950699 99931549 99892128 99873055 99859055 99826683 99795967 99767838 99749657 99706665 99633293
2174.6 99633293 99632767 99709991 99739532 99714317 99728500 99770340 99734406 99615067 99538994 99503662 99476387 99510345
2186.2 99510345 99506279 99456581 99521896 99604401 99584137 99569450 99541428 99488159 99495575 99415695 99241135 99200424
2197.8 99200424 99271683 99369431 99438484 99440742 99436401 99443275 99480736 99474464 99409828 99357445 99291016 99363625
2209.3 99363625 99553535 99592644 99664001 99836830 99861298 99774384 99625351 99612198 99669357 99538574 99525162
2219.9 99525162 99649979 99674492 99793732 99973419 100020363 100054420 99988365 99882927 99960068 99980019 99788193
2230.5 99788193 99672302 99769722 99838737 99885788 100015289 100084274 100112206 100189331 100205925 100139389 100060936
2241.2 100060936 100003319 100188263 100411430 100284119 100337662 100645020 100656898 100529030 100389359 100336166
2250.8 100336166 100340134 100247566 100351616 100508453 100506775 100606888 100748795 100816292 100862328 100745651 100593391
2261.4 100593391 100638435 100608505 100395119 100292603 100415588 100425331 100368713 100552391 100641731 100585968 100678940
2272 100678940 100755989 100648682 100471512 100384064 100668892 100939140 100630844 100537033 100920189 100953285 100727753
2282.6 100727753 100552849 100489037 100503548 100375328 100470352 100723907 100720627 100663651 100710335 100853561 100929520
2293.2 100929520 100786705 100659706 100707443 100617058 100328926 100241898 100449684 100390427 100130524 100290581
2302.9 100290581 100447388 100350784 100496445 100668793 100570709 100356766 100239082 100577286 100961601 100622414
2312.5 100622414 100312912 100638794 100802856 100645004 100445831 100256363 100202003 100145744 100237633 100546021
2322.2 100546021 100705040 100682800 100563957 100698624 100812218 100504173 100393669 100484848 100245049 99910851
2331.8 99910851 99864021 100185341 100111771 99703072 99854607 99993370 99863197 100029457 100293182 100192253
2341.4 100192253 99937569 99754974 100107391 100557228 100197723 99660446 99760284 100146584 100138290 99948227
2351.1 99948227 99841698 99824036 99788666 99779930 100193253 100606171 100494118 100009827 100001167 100169868 99850433
2361.7 99850433 99748825 99799889 99538437 99313049 99276024 99509827 99505440 99196747 99165512 99195213 99210373
2372.3 99210373 99379997 99523819 99411850 99235939 99133781 99253304 99470520 99397606 99131813 98978874
2381.9 98978874 99039825 99032616 98950584 98902245 98888107 98909630 98907600 99035667 99169327 99106483 98935173
2392.6 98935173 98839165 98865089 98830109 98793358 98799881 98709236 98591385 98563934 98619202 98606766 98540955 98490692
2404.1 98490692 98433563 98439545 98492790 98506378 98456535 98386940 98291115 98298981 98422958 98425690 98273994 98126503
2415.7 98126503 98154007 98195770 98095055 98022835 98058403 98084801 98019028 98029831 98111794 98095047 97999542
2426.3 97999542 97874687 97818367 97804657 97773376 97753021 97711670 97725235 97747215 97693748 97670624 97606819
2436.9 97606819 97472717 97417976 97444901 97448502 97407623 97358368 97283234 97223351 97215065 97230499 97251854 97217720
2448.5 97217720 97130081 97061150 97008568 96948013 96914223 96904564 96881027 96828308 96767159 96729424 96692474 96647079
2460.1 96647079 96605042 96549377 96537117 96506973 96408371 96377281 96384224 96353333 96304626 96274101 96228050 96206268
2471.6 96206268 96248978 96207069 96053497 95946381 95909393 95865799 95876076 95879791 95796776 95759094 95790741
2482.2 95790741 95824196 95797264 95693626 95596550 95563431 95552940 95474991 95408218 95362953 95290344 95262596
2492.8 95262596 95228714 95188019 95190750 95228279 95214676 95147377 95173988 95186432 95079765 95038605 95097115 95048927
2504.4 95048927 94941902 94981659 95041679 94924385 94777084 94785202 94812492 94785088 94785187 94765320 94764389 94786140
2516 94786140 94767914 94738220 94648109 94559906 94575699 94600304 94542442 94480362 94435181 94364792 94342575 94332321
2527.6 94332321 94308914 94330811 94382050 94388000 94316238 94320503 94380058 94315643 94214645 94212883 94238480 94206604
2539.1 94206604 94189865 94227394 94162796 94045708 94075775 94134850 94168907 94217300 94187805 94137283 94138550 94180405
2550.7 94180405 94214539 94151329 94064308 94047249 94067604 94091400 94081810 94022606 93958488 93946716 93938034 93915504
2562.3 93915504 93939674 93937286 93918083 93935562 93956139 93978050 93911400 93787186 93758171 93800606 93812721 93764023
2573.9 93764023 93755547 93798492 93782997 93728195 93683472 93681343 93707886 93719833 93722298 93709908 93700371 93679001
2585.4 93679001 93625114 93606270 93624222 93600822 93543968 93520340 93488899 93419327 93394943 93413330 93444962 93450104
2597 93450104 93373070 93290230 93272346 93276886 93251503 93207756 93170906 93174850 93173233 93132622 93110832 93102547 93092934
2609.5 93092934 93063446 93034737 93019104 92971107 92910980 92856590 92751259 92681511 92694214 92686531 92684608 92716637
2621.1 92716637 92718163 92702400 92710930 92697807 92627525 92554352 92542336 92526398 92511810 92518951 92447060 92370491
2632.7 92370491 92368782 92351913 92310532 92284981 92280670 92289345 92261940 92233582 92250748 92229553 92151413 92121681
2644.3 92121681 92117149 92092049 92035049 91943695 91926918 91899948 91828003 91798096 91766029 91736671 91713821 91672791
2655.8 91672791 91633682 91638344 91646484 91550026 91455063 91447517 91389481 91380013 91450340 91410599 91271988 91173149
2667.4 91173149 91160439 91161072 91129791 91098511 91086426 91020554 90930733 90938972 90961372 90878700 90842430 90863541
2679 90863541 90818977 90756516 90669411 90565140 90450325 90368225 90325172 90264030 90293839 90372108 90296104 90181915
2690.5 90181915 90173668 90167885 90110634 90028831 89961990 89888092 89810867 89828140 89843758 89730934 89647476 89609573
2702.1 89609573 89537056 89470955 89422752 89417419 89347893 89236580 89237556 89314407 89322586 89240479 89178467 89121925
2713.7 89121925 89054604 89006714 88973015 88917686 88842140 88770714 88705231 88668457 88623482 88589935 88589844 88562744
2725.3 88562744 88518150 88469543 88427994 88401665 88322563 88214455 88155411 88110374 88041084 87995872 87990555 87934746
2736.8 87934746 87848785 87824203 87822296 87809044 87756714 87659866 87590645 87569016 87494370 87369438 87339325 87364548
2748.4 87364548 87349258 87330605 87336601 87301476 87263794 87278061 87201111 87014961 86894440 86814690 86701897
2759 86701897 86657455 86701767 86680054 86569817 86550026 86519478 86355202 86195473 86106827 86011444 85821495
2769.6 85821495 85597923 85441216 85320793 85138092 85010506 84912926 84673080 84411018 84207764 84003433
2779.3 84003433 83708618 83395699 83157188 82925400 82692535 82449272 82248322 82037704 81671021 81117050
2788.9 81117050 80436211 79968102 79666435 79201698 78727226 78404411 78049385 77645348 77316208 76864662
2798.5 76864662 76205658 75541847 75078865 74716629 74219063 73715027 73305298 72925529 72517738 72145027
2808.2 72145027 71876419 71542564 71108742 70681847 70363441 70057671 69721481 69481941 69293442 69189720
2817.8 69189720 69042366 68911598 68955956 68912514 68579491 68031586 67766891 67754486 67576462 67502937
2827.5 67502937 67616615 67591797 67580391 67763100 67800346 67567772 67352844 67308037 67299141 67240875 67258293
2838.1 67258293 67316978 67305824 67190575 67134933 67276848 67340302 67292206 67246422 67204773 67187561 67196114
2848.7 67196114 67223228 67288895 67536720 67740837 67972221 68462959 68848625 68963936 68875572 68945168
2858.3 68945168 69325577 69659874 70084740 70695381 71092163 71579071 72362312 72777756 72808746 72930405
2868 72930405 73131516 73262962 73444534 73715401 73844887 73955544 74046829 73995483 74163437 74347946
2877.6 74347946 74330650 74310448 74178001 74047447 73985672 73844391 73767258 73810219 73692383 73636276 73887398
2888.2 73887398 73992775 73765579 73275703 72825691 72669067 72552574 72538620 72633461 72520782 72561035
2897.9 72561035 72853386 72775742 72394753 72154030 72007187 71706528 71502075 71541718 71364464 71072823
2907.5 71072823 70840218 70596535 70525864 70415398 70142578 69940208 69712418 69388939 69144173 68884079
2917.2 68884079 68648216 68573013 68410637 68297157 68418221 68467003 68314575 68056282 67797379 67617958
2926.8 67617958 67640015 67870354 68038780 68020218 68212456 68659904 68813309 68763077 68859650 69059456
2936.5 69059456 69097481 69076149 69307175 69489655 69632866 69824509 69977020 70276657 70509338 70582642
2946.1 70582642 70808548 71050110 71131409 71318878 71514046 71655869 71877365 72044342 72270058 72655876
2955.7 72655876 72990646 73163292 73278770 73374840 73482910 73750793 74129768 74430420 74609467 74888107
2965.4 74888107 75452133 75932709 76114029 76321999 76691887 76985275 77204178 77641800 77999954 78195419
2975 78195419 78498421 78799202 79134010 79417862 79624702 79953217 80242470 80409470 80601768 80772522
2984.7 80772522 80928673 81145691 81355888 81508080 81703812 81969788 82143356 82226822 82319748 82408150
2994.3 82408150 82542252 82750069 82911606 83004829 83160660 83380051 83520760 83572296 83618965 83735291
3004 83735291 83856781 83929626 84068420 84210243 84278618 84270256 84248650 84373070 84537354 84627846 84695419
3014.6 84695419 84752190 84783211 84774719 84830124 84948631 85016335 85026573 85030151 85087364 85167175 85203117 85238464
3026.1 85238464 85275826 85270287 85320381 85393761 85383667 85337204 85328598 85380516 85434227 85451134 85459641 85501068
3037.7 85501068 85530540 85500267 85485748 85539330 85551605 85513969 85508751 85526245 85597931 85682816 85636566 85530151
3049.3 85530151 85540749 85560463 85508827 85536514 85634628 85602280 85527756 85596939 85631462 85530563 85476074
3059.9 85476074 85515656 85508026 85488373 85526146 85548515 85530174 85499596 85467903 85441391 85453583 85467819 85457420
3071.5 85457420 85411484 85414635 85540253 85600388 85588745 85610710 85559738 85472824 85508377 85649277 85669815
3082.1 85669815 85554413 85546455 85613876 85659103 85694252 85720963 85729233 85718414 85731750 85759750 85735626 85729042
3093.6 85729042 85787971 85787598 85795479 85857285 85914200 85950783 85929878 85872475 85797119 85805481 85910255 85955887
3105.2 85955887 85877579 85797180 85813118 85820724 85807983 85797363 85735977 85714523 85811996 85922646 85847916 85695862
3116.8 85695862 85622627 85455284 85322327 85385529 85474236 85453133 85382545 85356468 85296188 85210304 85187225
3127.4 85187225 85175499 85028572 84876076 84877388 84885872 84841911 84776466 84679306 84506828 84398254 84421272
3138 84421272 84399757 84316147 84177902 84010323 83891716 83883484 83911484 83821480 83722343 83673386 83620613 83572342
3149.6 83572342 83497665 83417984 83341583 83239716 83157249 83232788 83313805 83213737 83150696 83184570 83191231
3160.2 83191231 83151207 83123558 83115395 83079987 83040665 82990883 82941582 82929260 82934769 82897049 82844093 82856789
3171.8 82856789 82842201 82831924 82861115 82848534 82823387 82764999 82736565 82758118 82746231 82721779 82649078 82591667
3183.3 82591667 82660339 82646538 82490540 82448547 82472504 82430862 82427162 82436943 82425903 82428101 82401405 82372208
3194.9 82372208 82320831 82327759 82372437 82275436 82173485 82151054 82166924 82195923 82172852 82097244 82011887 81936996
3206.5 81936996 81908226 81969856 81957062 81844810 81807678 81814964 81815865 81772507 81682961 81573456 81512146 81492432
3218 81492432 81425316 81411339 81400818 81264870 81193092 81260399 81220169 81061035 81002007 81029892 81037628 80987404
3229.6 80987404 80937309 80939064 80842384 80648361 80599197 80660522 80624565 80592300 80608482 80485924 80323097
3240.2 80323097 80290611 80323265 80361801 80351349 80281502 80300148 80380791 80333588 80220436 80152367 80133690
3250.8 80133690 80154030 80161804 80201035 80308548 80288536 80193825 80251709 80349342 80419373 80457664 80491989 80535240
3262.4 80535240 80516937 80572517 80694206 80792892 80848625 80844086 80912201 81023125 81151642 81334641 81389015
3273 81389015 81403038 81599075 81764786 81813942 81901108 82022598 82172203 82298203 82394844 82544762 82657738
3283.6 82657738 82748825 82950920 83151314 83247635 83391304 83642677 83825890 83968681 84165504 84355553
3293.3 84355553 84479713 84605362 84830292 85008247 85099854 85234558 85448624 85675514 85831902 85998299
3302.9 85998299 86194664 86322815 86431648 86605148 86805519 86934822 87050362 87257050 87429337 87524338
3312.6 87524338 87658882 87842255 88020126 88171120 88304878 88410393 88520210 88673447 88801308 88944412
3322.2 88944412 89165649 89332321 89417381 89512344 89620644 89735008 89824707 89859886 89910233 89988640 90112213
3332.8 90112213 90272491 90436119 90635788 90783165 90874702 90963959 90968605 90980339 91109467 91186432 91244141
3343.4 91244141 91376251 91518692 91639359 91632622 91610992 91716469 91870193 91996292 92107796 92205658
3353.1 92205658 92265617 92372360 92570900 92675529 92661041 92725136 92886971 93058548 93115494 93127884 93077888
3363.7 93077888 93002525 93078926 93309776 93484863 93528336 93806145 94105942 94166649 94188210 94068436 93976173
3374.3 93976173 94162651 94233040 94127167 94175423 94358109 94494972 94454758 94483429 94649345 94746864 94855225
3384.9 94855225 95029404 95074432 94970177 94989487 95281525 95518219 95418037 95407021 95608635 95726524
3394.5 95726524 95688126 95625641 95536102 95298714 95158150 95414162 95781723 95936150 96105797 96280083
3404.2 96280083 96415237 96441383 96110664 95850922 95991791 95909203 95674843 95879494 96235695 96304329
3413.8 96304329 96046806 95947571 96068062 96099937 96244164 96522766 96598846 96455254 96379204 96592766
3423.5 96592766 96788849 96551910 96471848 96698128 96787971 96771461 96809937 96816170 96506813 96273369 96516922
3434.1 96516922 96874870 97098175 97247810 97436562 97647125 97630638 97295082 97021454 97129501 96975159
3443.7 96975159 96577362 96732872 97098289 97192337 97092125 97094627 97192032 97191643 97344833 97667915 97727844
3454.3 97727844 97451538 97349693 97620674 97933556 97800117 97588112 97784904 97879410 97808548 97886658
3464 97886658 98017532 97803772 97458527 97550667 97930038 98394699 98564644 98593681 98936028 99031219 98608093
3474.6 98608093 98290810 98350761 98179016 97850426 98011185 98377075 98589455 98608795 98571045 98556992
3484.2 98556992 98502136 98661949 98969383 98982910 98702759 98698845 98978600 99217033 99200912 99019463 99140625
3494.8 99140625 99280609 99187721 99195213 99396111 99302887 98967819 99019661 99385056 99872894 99990295 99927475
3505.4 99927475 100228912 100336349 100001480 99738869 99869690 99801254 99432060 99520676 99914444 100196983
3515.1 100196983 100319839 100286308 100255531 100232399 100385750 100767479 100853340 100568253 100579750 100727821
3524.7 100727821 100792328 100899231 100839867 100837067 100904823 100927254 101045982 101290016 101301018 101097466 101120117
3535.3 101120117 101301537 101649178 101869728 101803619 101878090 102023033 101897552 101845726 102086159 101961899
3545 101961899 101582848 101512161 101620697 101889565 102316658 102512291 102330444 102167755 102311195 102629532
3554.6 102629532 102713860 102599487 102631088 102647728 102578125 102596199 102711105 102820702 102848305 102922607 103030121
3565.2 103030121 103163223 103223495 102864754 102774452 103052238 103269051 103457069 103510170 103491577 103552887
3574.9 103552887 103616493 103637321 103676208 103631424 103481384 103504410 103659866 103767296 103899254 104078690
3584.5 104078690 104178101 104054710 103982422 103900543 103862244 104086044 104293236 104409386 104391464 104468811 104508888
3595.1 104508888 104410721 104533226 104657852 104610023 104585937 104587769 104611649 104704178 104717117 104760094 104906357
3605.7 104906357 104867172 104956062 105034088 104767242 104970184 105256241 105202301 105245613 105186333 105120049 105393982
3616.3 105393982 105400009 105209122 105125679 105083214 105217369 105283012 105345390 105564575 105741043 105823158 106006416
3626.9 106006416 106006973 105453743 105148537 105472542 105707039 105678711 105605385 105670334 105744431 105818558 105840378
3637.5 105840378 105826111 105873161 105843979 105803268 105808891 105921722 106067940 106139191 106194748 106218521 106270752
3648.1 106270752 106235130 106126854 105876610 105815063 106031105 106253426 106407227 105994461 105702782 106149033
3657.8 106149033 106305634 106386047 106489685 106451508 106424507 106382362 106370026 106369469 106450661 106629425 106542374
3668.4 106542374 106288353 106034523 106003769 106385445 106676720 106786148 106354546 105733574 106136673 106644218
3678 106644218 106612144 106462799 106631500 106678017 106678978 106731636 106740150 106696754 106831902 106812508 106435646 106635696
3689.6 106635696 106550056 106339012 106600098 106809410 106940353 106948372 106891884 106860092 106848503 106921043 107042580
3700.2 107042580 106893349 106484421 106458321 106696907 106907539 106906952 106883934 107007591 106886925 106777512
3709.9 106777512 107056343 106942474 106526665 106729050 106964340 106959236 106929283 106976608 107037476 106941864 106842072
3720.5 106842072 106858963 106811623 106811630 106873528 106855820 106718010 106762817 107013077 107084557 107234238 107334351
3731.1 107334351 106977013 107075912 107449051 107364883 106892311 106649811 106701523 106804695 106986092 107030594
3740.7 107030594 107013535 107347542 107405502 106139366 106219856 106837715 107145470 107201157 106738258 107057907
3750.4 107057907 107252464 106476677 106449875 106812073 107002716 107020927 106921173 106997902 106908920 106626831
3760 106626831 106759918 107038826 107147812 107264587 107282646 107012985 106996025 107261917 107319176 106970116
3769.7 106970116 106771965 106921097 106976723 107018463 107050476 107023857 107083305 107260712 107398720 107237473
3779.3 107237473 107024452 107099876 107213600 107153206 106915886 106870720 107091316 107109642 106968674 107076073
3788.9 107076073 107276878 107204605 107029449 106975700 106962280 107094925 107192436 107019753 106970177 106993965 107120659
3799.6 107120659 107178139 106837967 106797905 106892990 107006042 107256226 107140175 106671501 106860176 107009026
3809.2 107009026 106959389 107064522 107202507 107303505 107414780 107349800 106764534 106502151 106805786 107129028
3818.8 107129028 107397545 107143265 106687050 106811287 106991730 107182777 107273064 107135490 106985451 107018982
3828.5 107018982 107225197 107355606 107022102 106724487 107056908 107182228 106951149 107178894 107217880 106824425
3838.1 106824425 107024551 107044640 106859703 107072052 107128853 106829773 106852951 107059937 107096733 107167191
3847.8 107167191 107182503 107158272 107299088 107295113 107323586 107080460 106177460 106671577 107043579 106954903 107003708
3858.4 107003708 107226898 107364998 107183258 107007759 107259773 107325531 106912956 106845062 107099060 107286209
3868 107286209 107138351 106730667 106830811 107087990 107297134 107181229 106857674 106989105 107199120 107242081
3877.7 107242081 107212730 106993523 106670334 106921402 107197159 107290451 107386276 107002380 106630264 106983017
3887.3 106983017 107173965 107318764 107339737 106874046 106749298 107060814 107107780 107054634 107094025 107214523
3897 107214523 107400330 107367615 107386200 107509567 107242348 107063690 107044289 106921921 106816742 106819107 107041679
3907.6 107041679 107130707 107107101 107231346 107327484 107240707 107098686 107049332 107120674 107080238 107000061 107140594
3918.2 107140594 107140442 107006516 107036804 107205940 107303085 107119255 106873344 106914772 106948685 106955978 107207214
3928.8 107207214 107286476 107155106 107066757 107053673 107224533 107392738 107280426 106936867 106855026 107018524
3938.4 107018524 106975525 106955208 107124718 106964592 106849831 107236610 107418884 107315659 107128731 106963730
3948.1 106963730 107009094 106920319 106920326 107089127 106961227 106882111 106915504 106954521 106996956 106860214 106867989 106985489
3959.6 106985489 106889709 106859909 107084602 107156792 107041092 106999954 107079826 107276985 107434555 107279823
3969.3 107279823 106941460 106942688 106999802 106839668 107039429 107264374 107098846 107083420 107382118 107517525
3978.9 107517525 107407043 107375397 107234299 107070122 106905739 106872299 107110390 107068321 106937889 106925362
3988.6 106925362 106954689 107015701 107008865 107089088 107082230 106913300 106956268 107245483 107374191 107191879 106964439
3999.2 106964439
##END=$$ End of the data block
