##TITLE=PC $$ Begin of the data block
##JCAMP-DX=5.00 $$ ACD/SpecManager v 10.08
##SPECTROMETER/DATA SYSTEM=Alpha
##DATE=15 Dec 2014 08:06:22
##DATA TYPE=INFRARED SPECTRUM
##DATA CLASS=XYDATA
##ORIGIN=
##OWNER=
##NPOINTS=1765
##FIRSTX=399.76428223
##LASTX=3997.64306641
##MAXX=3997.64306641
##MINX=399.76428223
##MAXY=0.83827412
##MINY=0.43264151
##XFACTOR=1.0000000000
##YFACTOR=1.000000000000000e-9
##FIRSTY=0.71244252
##DELTAX=2.03961372
##XUNITS=1/CM
##YUNITS=ARBITRARY UNITS
##XYDATA=(X++(Y..Y))
399.8G12442517r24468r62734n86271q67963j392722r62436k95461q62360k337992
$$ 712442517 711518049 710555315 709969044 709101081 707708359 706745923 706450462 705588102 703250110
418.1G03250110k515912j718759j725495j144290L8743L87549m2498q3089J05739n44071
$$ 703250110 700734198 699015439 697289944 696145654 696184397 696571946 696529448 696446359 696552098 696008027
438.5F96008027j159847p10726k29359l21328Q8572Q23140N29468l36289j51098M81904
$$ 696008027 694848180 694137454 693908095 693586767 693675339 694498479 695027947 694691658 694540560 695022464
458.9F95022464j03831p13826m03762o02543j508176j477063o11603o14882r48727
$$ 695022464 694918633 694204807 693801045 693198502 691690326 690213263 689601660 688986778 688038051
477.3F88038051k3901R54926M55796L2723P01785O04272l71515k67685K66910n79655
$$ 688038051 688014150 688969076 689424872 689457595 690159380 690763652 690392137 690124452 690391362 689811707
497.7F89811707j556278r76443l83616j243114j715600r54032r60231j964331j892388
$$ 689811707 688255429 687278986 686895370 685652256 683936656 682982624 682022393 680058062 678165674
516F78165674r78589j160920j492500m59134L78728l68059p84934L7432J3649j044333
$$ 678165674 677187085 676026165 674533665 674074531 674453259 674085200 673300266 673337698 673351347 672307014
536.4F72307014r05334k06292j054585k097309j435458n83768o78957j04546J268208
$$ 672307014 671401680 671195388 670140803 668043494 666608036 666024268 665345311 665240765 666508973
554.8F66508973J414358N79477R09924J667977Q20040k81274J34230L13758q10384
$$ 666508973 667923331 668502808 669412732 671080709 671900749 671619475 671753705 672067463 671257079
573.1F71257079j050353P9870L19123k10881N43594J692474J201391K90633P28666
$$ 671257079 670206726 670286596 670605719 670394838 670938432 672630906 673832297 674122930 674851596
591.5F74851596R98080q9884n60581K80201L52681n67675l39389O94454M38929k51890
$$ 674851596 675849676 675759792 675199211 675479412 675832093 675264418 674925029 675619483 676058412 675806522
611.9F75806522M28260J255274J113355J589238K954185L042817J764417J425028J891136
$$ 675806522 676234782 677490056 678603411 680192649 683146834 686189651 687954068 689379096 691270232
630.2F91270232J223207J85787O06299J219511M45008P8142J342058K010882J217484
$$ 691270232 692493439 692679226 693285525 694505036 694950044 695028186 696370244 698381126 699598610
648.6F99598610J169742J913845J274705Q8096O52790J657784J027047M1187L20852
$$ 699598610 700768352 702682197 703956902 704044998 704697788 706355572 707382619 707423806 707744658
667G07744658J255274P57873M03941R02116O19888k21014L56734J394153R15944K07544
$$ 707744658 708999932 709757805 710161746 711063862 711683750 711462736 711819470 713213623 714129567 714337111
687.3G14337111Q34941J146675J26123k58505N58078N67198k70903O8068J032889P00057
$$ 714337111 715172052 716318727 716444850 716186345 716744423 717311621 717040718 717108786 718141675 718841732
707.7G18841732P5995P30813J181543J76370m08292O08981J339197R26912J099884
$$ 718841732 718917727 719648540 720830083 721006453 720598161 721207142 722546339 723473251 724573135
726.1G24573135J525700o6459l062248m960477n526483n301834l161966P87615L741205
$$ 724573135 726098835 726032376 722970128 718009651 712483168 707181334 704019368 704806983 708548188
744.5G08548188M451394M731834N146623M148722K302110J962900K629578K217829
$$ 708548188 712999582 717731416 722878039 727026761 729328871 731291771 733921349 736139178
760.8G36139178J536250K021611K297700J319825Q17538J505553J606286Q36134Q97050
$$ 736139178 737675428 739697039 741994739 743314564 744132102 745637655 747243941 748080075 748977125
779.1G48977125J648307J399278O99282J154423J708626R27925K95640R34481J144886
$$ 748977125 750625432 752024710 752723992 753878415 755587041 756514966 756810606 757745087 758889973
797.5G58889973K05636p5936N63025K83301p08103n18441M45366N15938L73423J164794
$$ 758889973 759095609 759019673 759582698 759865999 759157896 758639455 759084821 759600759 759974182 761138976
817.9G61138976J601934P25448R4533M40717M86255K59637P70629J146436J86324q57711
$$ 761138976 762740910 763466358 763560891 764001608 764487863 764747500 765518129 766664565 766850889 765993178
838.3G65993178m45128K65956j23024m64558J74224M20749l27229n77390j23859n96940
$$ 765993178 765548050 765814006 765690982 765226424 765400648 765821397 765494168 764916778 764792919 764195979
858.7G64195979j800716j968742j403808j421392j298547l18348J45614m56631m61460
$$ 764195979 762395263 760426521 759022713 757601321 756302774 755984426 756130040 755673409 755211949
877G55211949N70417Q29696M1426r5725K99871k48850j126766q40902j63675l68416
$$ 755211949 755782366 756612062 756653488 756557763 756857634 756608784 755482018 754641116 754477441 754109025
897.4G54109025n34594J00851K60770n75304j077175r84311j547217k477348k229035
$$ 754109025 753574431 753675282 753936052 753360748 752283573 751299262 749752045 747274697 745045662
915.8G45045662j271427j246750j771152j709879j708924k176881j630128K53439J403094
$$ 745045662 743774235 742527485 740756333 739046454 737337530 735160649 733530521 733783960 735187054
934.1G35187054J072704Q00670R13143L14772o20723q41439j064777k145946l026724
$$ 735187054 736259758 737060428 737973571 738288343 737667620 736826181 735761404 733615458 730588734
952.5G30588734l002345l274143m302025m844964m627645m619360m619836l644824
$$ 730588734 727586389 724312246 720010221 715165257 710537612 705918252 701298416 697653592
968.8F97653592k345622k130628k700209l201843m038691n343378o015062n766869
$$ 697653592 695307970 693177342 690477133 687275290 683236599 677893221 671878159 666111290
985.1F66111290n590081n627513n144179m443943m415035m662335m354537m003584
$$ 666111290 660521209 654893696 649749517 645305574 640890539 636228204 631873667 627870083
1001.4F27870083m380405n063117n435884n646407n716801n103528m059673l673851
$$ 627870083 623489678 618426561 612990677 607344270 601627469 596523941 592464268 588790417
1017.8E88790417l903389l720641l058911k554953k078414j213491l87549q7738J07288
$$ 588790417 584887028 581166387 578107476 575552523 573474109 572260618 571873069 571785331 571892619
1036.1E71892619N57125Q34524P60436R16541J455188J814008J962900K346694K751827
$$ 571892619 572449744 573284268 574044704 574961245 576416433 578230441 580193341 582540035 585291862
1054.5E85291862K763689K733350K940953K825141J857221J90973j951635m234612
$$ 585291862 588055551 590788901 593729854 596554995 598412216 598603189 596651554 592416942
1070.8E92416942n047142k926112N03898K521336L040314L293931L427506L221273
$$ 592416942 587369800 584443688 584947586 587468922 590509236 593803167 597230673 600451946
1087.1F00451946L105521L284514L208936K771377K534688K457559K002895J345813
$$ 600451946 603557467 606841981 610050917 612822294 615356982 617814541 619817436 621163249
1103.4F21163249J043439R09090M64261n4181k37584j78576N37L51548P01845R60052
$$ 621163249 622206688 623115778 623580039 623525858 623288274 623109698 623110235 623461783 624163628 625123680
1123.8F25123680J517057K472043L151238K956212K161026J284122K93791q37922j626432
$$ 625123680 626640737 629112780 632264018 635220230 637381256 638665378 638959169 638121247 636494815
1142.2F36494815j812875j763761j643300j154959k62261O93560J562297K367556K911270
$$ 636494815 634681940 632918179 631274879 630119920 629857659 630551219 632113516 634481072 637392342
1160.5F37392342K950609K561509K107144K060830K583385L116906L043592K481758
$$ 637392342 640342951 642904460 645011604 647072434 649655819 652772725 655816317 658298075
1176.9F58298075J904607J474798J036346M39942j89245o87123j140952j593470j910329
$$ 658298075 660202682 661677480 662713826 663153768 662964523 662277400 661136448 659542978 657632649
1195.2F57632649k032161k006948j789391j365244r65059p88450p85947q50797r90569
$$ 657632649 655600488 653593540 651804149 650438905 649473846 648685396 647899449 647048652 646058083
1213.6F46058083j268983j625836j861692j775860j318217q27610p33376r32991r84073
$$ 646058083 644789100 643163264 641301572 639525712 638207495 637379885 636646509 635713518 634729445
1231.9F34729445p35104m11153j74105N4061L36945O68943J070679J612007K282918
$$ 634729445 633994341 633583188 633409083 633463144 633800089 634469032 635539711 637151718 639434636
1250.3F39434636K871036L136218L002584K572536K033055J508355J033068O32107
$$ 639434636 642305672 645441890 648444474 651017010 653050065 654558420 655591488 656223595
1266.6F56223595K88904m2796k80500k82585M410Q01683K262413L725231M229903L717602
$$ 656223595 656512499 656469703 656189203 655906618 655911028 656712711 658975124 662700355 666930258 670647860
1287F70647860K976000K609014K474249K110004J381636N19335k59340q14497j007497
$$ 670647860 673623860 676232874 678707123 680817127 682198763 682718098 682458758 681644261 680636764
1305.4F80636764p87914l55840j3709J86086K46942O6340k69473n68330q79765j450956
$$ 680636764 679848850 679493010 679479301 679665387 679912329 679978669 679709196 679140866 678261101 676810145
1325.8F76810145k374410l192544l132642j992344n74887N42044J912654L250062L282249
$$ 676810145 674435735 671243191 668110549 666118205 665543318 666085362 667998016 671248078 674530327
1344.1F74530327J956106J70707r23931o84023J70290M14074k27809j410663k701044
$$ 674530327 676486433 676657140 675733209 675049186 675219476 675633550 675405741 673995078 671294034
1362.5F71294034l065885k378642j520932q83698r14514j321674j362204j177252j071334
$$ 671294034 668228149 665849507 664328575 663444877 662530363 661208689 659846485 658669233 657597899
1380.8F57597899q52823m10259j59025m78983r86755j212954p58767L86953J526773
$$ 657597899 656745076 656334817 656175792 655696809 654710054 653497100 652738333 653125286 654652059
1399.2F54652059K163112K146900J976192J439035L08215p89642j141190o91116K62379
$$ 654652059 656815171 658962071 660938263 662377298 662685513 661895871 660754681 660063565 660325944
1417.5F60325944J470685J661182J063704N57542k0325n76377p54714q29756q85964
$$ 660325944 661796629 663457811 664521515 665079057 665058732 664482355 663727641 662897885 662011921
1435.9F62011921l79085p451k41339n97536j098574j901924k794147l717780m184067
$$ 662011921 661632836 661625385 661384046 660786510 659687936 657786012 654991865 651274085 647090018
1454.3F47090018l408373M44591L875912M723012N930901P506013Q142531R012877
$$ 647090018 643681645 644126236 648002148 652725160 658656061 666162074 674304605 683317482
1470.6F83317482J0504604R215653O215453M403591L252983K241016J049280R5010
$$ 683317482 693822086 703037739 709253192 713656783 716909766 719150782 720200062 720295072
1486.9G20295072J70707J100898J099825J03414o40869o67632q67843j754821l899932
$$ 720295072 720465779 721566677 722666502 722769916 722129047 721461415 720593572 718838751 714938819
1505.2G14938819o555497n433083m500747m487156l345490j509011m74572p35402j176298
$$ 714938819 708383322 702950239 698449492 693962336 690616846 689107835 688633263 687897861 686721563
1523.6F86721563j657247k094865k094746k452790k696157j828492j440167j413226
$$ 686721563 685064316 682969451 680874705 678421915 675725758 673897266 672457099 671043873
1539.9F71043873J73986J243293R85205K01345m79818o95109q60989j097500o17385
$$ 671043873 671217859 672461152 673446357 673647702 673167884 672472775 671611786 670514286 669896901
1558.3F69896901J907348K683819K205193J828313J098930L59774n22971k145589l956437
$$ 669896901 671804249 674488068 676693261 678521574 679620504 679980278 679457307 677311718 673355281
1576.6F73355281l934204l831446m540682m941464n104065n226791n299687n304933
$$ 673355281 669421077 665589631 661048949 656107485 651003420 645776629 640476942 635172009
1593F35172009n189359m779935m296124m034102l904342l974140m570603n483032n917131
$$ 635172009 629982650 625202715 620906591 616872489 612968147 608994007 604423404 598940372 593023241
1611.3E93023241n747319n991161n829453l716230k780498l045558k519846j503170
$$ 593023241 587275922 581284761 575455308 571739078 568958580 565913022 563393176 561890006
1627.6E61890006k40982R89557J968562L713668M543900L592789K880812K386630K529859
$$ 561890006 561649024 562638581 564607143 568320811 572864711 576457500 579338312 581724942 584254801
1646E84254801L108561K339483J556694K334714K502441K067686K363324L632366M989386
$$ 584254801 587363362 589702845 591259539 593594253 596096694 598164380 600527704 604160070 609149456
1664.3F09149456N070567N503178O389677N555570M889191M818678L846824K834677
$$ 609149456 614220023 619723201 626112878 631668448 636557639 641376317 645223141 648057818
1680.7F48057818K400697L049373K867759J585424N81502o23941k265692l265500l808379
$$ 648057818 650458515 653507888 656375647 657961071 658542573 657918632 655652940 652387440 648579061
1699F48579061n198538n214989n980969o858706n841673m689634l556192k440333j129150
$$ 648579061 643380523 638165534 632184565 625325859 619484186 614794552 611238360 608798027 607668877
1717.4F07668877J95384K47538l40164n99027n29468m63545k68161O32465K411067
$$ 607668877 607864261 608111799 607771635 607172608 606643140 606179595 605911434 606543899 608954966
1735.7F08954966L419757M948735P005990Q382976R384095J0394991J2305915J3294578
$$ 608954966 612374723 617323458 624329448 632712424 642096519 652491510 664797425 678092003
1752F78092003J1702001J0849714J0645807R459376Q987368P941663O493985N776585
$$ 678092003 689794004 700643718 711289525 720748901 729736269 737677932 744171917 749948502
1768.4G49948502N237341N483865N456090M399181L633499L407776L188849K919137
$$ 749948502 755185843 760669708 766125798 770524979 774158478 777566254 780755103 783674240
1784.7G83674240K659440K162576J745283K063215K303839J927316J587749J630485
$$ 783674240 786333680 788496256 790241539 792304754 794608593 796535909 798123658 799754143
1801G99754143J834213J695037J379550J182616J270473J352667J223386J087248J029849
$$ 799754143 801588356 803283393 804662943 805845559 807116032 808468699 809692085 810779333 811809182
1819.4H11809182Q45969O17623O45995O06597N89847R32813J006961P10547N82218
$$ 811809182 812655151 813272774 813918769 814525366 815115213 816048026 817054987 817765534 818347752
1837.7H18347752M87864J53720M4644N23031P88629O33538M66824L53217K95281K48253
$$ 818347752 818835616 818989336 819033980 819557011 820345640 820979178 821446002 821799219 822094500 822342753
1858.1H22342753K40982K07424N6029j85311j49370L19958M85003K75135J41561J36078
$$ 822342753 822583735 822791159 822847188 822661877 822512507 822832465 823317468 823592603 823734164 823870242
1878.5H23870242J18136J01805Q7142k39o5326J15931K50876J50144J28150J34468
$$ 823870242 823988378 824090183 824177325 824177086 824111760 824227691 824478567 824628711 824756861 824891329
1898.9H24891329N3167m7564q6129q8334o9320R417M2260q5056j93238l9160R5784
$$ 824891329 824944496 824896932 824810803 824722469 824653149 824662566 824704826 824619770 824426532 824387372 824483156
1921.3H24483156J45436K10583J56104P5579L9220P15J2279M7028o3479j78635j550
$$ 824483156 824628592 824839175 824995279 825070858 825110078 825110793 825123072 825170100 825106621 824927986 824926436
1943.8H24926436J91033J17779L3319P5698R2267K0028p16O6996N8413n4419o2287
$$ 824926436 825117469 825235248 825268567 825344265 825436532 825456560 825455844 825522840 825581253 825526834 825464547
1966.2H25464547J03175J64032Q5056Q7440J11580M7863K5689J12117J23023J431n5015
$$ 825464547 825567722 825731754 825816810 825904250 826015830 826063693 826089382 826201499 826324522 826325953 826270938
1988.7H26270938K6464R3103R2029J28270J93536J42217N2392J08838J54376M6373
$$ 826270938 826297402 826390505 826482534 826610804 826804340 826946557 826998949 827107787 827262163 827308536
2009H27308536q35R2208P1228m2736j8538M828k26020l24607K02894O57439M32849
$$ 827308536 827307701 827399909 827471137 827428401 827409863 827414691 827188671 826864064 827066958 827724397 828157246
2031.5H28157246J50740J99378K00689K5212N1439K65300K51949R3878J56283K86281
$$ 828157246 828307986 828507364 828708053 828733265 828784704 829050004 829301953 829395831 829552114 829838395
2051.9H29838395J98901J23560K60234L14653J37568R7155K90156L03626J04844J20700
$$ 829838395 830037296 830160856 830421090 830735743 830873311 830970466 831260622 831564248 831669092 831789792
2072.3H31789792K97069K35438R7692K16723L19839J62601R0539K39909K54691R0182
$$ 831789792 832086861 832322299 832419991 832636714 832956553 833119154 833209693 833449602 833704293 833794475
2092.7H33794475J09970K72632K13444M7147J35124K82943J54615K9385J71423K43664
$$ 833794475 833904445 834177077 834390521 834437668 834572792 834855735 835010350 835039735 835211158 835454822
2113.1H35454822O1094K1220K08497J94966n006L9339K15053J16110n1379O2287J94788
$$ 835454822 835515916 835537136 835745633 835940599 835935593 835974932 836189985 836306095 836254716 836317003 836511791
2135.5H36511791N1975l4094J38581J79589j2338j9491J57297J09434m5061O7472K28763
$$ 836511791 836563766 836529672 836668253 836847842 836835504 836816013 836973310 837082744 837037683 837105155 837333918
2157.9H37333918Q1837p0155P2777J45793n6505p7724K01881K31862j3054j1921J84954
$$ 837333918 837415755 837345600 837418377 837564170 837507665 837429941 837631822 837863684 837850630 837838709 838023663
2180.4H38023663J15871q3625J4066J78576K5570j36018J6988J06454o9380j08659
$$ 838023663 838139534 838055909 838069975 838248551 838274121 838138103 838155091 838261545 838192165 838083506
2200.8H38083506N4001J8239j75237j32740R060j05917k34902o8724L1352j86324k72394
$$ 838083506 838137507 838155746 837980509 837847769 837856829 837750912 837516010 837447286 837478638 837292314 837019920
2223.2H37019920n3942j0669k06947j76132L3855k4318k21014j34290K2292j16646
$$ 837019920 836965978 836955309 836748362 836572230 836606085 836581767 836360753 836226463 836248755 836132109
2243.6H36132109k46823q0108j4127k34782k89440q8573p9989k65539k22921m7803
$$ 836132109 835885286 835805178 835791051 835556269 835266829 835178256 835098267 834832728 834609807 834562004
2264H34562004j20938k61545j36316k6345k14935l25084j25110m8756k54631k96355
$$ 834562004 834441066 834179521 834043205 834016860 833801925 833476841 833351731 833302975 833048344 832751989
2284.4H32751989j46150k20657m43220m01616k17438l16321m95553l66509k47837m65750
$$ 832751989 832605839 832385182 831941962 831540346 831322908 831006587 830511034 830144525 829896688 829430938
2304.8H29430938o03914m27008l77894n55932n37694m09424n93066q10385o01888l74257
$$ 829430938 828827024 828400016 828022122 827466190 826928496 826519072 825926006 825115621 824513733 824139476
2325.2H24139476n62608p36893n33461l86715n79953o18101l31223k33829k56419J29760
$$ 824139476 823576868 822839975 822306514 821919799 821339846 820721745 820390522 820156693 819900274 820030034
2345.6H20030034L26991k53320j010716j206696q69989o92070o29365l32356r2924
$$ 820030034 820357025 820103705 819092989 817886293 817016304 816324234 815694869 815362513 815269589
2363.9H15269589p8499J04487M00603L19898P5459J29700K31862O9857j04606o2108
$$ 815269589 815191090 815295577 815696180 816016078 816091537 816221237 816453099 816522956 816418350 816356242
2384.3H16356242j13607m06742n10812l37720l49998n54383n16057l28064m01974n67257
$$ 816356242 816242635 815835893 815325081 814987361 814637363 814082980 813566923 813238859 812836885 812269628
2404.7H12269628m71234l70801n19037n95868m34637l79443n50806n86808m30048m53055
$$ 812269628 811798394 811427593 810908556 810312688 809878051 809498608 808947802 808360994 807930946 807477891
2425.1H07477891o11722n40972l95000n14090o50644n11527m24802o02603o65606n02109
$$ 807477891 806866169 806325197 805930197 805416107 804765463 804253936 803829134 803226531 802560925 802058816
2445.5H02058816m95791o67811o54638m94837n10872o36637n86391m79877n80430o73532
$$ 802058816 801563025 800895214 800240576 799745739 799234867 798598230 798011839 797531962 796951532 796278000
2465.9G96278000n37157m59016n87701o29247n24640n28514o45876o30975n30660n96940
$$ 796278000 795740843 795281827 794694126 794064879 793540239 793011725 792365849 791734874 791204214 790607274
2486.3G90607274p14601o56366n88655o95408p51972o43432o36160p72477p85112o76692
$$ 790607274 789892673 789236307 788647652 787952244 787200272 786556840 785920680 785148203 784363091 783686399
2506.7G83686399o95169p88271p62761p56561r75073j271605j346290j106680n92053
$$ 783686399 782991230 782202959 781440198 780683637 779708564 778436959 777090669 775983989 775391936
2525.1G75391936J26660P73132J019657Q68022N97715L75987J64389k622k9862M351
$$ 775391936 775518596 776291728 777311385 778179407 778777122 779153109 779317498 779314876 779285014 779289365
2545.5G79289365l6717r6023q9407q7917j18613j17302j03712j36196j85073k00391
$$ 779289365 779252648 779156625 779067218 778979301 778860688 778743386 778639674 778503478 778318405 778118014
2565.8G78118014j82986j74344k11000k50101k48671k51889k74300k64049k35200k46763
$$ 778118014 777935028 777760684 777549684 777299583 777050912 776799023 776524723 776260674 776025474 775778711
2586.2G75778711k78413k80023k76983l09586l56675l74257l52323l43502l60667l45588
$$ 775778711 775500298 775220275 774943292 774633706 774277031 773902774 773550451 773206949 772846282 772500694
2606.6G72500694l15786l17275l24845l23475l37124l49402l23951k83599k73466k81036
$$ 772500694 772184908 771867633 771542788 771219313 770882189 770532787 770208836 769925237 769651771 769370735
2627G69370735k68758k37167k24769k32875k12014j91629k22087k35796j94788j94430
$$ 769370735 769101977 768864810 768640041 768407166 768195152 768003523 767781436 767545640 767350852 767156422
2647.4G67156422k77817l32117k88248k60413l09110l21030k63810k53857l09407l09289
$$ 767156422 766878605 766546488 766258240 765997827 765688717 765367687 765103877 764850020 764540613 764231324
2667.8G64231324k49147k29061k28762j91749j78396k20597k15590j47879j46568k09034
$$ 764231324 763982177 763753116 763524354 763332605 763154209 762933612 762718022 762570143 762423575 762214541
2688.2G62214541j96754j37806j67132k47657k62499k57432l34144l93570l51309l37541
$$ 762214541 762017787 761879981 761712849 761465192 761202693 760945261 760611117 760217547 759866238 759528697
2708.6G59528697m09365m39346l78609l78549m74751m91798m20987m28021m99070m79221
$$ 759528697 759119332 758679986 758301377 757922828 757448077 756956279 756535292 756107271 755608201 755128980
2729G55128980l78371l67403m09543l47257l05652m07696m65751l58939k98977l82662
$$ 755128980 754750609 754383206 753973663 753626406 753320754 752913058 752447307 752088368 751789391 751406729
2749.4G51406729l86417l22699l86834m89474m89235m62889n48661o59227o24598n83052
$$ 751406729 751020312 750697613 750310779 749821305 749332070 748869181 748320520 747661293 747036695 746453643
2769.8G46453643o41167o61254o67274p71642q82268q49307p50422p72476q58784q74162
$$ 746453643 745812476 745151222 744483948 743712306 742830038 741980731 741230309 740457833 739599049 738724887
2790.2G38724887q84115r63211r94027r44197j018584j185119j198828j134038j208186
$$ 738724887 737840772 736877561 735883534 734939337 733920753 732735634 731536806 730402768 729194582
2808.6G29194582j365901j425802j445413j578569j733423j790821j892269k137601
$$ 729194582 727828681 726402879 724957466 723378897 721645474 719854653 717962384 715824783
2824.9G15824783k321184k391100k605200l022134l502905m128278n208909o745756
$$ 715824783 713503599 711112499 708507299 705485165 701982260 697853982 692645073 685899317
2841.2F85899317q324265r724856j0768890j0791719r064376n560220j140475K844095
$$ 685899317 677575052 667850196 657081306 646289587 637225211 631664991 630524516 633368611
2857.5F33368611N214990N625784M646420L127754J667380P19846O01411R68337J094818
$$ 633368611 638583601 644209385 648855805 651983559 653650939 654370785 654972196 655940533 657035351
2875.9F57035351P56621J72377m84228j201213j927972k483010k850890l179729l446758
$$ 657035351 657791972 657964349 657480121 656278908 654350936 651867926 649017036 645837307 642390549
2894.2F42390549l614545l795087m017174m238904m501581m927814n617797o553114
$$ 642390549 638776004 634980917 630963743 626724839 622223258 617295444 611677647 605124533
2910.5F05124533p686853q924127r861529r947180q939565o916165m131675r64343
$$ 605124533 597437680 588513553 578652024 568704844 559765279 552849114 548717439 547753096
2926.8E47753096K052962M492462O410956P908822Q784413Q927226Q489609P578194
$$ 547753096 549806058 554298520 560709476 568618298 577402711 586329937 594819546 602397740
2943.2F02397740O197512M499853K865433J626313P51495K87951M79638J195073K065003
$$ 602397740 608595252 613095105 615960538 617586851 618338346 618626297 619105935 620301008 622366011
2961.5F22366011K862454L513395M002929M342437M546463M493714M135370L719568
$$ 622366011 625228465 628741860 632744789 637087226 641633689 646127403 650262773 653982341
2977.8F53982341L402174L100633K857268K777756K760410K604782K113402J349748
$$ 653982341 657384515 660485148 663342416 666120172 668880582 671485364 673598766 674948514
2994.2F74948514P12990K19345l62694q96990j217187j264274r48190l27647L63827
$$ 674948514 675661504 675880849 675518155 674621165 673403978 672139704 671191514 670863867 671227694
3012.5F71227694R43362J332343J481593J382470J089930O94871L22700J01924q762
$$ 671227694 672171056 673503399 674984992 676367462 677457392 678152263 678474963 678576887 678568125
3030.9F78568125j08481k52008l98636m17232m07994n24462o82175p60495p46131p15614
$$ 678568125 678459644 678207636 677809000 677391768 676983774 676459312 675777137 675016642 674270511 673554897
3051.3F73554897p07566o76036n89490m08292j93358q1598l2962n4240k43008m31240
$$ 673554897 672847331 672171295 671581805 671173513 670980155 670898557 670865595 670811355 670568347 670137107
3071.7F70137107m09186k75552k55585l97861n00023m71651m80652n02527m79519n42701
$$ 670137107 669727921 669452369 669196784 668798923 668298900 667827249 667346597 666844070 666364551 665821850
3092.1F65821850o23583n84901n18560o11365q16703q69572p60377p53760q96335q99076
$$ 665821850 665198267 664613366 664094806 663483441 662666738 661797166 661036789 660283029 659386694 658487618
3112.4F58487618p35521p15196q41320r61721j068532j084149r60946q26478q34883
$$ 658487618 657752097 657036901 656195581 655233860 654165328 653081179 652120233 651293755 650458872
3130.8F50458872q82566p61687o05524o65307q66413r09925q15987q07941p86782o94751
$$ 650458872 649576306 648814619 648209095 647543788 646677375 645767450 644951463 644143522 643356740 642661989
3151.2F42661989q14557j113594j183093j053750j041532j148998j188636j158178
$$ 642661989 641847432 640733838 639550745 638496995 637455463 636306465 635117829 633959651
3167.5F33959651j201928j262605j245677j259983j366794j403451j351297j405418
$$ 633959651 632757723 631495118 630249441 628989458 627622664 626219213 624867916 623462498
3183.8F23462498j525223j498103j412273j469612j546919j520753j505017j570046
$$ 623462498 621937275 620439172 619026899 617557287 616010368 614489615 612984598 611414552
3200.1F11414552j608610j569331j573205j643419j664400j638651j688481j796245
$$ 611414552 609805942 608236611 606663406 605019987 603355587 601716936 600028455 598232210
3216.5E98232210j831949j818955j862407j913190j896917j881838j923383j947283
$$ 598232210 596400261 594581306 592718899 590805709 588908792 587026954 585103571 583156288
3232.8E83156288j978219k072990k093613j973629j845479j794219j768470j711607
$$ 583156288 581178069 579105079 577011466 575037837 573192358 571398139 569629669 567918062
3249.1E67918062j622319j543880j464366j368165j321316j311720j253247j164853
$$ 567918062 566295743 564751863 563287497 561919332 560598016 559286296 558033049 556868196
3265.4E56868196j145602j165688j164973j182615j240969j266122j188218j114965
$$ 556868196 555722594 554556906 553391933 552209318 550968349 549702227 548514009 547399044
3281.7E47399044j130462j121580j016796r06169q95799r57727j029372j132965j188278
$$ 547399044 546268582 545147002 544130206 543224037 542328238 541370511 540341139 539208174 538019896
3300.1E38019896j089693j004993j178146j495123j668930j720011j791477j850128
$$ 538019896 536930203 535925210 534747064 533251941 531583011 529863000 528071523 526221395
3316.4E26221395j888395k004206k138793k202809k344609k563595k636373k594233
$$ 526221395 524333000 522328794 520190001 517987192 515642583 513078988 510442615 507848382
3332.7E07848382k561510k544343k593041k638876k582639k529026k426177k226800
$$ 507848382 505286872 502742529 500149488 497510612 494927973 492398947 489972770 487745970
3349D87745970k229064k404481k407998k264470k180427k198965k190321k087892k052933
$$ 487745970 485516906 483112425 480704427 478439957 476259530 474060565 471870244 469782352 467729419
3367.4D67729419k211183k430916k436578k217948k023071j941652j940488j886845
$$ 467729419 465518236 463087320 460650742 458432794 456409723 454468071 452527583 450640738
3383.7D50640738j678437j398891j191169j237422j468718j465679j117944q72195
$$ 450640738 448962301 447563410 446372241 445134819 443666101 442200422 441082478 440210283
3400D40210283j052350j286417j119256q11398o93888o66260o22631n46276m09931
$$ 440210283 439157933 437871516 436752260 435940862 435246974 434580714 433958083 433411807 433001876
3418.4D33001876k54303j06067N8860K27690L75717M57913N70983P09504O84887N72502
$$ 433001876 432747573 432641506 432700366 432928056 433303773 433761686 434332669 435042173 435727060 436299562
3438.8D36299562O56575R06557J105488J268357J387566J450568J531274J651018J772255
$$ 436299562 436956137 437862694 438968182 440236539 441624105 443074673 444605947 446256965 448029220
3457.1D48029220J862049J872063J915783K114921K256781K133966J938969J943111
$$ 448029220 449891269 451763332 453679115 455794036 458050817 460184783 462123752 464066863
3473.4D64066863K044976K175689K235561K150446K152264K282560K298355K250106
$$ 464066863 466111839 468287528 470523089 472673535 474825799 477108359 479406714 481656820
3489.8D81656820K311408K389193K445668K411991K356410K423137K454728K346129
$$ 481656820 483968228 486357421 488803089 491215080 493571490 495994627 498449355 500795484
3506.1E00795484K354919K584160K777576K711177K547026K547860K665162K826750
$$ 500795484 503150403 505734563 508512139 511223316 513770342 516318202 518983364 521810114
3522.4E21810114K814293K693057K818942L051401L157496L239334L255009L144503
$$ 521810114 524624407 527317464 530136406 533187807 536345303 539584637 542839646 545984149
3538.7E45984149L188968L397345L542721L480077L357888L424704L629267L692627
$$ 545984149 549173117 552570462 556113183 559593260 562951148 566375852 570005119 573697746
3555E73697746L668844L779114L771364L427804L404796M323840M884124M431009M100919
$$ 573697746 577366590 581145704 584917068 588344872 591749668 596073508 600957632 605388641 609489560
3573.4F09489560M212976M447877M636169M623293M299581M172147M707277N015671
$$ 609489560 613702536 618150413 622786582 627409875 631709456 635881603 640588880 645604551
3589.7F45604551M609823M521489M770100M818976M802704M780650M420877M030525
$$ 645604551 650214374 654735863 659505963 664324939 669127643 673908293 678329170 682359695
3606F82359695M291237M612326M471601M286646M027784M248262M853010M368007L247261
$$ 682359695 686650932 691263258 695734859 700021505 704049289 708297551 713150561 717518568 720765829
3624.4G20765829K684414L542841M549384L935695L456712L266811K999186K841115
$$ 720765829 723450243 726993084 731542468 735478163 738934875 742201686 745200872 748041987
3640.7G48041987K481044J764953J458347K583563L692865K873362K182185K510250
$$ 748041987 750523031 752287984 753746331 756329894 760022759 762896121 765078306 767588556
3657G67588556K513408J936853J473427J084626O76274Q01087J221776R07719J056611
$$ 767588556 770101964 772038817 773512244 774596870 775273144 776074231 777296007 778203726 779260337
3675.4G79260337J884044J909077J558602J140952P29143P26462J162708J490116J438737
$$ 779260337 781144381 783053458 784612060 785753012 786482155 787208617 788371325 789861441 791300178
3693.7G91300178J107812O91652M96506O93381Q25346M53889l2484J371Q06748J251340
$$ 791300178 792407990 793099642 793596148 794289529 795114875 795568764 795536280 795537651 796344399 797595739
3714.1G97595739Q10981K88487O2346J14381L31760M91738L04163j26005l50952R4354
$$ 797595739 798406720 798695207 798757553 798871934 799203694 799695432 799999595 799873590 799522638 799616992
3734.5G99616992J002312J019061L9935o28054j52707L01540l3439L63946J169265
$$ 799616992 800619304 801638365 801678300 801050246 800897539 801199079 801165640 801529586 802698851
3752.9H02698851Q88645L08514L13461N84483L94344K9326p3910J95205N82934N28991
$$ 802698851 803587496 803896010 804209471 804793954 805188298 805217624 805143714 805338919 805921853 806450844
3773.3H06450844J74582Q642J42396J81198L7015J17421K78175K55286P9692k04563
$$ 806450844 806625426 806634068 806776464 806957662 806994677 807112098 807390273 807645559 807725251 807520688
3793.7H07520688l65138l99888l67820J05560M29093L45171N74052M64738j82748n74231
$$ 807520688 807155550 806755662 806387842 806493402 806922495 807267666 807841718 808306456 808123708 807549477
3814.1H07549477l62277k09213j43170N08189O76990K71201K6882r5308k01643l07441
$$ 807549477 807187200 806977987 806834817 807343006 808019996 808291197 808318079 808222771 808021128 807713687
3834.4H07713687l11613l8325L46362N50389N71073J96099n94080j278579p07984J015008
$$ 807713687 807402074 807363749 807710111 808260500 808831573 809027672 808433592 807155013 806447029 807462037
3854.8H07462037J032352K14815k57909l05951l6657l5643r6679J77384L66687L44038
$$ 807462037 808494389 808709204 808451295 808145344 808108687 808073044 807976365 808153749 808520436 808864474
3875.2H08864474J729l06904q5533J63734K46167J45018j23441J7524K63393l7432
$$ 808864474 808866203 808559299 808473766 808637500 808883667 809028685 808905244 808922768 809186161 809148729
3895.6H09148729m45962n04732k51532K43783O71029N32747J60396n0128j93178k38240
$$ 809148729 808702767 808198035 807946503 808190286 808861315 809394062 809554458 809504330 809311152 809072912
3916H09072912o3956O5684j5259o0558n662l1948m8578J22666K51830J25646p1823
$$ 809072912 809008956 809074640 809059381 808998823 808993161 808961213 808912635 809035301 809287131 809412777 809340954
3938.5H09340954j91033j08361P1168N3584K4080J35303J31905P15n6982l7908K622
$$ 809340954 809149921 809041560 809112728 809166312 809190392 809325695 809457600 809458315 809401333 809363425 809366047
3960.9H09366047L9697M3571L3796l0041j14381n4419R8407J12653M351P749Q6486
$$ 809366047 809405744 809449315 809483111 809453070 809338689 809284270 809382677 809495330 809499681 809507430 809593916
3983.3H09593916J0908j09375j03533n9009l5643k2173m530
$$ 809593916 809604824 809495449 809391916 809332907 809297264 809275091 809270561
3997.6H09270561
$$ 809270561
##END=$$ End of the data block
