##TITLE=$$ Begin of the data block
##JCAMP-DX=5.00 $$ ACD/SpecManager v 10.08
##SPECTROMETER/DATA SYSTEM=Varian
##DATE=19 Mar 2013 14:12:50
##DATA TYPE=INFRARED SPECTRUM
##DATA CLASS=XYDATA
##ORIGIN=
##OWNER=
##NPOINTS=3735
##FIRSTX=399.26403809
##LASTX=4000.35498047
##MAXX=4000.35498047
##MINX=399.26403809
##MAXY=396.78701782
##MINY=0.00000100
##XFACTOR=1.0000000000
##YFACTOR=0.000001000000000
##FIRSTY=57.73096466
##DELTAX=0.96440572
##XUNITS=1/CM
##YUNITS=TRANSMITTANCE
##XYDATA=(X++(Y..Y))
399.3E7730965UL39056053%Zk80871926L1054451n907882%Wj41061660%TN0739142
421.4E0739143P3516281j24255423M6662223N1646828j6032883q2276168%S4J28603560
441.7A28603561J15770996%Yk08023620%Zl6350936O1931830J08034447r7690300j2402126
462.9E9873852K7644253l670227Q256637K3174660r61281o1420780n717026K5578419
470.6G2758507j3032353J4422932Q9255302n1468971o8023018K1840279N0745911l8265511
478.3G8233078j7944702N7954124J3396263o41098j5145546m3097686m056740J1477272
486.1H0174965N018333K0432404L4097443j9749917j308097O1803405L4644196o4003693
493.8A51109039n8447471L814224K5987060k9175445p827828L6406289j043976k0987351
$$ plain form
399.3 57730965 57730965 57730965 396787018 396787018 396787018 396787018 396787018 396787018 396787018 396787018 396787018 115915092 146969543 141061661 141061661 141061661 141061661 141061661 141061661 1 1 1 50739143
421.4 50739143 124255424 1 46662224 98309052 82276169 1 1 1 1 1 1 1 1 1 1 1 1 1 1 1 128603561
441.7 128603561 244374557 244374557 244374557 244374557 244374557 244374557 244374557 244374557 36350937 36350937 36350937 36350937 36350937 36350937 36350937 36350937 36350937 1 61931831 169966278 72275978 59873852
462.9 59873852 87518105 83847878 92104515 115279175 114317894 52897114 47180088 72758507
470.6 72758507 59726154 74149086 163404388 111935417 43912399 65752678 116498589 78233078
478.3 78233078 60288376 118242500 131638763 130997665 115852119 72754433 68697693 80174965
486.1 80174965 85193298 105625702 139723145 119973228 118665131 180468536 215112732 151109039
493.8 151109039 92661568 96475792 122462852 93287407 85459579 121865868 120821892 99834541
501.5I9834541j0680603M620644J5241615l7002q419403m672402M601990J0675468
509.2A11164848q414718j3104210J2246467K0405190j3133415q631546P687339K897156
516.9A11117111j780998o744385m828872O091888K218964n340271m616578k174591
524.6I3942268O308594N059097o858818k549369J907569P53228L08494K513176J531784
533.3A02916023k515594k221436k419174K444183N124474p226265p658241Q829109
541I7273079R718697J566787L338722m168045m004150L91251l445450l11775k56386
549.7A00102730K934196j846153q397331O031891O201789p500053j510132L480782
557.4I9497719P79350K076080J534798k459549j330078J336700j799140j992676L387947
$$ plain form
501.5 99834541 89153938 93774582 109016197 108979195 100559792 95887390 100489380 111164848
509.2 111164848 102750130 89645920 101892387 122297577 109164162 100532616 108219955 111117111
516.9 111117111 109336113 102591728 97762856 103854744 106073708 100733437 96116859 93942268
524.6 93942268 100250862 105309959 98451141 95901772 97809341 98562569 98871063 101384239 102916023
533.3 102916023 100400429 98178993 95759819 98204002 103328476 96102211 88443970 97273079
541 97273079 106991776 108558563 111897285 107729240 103725090 104116341 100670891 100359116 100102730
549.7 100102730 103036926 101190773 92793442 98825333 105027122 97527069 96016937 99497719
557.4 99497719 100277069 102353149 103887947 101428398 100098320 101435020 99635880 97643204 101031151
566.1A01031151J860214k076889k464233n19654J909691Q00110K712776j474975l452141
574.8I8326050K343445j552521R3986L786728K62207k812217k510132O83296j084381
583.5I7536461J937088M186973m87113J33903k602173m040626k31957K468193K849556
592.1A01750305r3468p5470M25553j124489j910675j00876L63793n11162o0349n42175
601.8I8120987K109894J589706k451790k94761K331329q293l725685k175515k49626
610.5I5246246K787133Q608917J736015p044708k078835J343636M17534J856369M61250
619.2A03333557N86640M71382l587975j579468N31639L28583j02310o02425K619095
627.8A01998718R08943k754707j041046J365509J944046J430923N90813j772087r18747
$$ plain form
566.1 101031151 102891365 100814476 98350243 97830589 99740280 100540390 103253166 101778191 98326050
574.8 98326050 100669495 99116974 99210960 102997688 103259895 100447678 97937546 98620842 97536461
583.5 97536461 99473549 103660522 103173409 103307312 100705139 96664513 96432556 98900749 101750305
592.1 101750305 101656837 101581367 102006920 100882431 98971756 98870880 99234673 98723511 98663162 98120987
601.8 98120987 100230881 101820587 99368797 99074036 101405365 101397072 97671387 95495872 95246246
610.5 95246246 98033379 106642296 108378311 101333603 99254768 100598404 101015938 102872307 103333557
619.2 103333557 103920197 104391579 100803604 99224136 99755775 100084358 99982048 99379623 101998718
627.8 101998718 102907661 100152954 99111908 100477417 102421463 103852386 104443199 102671112 101752365
636.5A01752365o28837j726281P03125R77303O52817M47586k089714o04134J737038
645.2A01221268j659363j28998L979309J852951k42141l263505j66328K761444l967422
653.9A00387215l1388M156762j775948j600082J600723O60545j843399j650101j13945
662.5I9790382o08963J05233J456855J94214R03542N281097m906090l480560R8099
671.2I8833809K411575r14093k891380q23837L67958P18155j127694k075462j377258
679.9I3121773k53243O54816m41559M57298J469780J55815J27228Q20709Q27843J48155
689.6I7088615o65512j130378k7764R93889j826385k964913J001694J993477L21014
698.2I4783737J93741o73355j393845j113784R63241J299828j007660r66065m35005
$$ plain form
636.5 101752365 101123528 99397247 100100372 101077675 101730492 102178078 100088364 99484230 101221268
645.2 101221268 99561905 99432907 103412216 105265167 105023026 101759521 101593193 104354637 100387215
653.9 100387215 100355827 104512589 102736641 101136559 102737282 103397827 101554428 99904327 99790382
662.5 99790382 99181419 99286652 100743507 100937721 101841263 107122360 102216270 98735710 98833809
671.2 98833809 101245384 100331291 97439911 96616074 96984032 97702187 96574493 94499031 93121773
679.9 93121773 92868530 93523346 93081787 93539085 95008865 95164680 95291908 96112617 96940460 97088615
689.6 97088615 96423103 95292725 95264961 96258850 94432465 91467552 92469246 94462723 94783737
698.2 94783737 94977478 94304123 92910278 91796494 92759735 94059563 93051903 92085838 91650833
706.9I1650833o4247k63062l57795J56044k59522j61239k15584M7767j32446q54759
716.6H9545990j441467r54979P27836j555801k440048O0821r6733M14444J437119N79033
726.2H6276215M86129R28528N14832J75728k44637P7667K492203K961906q24707j416763
735.8I1427101P53220O02722J351227J337227r44573n89004J079437P96562N28381
744.5I6342300J434250Q07885l02018o87195J08811J409531M81308P43095O71150p01729
754.2A00307388j20529n42374p1609O79924q56407o43166L77556r4620N03830J084542
763.8A00624535n61364k380J241936o39382p73880J97617n62553l67516k04346M52179
773.5I9404846K165772J166832k71256p82844o68763n5290m06135J155159O96159j188950
$$ plain form
706.9 91650833 91586586 91323524 90965729 91121773 90862251 90701012 90485428 90533195 90400749 89545990
716.6 89545990 88104523 87149544 87877380 86321579 83881531 83942352 83845619 84260063 85697182 86276215
726.2 86276215 86762344 87690872 88205704 88381432 88136795 88214462 90706665 93668571 92843864 91427101
735.8 91427101 92180321 92783043 94134270 95471497 94526924 93937920 95017357 95813919 96342300
744.5 96342300 97776550 98584435 98282417 97595222 97704033 99113564 99594872 100337967 101009117 100307388
754.2 100307388 100186859 99644485 99572876 100252800 99396393 98753227 99130783 99036163 99539993 100624535
763.8 100624535 100063171 100060791 101302727 100663345 99889465 100087082 99524529 99157013 98952667 99404846
773.5 99404846 101570618 102737450 102466194 101683350 101014587 100959297 100553162 101708321 102404480 101215530
783.1A01215530m7142j24855p51594J40877J897239M84986j007988R89120m50447j202744
792.7A01142982J15662L36899J476677J029945l79822j412628n94063N51514o58874
801.4A01608292l7476J417511R30588q36876j838936J29669J431221q35136q87444
810.1A01081413P37648r11735L18077J724800q37837l71765J7685J91978J303925J94404
819.7A03448593k01385q53714p67754P8766j02875L678n05791R9296N41939j86027
829.4A01554726n81925p22015Q02292J278564l31016m68102l89404j977547q95012
838.1I8270561J409569L17886j14273l3981k69119K47047Q2703m65172o53694M82910
847.7I9274437k2903j042008k21970O06476L99948q11691M32388Q20618J52229R11789
$$ plain form
783.1 101215530 101168388 101043533 100291939 100432816 102330055 102815041 101807053 102796173 102345726 101142982
792.7 101142982 101258644 101595543 103072220 104102165 103722343 102309715 101715652 102267166 101608292
801.4 101608292 101570816 102988327 103918915 103082039 101243103 101372772 102803993 101968857 101081413
810.1 101081413 101819061 100907326 101225403 102950203 102112366 101740601 101758286 101950264 103254189 103448593
819.7 103448593 103247208 102393494 101625740 101704506 101601631 101605309 101099518 101198814 101740753 101554726
829.4 101554726 100972801 100250786 101053078 102331642 102000626 101532524 101143120 99165573 98270561
838.1 98270561 99680130 99998016 99883743 99849762 99580643 99827690 99910393 99445221 98791527 99274437
847.7 99274437 99251534 98209526 97987556 98594032 98993980 98182289 98614677 99435295 99587524 100499313
857.4A00499313j29303l97422n49096k59819R03023m54223j115044O9343J341996J113029
867A01021797o99234j434662r06501P7362O02867Q14842P18422k79305m432M72877
876.7A00384033m18007j34239M96857M38247j34124j203934o09344J291084J282463
885.3A01393036o19225l10203J141235J057877k16400j729439m24271O83067k03254
894A00772423n2811k38663j16256O06140m04328j335289R8923P37801m0459m97154
903.7I9530327m88823O58798J55022m13414J28418k31957j04065k1042n1605o03889
913.3I8557770r05503j054840J08261J791222o76758r55620R15551N44365K27989k56516
922.9I8295921n4443M04259K57080r43184n18128J024849n218m39369k81937P54494
$$ plain form
857.4 100499313 100370010 99972588 99423492 99163673 100066696 99612473 98497429 98566772 99908768 101021797
867 101021797 100322563 98887901 97981400 98058762 98661629 99476471 100194893 99915588 99911156 100384033
876.7 100384033 99966026 99831787 100328644 100766891 100632767 99428833 98819489 100110573 101393036
885.3 101393036 100773811 100463608 101604843 102662720 102446320 100716881 100292610 100975677 100772423
894 100772423 100719612 100480949 100364693 100970833 100566505 99231216 99330139 100067940 100027481 99530327
903.7 99530327 99041504 99700302 99855324 99441910 99570328 99338371 99234306 99213264 99161659 98557770
913.3 98557770 97652267 96597427 96705688 98496910 97820152 96864532 97780083 98324448 98552437 98295921
922.9 98295921 98241478 98645737 98902817 97959633 97441505 98466354 98461136 98021767 97739830 98494324
932.6I8494324R77043p96433Q3825N59997l19252M4518n6137r88480l30605J029068
942.2I8697868N47768j54533k57653K39083k01218o71158J82739k72453j49383N48400
951.9I8509460P10991M63082j53267o3301p71111O5537R52644o77727p45361K63329
961.5I8554276L69483l32626j26495K73536R0668K23099m82315p0152J46659j95083
971.2I8451050L3172r51194L90365J213135r80659q36350L08601M65584K4544n33409
980.8I7584839J11648K69402n83900K21656M85649n00534L52585J32599m23477L53699
990.5I8004166j18805n15503l29529J13029k1583m55460P8339L19092L59153J5915
1000.1I7448814J71242L29880m86061m20159m88571l37021L68325k41730j337685j256813
$$ plain form
932.6 98494324 99471367 98674934 98758759 99318756 98999504 99044022 98987885 97999405 97668800 98697868
942.2 98697868 99245636 99091103 98833450 99072533 98871315 98200157 98382896 98110443 97961060 98509460
951.9 98509460 99220451 99683533 99530266 99466965 98695854 98761391 99714035 99036308 98290947 98554276
961.5 98554276 98923759 98591133 98464638 98738174 98828842 99051941 98569626 98499474 98646133 98451050
971.2 98451050 98484222 97533028 97923393 99136528 98155869 97319519 97628120 98093704 98118248 97584839
980.8 97584839 97696487 97965889 97381989 97603645 98089294 97588760 97941345 98073944 97650467 98004166
990.5 98004166 97885361 97369858 97040329 97153358 97131775 96676315 96754654 97073746 97432899 97448814
1000.1 97448814 97620056 97949936 97463875 97043716 96555145 96218124 96586449 96344719 95007034 93750221
1009.7I3750221K76993O98608o20002k44141Q92952m31725j767936j091133j69464
1018.4I1294373K24372j19583l97003m22371q58078q90838j088852q36106L31398j72973
1028.1H7064339j224831j237671j014389l63891m45908j23909N62683l02200o02562
1036.7H2311661j05561K54532j5777L9955O38374P49321R27551L25394j6182K62078
1046.4H5371346k7016n09499l61000N04021Q71849P24861k65732j06003J282929M65088
1056H7950844m56116K23457N33844J26854j09153J40464J72478K20917O86615O22665
1065.7I0112869Q22624P97951p9384K5498J15944K16026o85722j830536M3030J592590
1075.3I1130890N88982p05948p44316r45382o23420O80397l71498j285599p61658K7535
$$ plain form
1009.7 93750221 94027214 94725822 94105820 93861679 94754631 94322906 92554970 91463837 91294373
1018.4 91294373 91518745 91399162 91002159 90579788 89721710 88830872 87742020 86905914 87237312 87064339
1028.1 87064339 85839508 84601837 83587448 83223557 82777649 82653740 83216423 82914223 82311661
1036.7 82311661 82206100 82460632 82444855 82484810 83123184 83872505 84800056 85125450 85109268 85371346
1046.4 85371346 85344330 84834831 84473831 84977852 85849701 86574562 86308830 86202827 87485756 87950844
1056 87950844 87494728 87718185 88252029 88378883 88269730 88410194 88582672 88803589 89490204 90112869
1065.7 90112869 90935493 91733444 91654060 91679558 91795502 92011528 91325806 89495270 89538300 91130890
1075.3 91130890 91719872 91013924 90269608 89324226 88700806 89381203 89009705 87724106 86962448 86989983
1085H6989983N13023n18051q30269m89441o30859j192589j010559j24802L93997j1055
1094.6H3089378j157829k27882J02592m31709M39087Q31962L34938n47767M38759J180381
1104.2H4051910K46804N2490N29343N46203j12152l25661o21109o94511j01723J72272
1113.9H3743866p74399p99858P47498J4900l18772K90146q3023J13282j24749K17949
1123.5H3026840J285683J020630M29031J032883L17695p60490o40671o19400N71656
1132.2H5663857L65943q09097o57684o79688k13394l37211r14155p65625m41055m31724
1141.9H0780167m85199k54151L5309k14798r12536m99390o75888r29299q82522j561608
1151.5G4400085j113014r49943j104340j069229n52979m95819j352142j349289j088264
$$ plain form
1085 86989983 87503006 86984955 86154686 85665245 85034386 83841797 82831238 82706436 83100433 83089378
1094.6 83089378 81931549 81703667 81806259 81374550 81813637 82645599 82980537 82432770 82871529 84051910
1104.2 84051910 84298714 84351204 84880547 85426750 85314598 84988937 84367828 83673317 83571594 83743866
1113.9 83743866 82969467 82169609 82917107 82932007 82613235 82903381 82820358 82933640 82808891 83026840
1123.5 83026840 84312523 85333153 85762184 86795067 87112762 86352272 85711601 85092201 85663857
1132.2 85663857 86029800 85220703 84563019 83883331 83669937 83332726 82418571 81652946 81211891 80780167
1141.9 80780167 80294968 80040817 80076126 79861328 78948792 78449402 77773514 76844215 75961693 74400085
1151.5 74400085 73287071 72337128 71232788 70163559 69610580 69114761 67762619 66413330 65325066
1160.2F5325066M036l38402j141476r47937o12457J47144n19417k24464R6443q392
1169.8F1780144k7180j349194r83505N38372N68085m75327o26564o24641k54734J05095
1179.5E8650551k2110O17752N62813M89956n9277J64585J184670Q26923M43871L59623
1189.1F3219357P83885N96512N16632P22023O02951N20501N14999J368385R87419M27575
1198.8G0260239N79124O97365Q02116L17009N54322P41424L92693K46391M88083K13226
1208.4G5291992R1393P17292N23102P94976L94485k58736K35016J50749J87211K14759
1218G8342239J53008J32034n4138J77834L87817l62083o91422L43704K40906m53964
1227.7G8215935n61066n02624l27759p3227J68609m54620l84216J85913j00800o51138
$$ plain form
1160.2 65325066 65329102 64990700 63849224 62901287 62288830 62435974 61916557 61692093 61788536 61780144
1169.8 61780144 61752964 60403770 59420265 59958637 60526722 60051395 59424831 58800190 58545456 58650551
1179.5 58650551 58628441 59246193 59809006 60298962 60239685 60404270 61588940 62415863 62859734 63219357
1189.1 63219357 64003242 64599754 65116386 65838409 66441360 66961861 67476860 68845245 69832664 70260239
1198.8 70260239 70839363 71536728 72338844 72655853 73210175 73951599 74344292 74590683 75078766 75291992
1208.4 75291992 75383385 76100677 76623779 77418755 77813240 77554504 77789520 77940269 78127480 78342239
1218 78342239 78495247 78627281 78573143 78750977 79138794 78776711 78085289 78428993 78669899 78215935
1227.7 78215935 77654869 77152245 76824486 76751259 76919868 76465248 76081032 76266945 76166145 75515007
1237.3G5515007o80954k39807l65112j21949J37047N0972m5891k0034J97624q812K30560
1247.9G4648651M09287L63380K95609N02624R17969N24261J84464L66249L08563j93451
1257.6G8327606M00376O84867q2496R4024J49727L16635L04894K63519N96321J71769
1267.2H1227242l7018J03676K23251Q2779m0550K433k5283k1920k8465M19853J28418
1277.8H2034416k23755L88336N25773M80125O19545L89122N8807K27799O85203P33735
1287.5H5919106J59919j21704K106O3026K9137k62215k13958R4612M6051k74124m50409
1298.1H4991547l61725l46657Q6594M98352K29713J37581M28917K93747J11526L26378
1307.7H6395973J12793k2293Q6098L34717L14804r3430J03317N0194l1761K02301M2976
$$ plain form
1237.3 75515007 74834053 74594246 74229134 74107185 74244232 74295204 74249313 74229279 74426903 74418091 74648651
1247.9 74648651 75057938 75421318 75716927 76219551 77137520 77661781 77846245 78212494 78521057 78327606
1257.6 78327606 78727982 79412849 79330353 79424377 79574104 79890739 80195633 80459152 81055473 81227242
1267.2 81227242 81190224 81293900 81517151 81599930 81559380 81561813 81536530 81514610 81486145 81905998 82034416
1277.8 82034416 81810661 82198997 82724770 83204895 83824440 84213562 84272369 84500168 85185371 85919106
1287.5 85919106 86079025 85957321 85959427 86022453 86051590 85789375 85575417 85670029 85716080 85441956 84991547
1298.1 84991547 84629822 84283165 84369759 84868111 85097824 85235405 85664322 85958069 86069595 86395973
1307.7 86395973 86508766 86486473 86572571 86907288 87222092 87128662 87231979 87282173 87250412 87452713 87495689
1318.3H7495689k00653J50727J90681k01401K57607L14323K93755O23337K40783L99720
1328H9564568Q26484K46582l80386J4725J75285k06123j11275J29105N4718m8012L9741
1338.6I0305412l33931m85923m17466l83789j11252m38194n06111l06145k16934j8440
1348.2H7087227j14922O8749P7301J38061K81021M74251Q43567O46553L20381J23497
1357.9H9945686j67793l91678o2828m4273n95261j288299j529198j297684j151718
1366.6H3416954r97726q73917q64685q83225m86503j18370n65354j86027P706n00107
1376.2G7948746O3797P75703J204689J312584K003533J757232J043244O99638O91994
1384.9H7501160P83157O66061J42899o58295K55501L77289l51418j49482j40519L23060
$$ plain form
1318.3 87495689 87295036 87445763 87636444 87435043 87692650 88006973 88300728 88924065 89164848 89564568
1328 89564568 90391052 90637634 90257248 90271973 90447258 90241135 90129860 90258965 90313683 90265671 90305412
1338.6 90305412 89971481 89485558 89068092 88684303 88573051 88134857 87628746 87322601 87105667 87087227
1348.2 87087227 86972305 87041054 87118355 87256416 87537437 88011688 88855255 89501808 89822189 89945686
1357.9 89945686 89777893 89386215 89323387 89279114 88683853 87395554 85866356 84568672 83416954
1366.6 83416954 82419228 81545311 80680626 79797401 79310898 79192528 78627174 78441147 78448853 77948746
1376.2 77948746 78012543 78788246 79992935 81305519 83309052 85066284 86109528 86809166 87501160
1384.9 87501160 88284317 88950378 89093277 88434982 88690483 89067772 88716354 88566872 88426353 88749413
1394.5H8749413M77211p7019P7797R5146M88975N26978J20773M24210J066551P72987
1404.2I2723022L67028R2819J83403K94022j80924l47755k40418l03489o69861n80231
1413.8I1337616o39496n77904k92801o88735k11579Q59589o4385k10579o1576K9472
1423.4H9479622L51349L16002j21964m7966j29089m92577p80426l69224j23886q63953
1433.1H7217888o15822j87530l68538q79517j021301m92844o32545l72361m39277n51911
1442.7H1656242m42321o61202l86474j88958L1914l80646l24112l31413p05383j228478
1452.4G7039169j578529p96196j443047j118942j134720j238075R20738k95967m677
1461.1G0349754p63656j1238K95463j160942n05585K7687K121094K495583M041458
$$ plain form
1394.5 88749413 89226624 89149605 89227402 89322548 89811523 90338501 90459274 90883484 91950035 92723022
1404.2 92723022 93090050 93182869 93366272 93660294 93479370 93131615 92891197 92587708 91917847 91337616
1413.8 91337616 90698120 90120216 89827415 89138680 88927101 89786690 89722305 89511726 89450150 89479622
1423.4 89479622 89830971 90146973 90025009 89977043 89847954 89355377 88574951 88205727 88081841 87217888
1433.1 87217888 86602066 86414536 86045998 85166481 84145180 83652336 83019791 82647430 82208153 81656242
1442.7 81656242 81213921 80552719 80166245 79977287 80009201 79628555 79304443 78973030 78267647 77039169
1452.4 77039169 75460640 74664444 73221397 72102455 70967735 69729660 70650398 70354431 70349754
1461.1 70349754 69586098 69574860 69870323 68709381 68203796 68231483 70352577 72848160 76889618
1469.7G6889618M220207M491203N242585R76562J373093O57364J418167M76646J56998
1478.4I5902443M38072L81027J195763O14670P53532N40970M90036M87984K74231Q94745
1488.1A01973473K03193J165085J0017l25141j82747j94062O27007O77200R74526n59151
1497.7A04369400l97156n6205p9041Q6998r2964L46985k8153M72466K641876r5665
1507.3A07168541j344238j196007Q8341K8785P83532L73054n70175j26137L13408R65973
1517A06485077o38565j09215J30798O69533O71112j505882j57417K1324L91769Q70
1526.6A05959404j03539J61431k6108J3733k37602p3357K52915N24528q2611K24174
1536.3A06612968L36930j5183J998505k75223o80321R04267p25586j179230q85483
$$ plain form
1469.7 76889618 81109825 85601028 90843613 91820175 93193268 93850632 95268799 95745445 95902443
1478.4 95902443 96340515 96721542 97917305 98531975 99285507 99826477 100316513 100804497 101078728 101973473
1488.1 101973473 102176666 103341751 103351768 103026627 102843880 102649818 103276825 103954025 104928551 104369400
1497.7 104369400 103972244 103916039 103836998 103923996 103831032 104178017 104149864 104622330 107264206 107168541
1507.3 107168541 105824303 104628296 104716637 104745422 105528954 105902008 105331833 105205696 105519104 106485077
1517 106485077 105846512 105737297 105868095 106537628 107208740 105702858 105545441 105566765 105958534 105959404
1526.6 105959404 105855865 106017296 105991188 106004921 105767319 105693962 105946877 106471405 106388794 106612968
1536.3 106612968 106949898 106934715 108933220 108657997 107977676 108881943 108156357 106977127 106091644
1545A06091644l9558j74202m5334K09915M03427Q4671k13684J62857M8874J50101K38777
1555.6A06917488k1683L27484K634690k354393o95137L11203n94979J13503Q8203l71284
1565.2A06355095r3163l8787M82078O13556L87184n45074l56865j15288k09129N4542
1574.9A06534149M67606J143440l85605o85318m39346K3804J90788Q0940k27852k76443
1584.5A06426163K72499J13373k03278j17607P1998J65986J304j39099l22418N7716
1594.1A06326637J85257K96288J48308l62511n5222j33644N4177K55714J08047q8729
1603.8A06734322k15599J41342P6957J9333l6247J26511o9741j17920k15316n69817
1613.4A05873825K77046J15975k84844M12476M6448Q8066l61069j1505J20949J22665
$$ plain form
1545 106091644 106052086 105877884 105832550 106042465 106445892 106530563 106316879 106479736 106528610 106678711 106917488
1555.6 106917488 106895805 107223289 109857979 107503586 106808449 107119652 106524673 106638176 106726379 106355095
1565.2 106355095 106261932 106223145 106705223 107318779 107705963 107160889 106804024 106688736 106479607 106534149
1574.9 106534149 107001755 108145195 107759590 107074272 106634926 106658730 106849518 106930458 106702606 106426163
1584.5 106426163 106698662 106812035 106608757 106491150 106563148 106729134 106730438 106591339 106268921 106326637
1594.1 106326637 106511894 106808182 106956490 106593979 106538757 106405113 106459290 106715004 106823051 106734322
1603.8 106734322 106518723 106660065 106737022 106756355 106720108 106846619 106776878 106658958 106443642 105873825
1613.4 105873825 106150871 106266846 105982002 106394478 106440926 106528992 106167923 106156418 106277367 106400032
1623.1A06400032j1719n38757j70052J75599N86006l64952l95188O3652J35407n1529
1632.7A05828499l69522k42256K79663J051376P5943o46812n67795m84093n03014m41345
1642.4A03980644J48468n7884j97617J55098L02987J76124o01196m10774k18438O11832
1652A03889244O06270j186508L71254n19982j43226k08153J03241K27287J59416K86820
1661.6A03585663K63336K07542k39479k06352m02382M7714L66875j88148O24969K17919
1671.3A04277657k46537m19235J7441J30615r20708j19194o4804J42426J88377q6036
1680.9A02900002l19069l09967K32765M08821j291115q13202J396j76735m99923p80548
1690.6I9352425j004776o76842o28510r9167R5833p13699q70003o07193o03012j297752
$$ plain form
1623.1 106400032 106388313 105849556 105679504 105855103 106441109 106076157 105680969 105744621 105880028 105828499
1632.7 105828499 105458977 105216721 105496384 106547760 106623703 105976891 105409096 104925003 104421989 103980644
1642.4 103980644 104129112 104071228 103873611 104028709 104331696 104507820 103906624 103495850 103277412 103889244
1652 103889244 104495514 103309006 103680260 103160278 103017052 102808899 102912140 103139427 103298843 103585663
1661.6 103585663 103848999 104056541 103817062 103610710 103208328 103256042 103622917 103434769 104059738 104277657
1671.3 104277657 104031120 103611885 103629326 103759941 102839233 102720039 102655235 102797661 102986038 102900002
1680.9 102900002 102580933 102270966 102503731 102912552 101621437 100808235 100809631 100632896 100132973 99352425
1690.6 99352425 98347649 97670807 97042297 96943130 97038963 96325264 95455261 94848068 94245056 92947304
1700.2I2947304p43630r19296q27438j286904j312240r67926j427491j391883j551629
1708.9H2518867j405166j347893j181641j039237j176583j239395j259056q26683j242226
1717.6G1800987j678497m97826p54768p13104n89669j033859j388153j283386j530396
1726.3F2331329k076976k061913j853752l595772l709721k696010k879025m307159
1734C9151001p117352r25844j845304j320212q23537r40924n9239M56934J864989J873781
1743.6C0314293L310589K704056L779346M155212M276123N311322K938492N214900
1751.3F2004333M149262L127586L437317L412293L289528L252685K814797J898758
1759H7386559K204582J794342K569649J174606M70840R67285N00153Q41835M48509
$$ plain form
1700.2 92947304 92203674 91284378 90456940 89170036 87857796 86889870 85462379 84070496 82518867
1708.9 82518867 81113701 79765808 78584167 77544930 76368347 75128952 73869896 73043213 71800987
1717.6 71800987 70122490 69624664 68869896 68156792 67567123 66533264 65145111 63861725 62331329
1726.3 62331329 60254353 58192440 56338688 52742916 49033195 46337185 43458160 39151001
1734 39151001 32033649 31107805 29262501 27942289 27118752 26177828 26118589 26575523 28440512 30314293
1743.6 30314293 33624882 36328938 40108284 44263496 48539619 53850941 56789433 62004333
1751.3 62004333 66153595 69281181 72718498 76130791 79420319 82673004 85487801 87386559
1759 87386559 89591141 91385483 93955132 95129738 95600578 96567863 97068016 97909851 98358360
1767.7I8358360P47269N62920J12045J088333J257179L9315k88231J42219J84555Q5411
1777.4A02289375k4597K96967O26358J05270J13144k30911J00570M50310K4834J1352
1787A03762672L0091K73681J16890L04406J72790J60324J16860l06916J84037L4675
1796.7A04849510P7545L23510O6284j21315j76186O6910m9538M1184K60483J05155
1806.3A05443542J8647l8903p9269J99982M99450l7033j21475r7534j39137J06628
1815.9A05754898K49344K01141k60627j75980J03287q3924q3702J33972M38004J09123
1825.6A06385536l46817J61072M53529L35358k91161l69857j82854j47957Q4755K11174
1835.2A06292778J11893n4j0513j7654k68059r941L55499J19347L44329J28197m51988
$$ plain form
1767.7 98358360 99105629 99668549 99780594 100868927 102126106 102165421 101877190 102019409 102203964 102289375
1777.4 102289375 102264778 102561745 103188103 103293373 103406517 103175606 103276176 103726486 103751320 103762672
1787 103762672 103792763 104066444 104183334 104487740 104660530 104820854 104937714 104630798 104814835 104849510
1796.7 104849510 104927055 105250565 105316849 105195534 105019348 105086258 105036720 105077904 105338387 105443542
1806.3 105443542 105462189 105423286 105344017 105543999 106043449 106006416 105884941 105787407 105648270 105754898
1815.9 105754898 106004242 106205383 105944756 105768776 105872063 105788139 105704437 105838409 106276413 106385536
1825.6 106385536 106038719 106199791 106653320 106988678 106697517 106327660 106144806 105996849 106081604 106292778
1835.2 106292778 106404671 106404617 106394104 106376450 106108391 106098450 106453949 106573296 106917625 107045822 106593834
1845.8A06593834m8241K04834q4518j89743J36261P0030j49826j63536l0846O2111
1855.5A06400360j12060J8005L45695K92954r2239j32088J07498m6890k98455r9998
1865.1A06382782L27187J07147j49742K58766J41258l08296m42490j89560O9184K5940
1874.8A06222176L1112J45645p8331l56956r079K19330J17515J00090k1560n2712j3580
1885.4A06303650r155M287j12053J17882L84896k14997j45988J28830Q1894L29872
1895A06869118N5725k80861m1794L0060k51381k60300J33972P1084m937K37450O0547
1905.6A06618683j46843J12045K18804K4650j3214j58127p2059J98646M7280j59928
1915.3A06669937p9422J23688K13432j20292j31348O4033n1521Q7975J29936k39777
$$ plain form
1845.8 106593834 106545593 106750427 106665909 106476166 106612427 106682457 106532631 106369095 106338249 106400360
1855.5 106400360 106288300 106306305 106652000 106944954 106852715 106720627 106828125 106781235 106482780 106382782
1865.1 106382782 106709969 106817116 106667374 106926140 107067398 106759102 106316612 106127052 106196236 106222176
1874.8 106222176 106253288 106398933 106320602 105963646 105954567 106173897 106291412 106391502 106369942 106317230 106303650
1885.4 106303650 106294495 106298782 106186729 106304611 106689507 106474510 106328522 106457352 106539246 106869118
1895 106869118 106924843 106643982 106602188 106632248 106380867 106120567 106254539 106325623 106320686 106558136 106618683
1905.6 106618683 106471840 106583885 106802689 106827339 106814125 106655998 106583939 106782585 106829865 106669937
1915.3 106669937 106590515 106714203 106927635 106807343 106675995 106740028 106688507 106776482 106906418 106666641
1924.9A06666641k08793p9804J82686J28777q3245j7731j64077M3403J81153k0996
1934.6A06628014l2410k312M8470M6478j6563j14777L8467K14089J4976j25015O0722
1945.2A06760139R4597k35183q660J87310k7573M341j7471j12854l6072j2314j42349
1955.8A06453911Q0574J84074r9266o7154P3365J37321M0291r3811N80K14332K12319
1966.4A07136536j1734k24366k48230J02860J08902J1291J92086o0051j16913N0644
1976A06941025m1687r8023j0101M9232l5964j05500Q9134K17949r7496j46339J12343
1986.6A06874573J95701N19j75384j26282j49880J49186Q1596o9832P7988j65695k3987
1997.2A06668503Q4869p7263J55899J06972j04576M2717J7189j32004N8899O9855N1697
$$ plain form
1924.9 106666641 106457848 106378044 106560730 106689507 106606262 106588531 106424454 106467857 106649010 106628014
1934.6 106628014 106595604 106593292 106641762 106688240 106671677 106556900 106595367 106809456 106824432 106699417 106760139
1945.2 106760139 106854736 106619553 106610893 106798203 106770630 106774971 106757500 106644646 106608574 106596260 106453911
1955.8 106453911 106534485 106718559 106619293 106552139 106625504 106762825 106803116 106709305 106709885 106924217 107136536
1966.4 107136536 107124802 106900436 106652206 106755066 106863968 106875259 107067345 107007294 106890381 106941025
1976 106941025 106899338 106801315 106791214 106840446 106804482 106698982 106788116 107006065 106908569 106762230 106874573
1986.6 106874573 107070274 107070793 106895409 106769127 106619247 106768433 106850029 106780197 106858185 106692490 106668503
1997.2 106668503 106753372 106676109 106832008 106938980 106834404 106877121 106894310 106762306 106821205 106891060 106942757
2007.8A06942757O2492q7585k4125J0827N6282R7831l4637j50520L8505J02127j28418
2018.5A06885536Q499j22795j90788J55647O1714m4990P9193Q3229J06545m0360k53426
2029.1A06728004j1924K4147j23802L0906N0926Q728j36917p9986J05964Q5732J18446
2039.7A06800224R3399l9703k07306Q4259J48644j58623p1503r079J76087P2181o6986
2050.3A06821594J3336j41525L3577J6197n3932N5382k8816K9655m9461j60454k7672
2060.9A06507881J49437J58920J81427J24886k79343j22795K39433o980r6352M8813
2070.5A06905327j26145l9085K94800L0029r5833J36574k3720m1793N8280J17737K01348
2081.1A07417519j17249k67349k69234k81326J98112J97419k93374J8944L29895J36559
$$ plain form
2007.8 106942757 107005249 106917664 106893539 106904366 106960648 107058479 107023842 106873322 106911827 107013954 106885536
2018.5 106885536 106894035 106771240 106580452 106736099 106797813 106752823 106832016 106915245 107021790 106981430 106728004
2029.1 106728004 106716080 106740227 106616425 106647331 106698257 106706985 106570068 106490082 106596046 106681778 106800224
2039.7 106800224 106893623 106853920 106646614 106730873 106879517 106720894 106649391 106640312 106816399 106888580 106821594
2050.3 106821594 106834930 106693405 106726982 106743179 106689247 106744629 106715813 106745468 106696007 106535553 106507881
2060.9 106507881 106657318 106816238 106997665 107122551 106843208 106720413 106959846 106952866 106856514 106905327
2070.5 106905327 106779182 106740097 107034897 107064926 106969093 107105667 107081947 107040154 107098434 107216171 107417519
2081.1 107417519 107300270 107032921 106763687 106482361 106680473 106877892 106584518 106603462 106933357 107069916
2090.8A07069916J10359m0970j35872j51565j09772J19522k2987N2940J58234L1791
2100.4A07081596R1935m7966O4064J26426o5834q4152r4376k3452m7905n1682m6997
2111A06901657K9801J81396K8748j22971m5609N6733Q9660J51642P5218l6331j63193
2121.6A07146751j95152N9006J28425J40877L510j18462o5323m8912N5413K914M6791
2132.3A07155838m6646j09291k6650j33949m6402L4134K90329K07718J2604J74972
2141.9A07512657j53183j59828M3968j99440k15851K38457L49434j49551k57058j0780
2151.5A06998825J19171j06293k89344J6761L76618L77296j12518k80502m2450R0996
2161.2A07148560K1537j90422r4757j2733j7334R6969N3559M753J61972J29928j73706
$$ plain form
2090.8 107069916 107180275 107139305 107003433 106851868 106742096 106861618 106838631 106891571 107049805 107081596
2100.4 107081596 107173531 107125565 107189629 107316055 107250221 107166069 107071693 107048241 107000336 106948654 106901657
2111 106901657 106931458 107112854 107141602 107018631 106973022 107029755 107119415 107271057 107346275 107309944 107146751
2121.6 107146751 106951599 107010605 107139030 107279907 107283417 107164955 107099632 107050720 107106133 107109047 107155838
2132.3 107155838 107109192 106999901 106973251 106839302 106792900 106827034 107117363 107325081 107337685 107512657
2141.9 107512657 107359474 107199646 107243614 107044174 106828323 107066780 107416214 107266663 107009605 106998825
2151.5 106998825 107117996 107011703 106722359 106739120 107115738 107493034 107380516 107100014 107057564 107148560
2161.2 107148560 107170097 106979675 106884918 106872185 106854851 106951820 107005379 107010132 107172104 107302032 107128326
2171.8A07128326j8127J59790j86951k58926o7429j2581J25626K4880j80405J25511
2181.4A06839714K60742p118k4277N5893K1416n8685j04233L7742K6841r5726J97494
2192A07149803K55676K671J7662j70555k53609R6245J64085K251k8237o607P0916l4203
2203.6A07266098j00639Q690P3867J58951j05263o8306O3508j48758Q0955J7120j5571
2214.2A07230652k8420j75262K56676J62094m8638N3559j15471n6633J9844k42211
2223.9A07056190r4772L30734K068j36223J78894J2070j95412j41372n3277P744J00571
2234.5A07067215J6411l0693k0371K6108J50757P0145J05453j23138k08420J61072
2244.1A07214539J57501j25595k13478K16301J92688k51641j83899J25031J66244j40495
$$ plain form
2171.8 107128326 107110199 107269989 107083038 106824112 106756683 106744102 106869728 106894608 106714203 106839714
2181.4 106839714 107100456 107093338 107069061 107124954 107146370 107087685 106983452 107021194 107048035 106952309 107149803
2192 107149803 107405479 107408150 107425812 107255257 107001648 107097893 107261978 107264229 107235992 107229385 107300301 107266098
2203.6 107266098 107165459 107174149 107248016 107406967 107301704 107233398 107296906 107148148 107229103 107246223 107230652
2214.2 107230652 107202232 107026970 107283646 107445740 107397102 107450661 107335190 107278557 107298401 107056190
2223.9 107056190 106961418 107292152 107294220 107157997 107336891 107348961 107153549 107012177 106958900 106966644 107067215
2234.5 107067215 107083626 107052933 107032562 107058670 107209427 107279572 107385025 107261887 107053467 107214539
2244.1 107214539 107372040 107246445 107032967 107249268 107441956 107190315 107006416 107131447 107297691 107157196
2253.8A07157196k5970J58577J94610J36475k13631k83050j24642J35651J89911J68289
2263.4A07493416O5491k25930r2277J42990O8237j42822o554K9900j39717K6550M593
2274A07223877p9521M3381K13798O4697j41288R3208Q3999k27745j60308K86110J82006
2284.6A07582214k46795k07421j3610J16012K7496J2772m3327j79062l533R3064O6856
2295.2A07204666k4170k7794Q767L3325J51863j44837k11746J81519J85363J48583
2304.9A07505539J04309k04819k67326P2060J26976j72577K7130K14172L1105l1975
2314.5A07404594j76643k11998j78139Q5327K25731J46881O58364J18339m91912K00286
2324.2A07780830P5058j52053J72287k87133n22789n1346K3690M25247K30812p61925
$$ plain form
2253.8 107157196 107131226 107289803 107484413 107620888 107407257 107124207 106999565 107135216 107325127 107493416
2263.4 107493416 107558907 107332977 107240700 107383690 107451927 107309105 107302551 107332451 107192734 107219284 107223877
2274 107223877 107144356 107187737 107401535 107466232 107324944 107418152 107502151 107274406 107114098 107400208 107582214
2284.6 107582214 107335419 107127998 107114388 107230400 107257896 107270668 107227341 107048279 107044746 107137810 107204666
2295.2 107204666 107180496 107152702 107161469 107194794 107346657 107201820 106990074 107171593 107356956 107505539
2304.9 107505539 107609848 107405029 107137703 107209763 107336739 107164162 107191292 107405464 107436569 107404594
2314.5 107404594 107227951 107015953 106837814 106923141 107148872 107295753 107954117 108072456 107580544 107780830
2324.2 107780830 107855888 107703835 107876122 107588989 107066200 107014854 107038544 107463791 107694603 106932678
2333.8A06932678l00895L00552j37451J03485P94739O8321m34212k22305j04218N34287
2343.4A07534981J571l08311J15318K9816j34590k35031M8744N0995j06133J20537
2353.1A07117897N34k44331J43341P63008j08704o75392l41812J248291J576546q19176
2362.7A08660202n88242K15104M10606k96623j139199k49221J18477L28247o9298j20095
2372.4A07269958O95435M9965l74237K51678R4269j01166L9711j56639j64230k19658
2382A07385086j4786L40637R4132j2306P1182n4443k25182r6649N3841P2189R5917
2392.6A07709618q3359j8494l4385o066J79695J66733J95839j16623k73903j48773
2402.3A07570282Q77K75o5453J79047M5914n7259o0867k2453J98867J1887j02905N5710
$$ plain form
2333.8 106932678 106631783 106932335 106794884 106898369 107693108 107761429 107327217 107104912 107000694 107534981
2343.4 107534981 107536552 107228241 107343559 107373375 107238785 107003754 107052498 107103493 106997360 107117897
2353.1 107117897 107118431 106874100 107017441 107780449 107671745 106996353 106654541 107902832 109479378 108660202
2362.7 108660202 108071960 108287064 108697670 108401047 107261848 107012627 107131104 107459351 107390053 107269958
2372.4 107269958 107965393 108015358 107641121 107892799 107987068 107885902 107925613 107768974 107604744 107385086
2382 107385086 107370300 107710937 107805069 107792763 107863945 107809502 107584320 107487671 107541512 107613701 107709618
2392.6 107709618 107626259 107607765 107573380 107567314 107747009 107913742 108109581 107992958 107719055 107570282
2402.3 107570282 107571159 107571434 107505981 107685028 107730942 107673683 107612816 107590363 107789230 107801117 107698212 107753922
2413.8A07753922J43287n4703q934Q9608j50452k4269p721j2535J09825m4823J3672
2424.5A07806877J25847j42006j89697J74293o057j65535K05650J81427L4187m2938
2434.1A07982048j28563K4025N8266o5079j27014K6901J61041M525O2561Q102l4012
2444.7A07972801P8743j58150O87Q202n0095J18904q8348J6632j02631j47606J10871
2455.3A07760010J78596J14830k36847q4320o7726o8168J23031j18355L0487J12893
2465A07744431K5733O4110Q3275k8763k24289n6320N1262j7944j08872k5108J23596
2475.6A07631111J6304j92550r3209J44272r6016o6971K5017J9302K41585J26602P9071
2486.2A07834518K2522K4933l1357j62963j3749l4164K8015j52161l07899M8523J57623
$$ plain form
2413.8 107753922 107897209 107842506 107833572 107923180 107772728 107748459 107740738 107728203 107838028 107793205 107806877
2424.5 107806877 107932724 107790718 107601021 107775314 107769257 107603722 107809372 107990799 108024986 107982048
2434.1 107982048 107853485 107877510 107935776 107870697 107743683 107770584 107931625 107936150 107998711 108006813 107972801
2444.7 107972801 108051544 107893394 107894081 107902283 107852188 107971092 107882744 107899376 107796745 107649139 107760010
2455.3 107760010 107938606 108053436 107816589 107732269 107664543 107596375 107719406 107601051 107631538 107744431
2465 107744431 107770164 107834274 107917549 107888786 107664497 107608177 107659439 107641495 107532623 107507515 107631111
2475.6 107631111 107647415 107454865 107361656 107505928 107409912 107342941 107367958 107387260 107628845 107755447 107834518
2486.2 107834518 107857040 107881973 107850616 107687653 107673904 107639740 107667755 107515594 107207695 107256218 107413841
2496.8A07413841J7739k129J07864J12381Q194k72094j98761K15187j2993j30028K3583
2507.4A07282784o783K84355J91185k26608L5934M7394k37900L296M1878p9109q4946
2518A07251480q8119P5431m1107j94389M4151J35391P4868j9913j43822O9626K8328
2528.6A07191925k23602m1809J40350J31546j34384n2712K46643m4899j07353n188
2538.2A07100517j05522o1226N2063J90819q0849l26309J37940K44712q9889j02471
2547.9A06959785j58401j48918P8201K04216k9533j17302J34170o0775j14510l2608
2557.5A06714325m9057J04752M791N7586O5110q3199j16356m5776R949j73539J7502
2568.1A06506088J50177o5429p5554J5808K8114J03325J41296k24502j92108J47865
$$ plain form
2496.8 107413841 107431580 107429451 107537315 107649696 107657890 107385796 107187035 107402222 107389229 107259201 107282784
2507.4 107282784 107276001 107560356 107751541 107524933 107560867 107608261 107370361 107373657 107415535 107336426 107251480
2518 107251480 107163361 107238792 107197685 107003296 107047447 107182838 107257706 107237793 107093971 107163597 107191925
2528.6 107191925 106968323 106926514 107066864 107198410 107064026 107011314 107257957 107213058 107105705 107100517
2538.2 107100517 106994995 106933769 106985832 107176651 107095802 106769493 106907433 107152145 107062256 106959785
2547.9 106959785 106801384 106652466 106730667 106934883 106905350 106788048 106922218 106861443 106746933 106714325
2557.5 106714325 106665268 106770020 106774811 106832397 106897507 106814308 106697952 106652176 106662125 106488586 106506088
2568.1 106506088 106656265 106590836 106515282 106531090 106559204 106662529 106803825 106579323 106387215 106535080
2577.8A06535080K05200J6861j98006O4812o3965k10891O6703k1934q0559j14220r0454
2588.4A06108627J41266J23284k4414N6877j05851j42799K03148o5483j27838J77620
2598A06344437M3022k20772k25449L07496K56599k57828j1268N6213k51762j34858
2607.7A05905830q979l0175J44043R4910j97189j31119Q1207O4522M9255J9677N2474
2618.3A06044456J20789j73469k95968n7373J06453J03455l4271k13608k23526J50360
2627.9A05527298K02644p2174m3724O6406N188k53501j28067K35725J46110j56135
2637.6A05529770j33202R4544R0523p8949k12800J2566P4959j66359j12846M1893K55806
2648.2A05395905J9722l81928r5764K67502M2823k96424o9214K01851P2212j13030
$$ plain form
2577.8 106535080 106740280 106757141 106559135 106623947 106559982 106349091 106415794 106393860 106313301 106199081 106108627
2588.4 106108627 106249893 106373177 106348763 106405640 106299789 106156990 106360138 106294655 106166817 106344437
2598 106344437 106387459 106166687 105941238 106248734 106505333 106247505 106236237 106292450 106040688 105905830
2607.7 105905830 105896851 105866676 106010719 106105629 105908440 105777321 105858528 105923050 105972305 105991982 106044456
2618.3 106044456 106165245 105991776 105695808 105638435 105744888 105848343 105814072 105600464 105376938 105527298
2627.9 105527298 105729942 105657768 105614044 105680450 105685638 105432137 105304070 105539795 105685905 105529770
2637.6 105529770 105396568 105491112 105581635 105502686 105289886 105302452 105377411 105211052 105098206 105140099 105395905
2648.2 105395905 105415627 105033699 104937935 105205437 105248260 104951836 104882622 105084473 105156685 105043655
2657.8A05043655L3966k0408j87554J73905L2776k19193K6169O4140l3989o4819J6708
2668.4A04865356k9106P10l0075k18453j19209l7537K8580J55693J88317L0052o9374
2679A04764954k7558n6602J24351J05301j27456j26748j47094J06216L39645k952l8620
2689.6A04913437K15568J16425l0952j22513r659M0382j01356m9141K8633O6429O0722
2700.3A05127975R8053L8811m6898n4275j94992k8176Q0529j30082J8883J82381r4986
2710.9A04997223j28586J12923L7407m4991m2679M891L9230P294q1368j99348j3588
2721.5A04688408l1220o3186J10870J75240K16629k06169l05321K8892q5624k05971
2731.1A04322548j16654J91109L26805O6841n5023j27533r0934Q5624r743O6048K17217
$$ plain form
2657.8 105043655 105077621 105057213 104869659 105043564 105076340 104857147 104883316 104947456 104913467 104848648 104865356
2668.4 104865356 104836250 104836960 104806885 104588432 104469223 104431686 104460266 104615959 104804276 104834328 104764954
2679 104764954 104737396 104680794 104805145 104910446 104782990 104656242 104509148 104615364 104955009 104952057 104913437
2689.6 104913437 105129005 105245430 105214478 105091965 105082306 105122688 105021332 104972191 105000824 105067253 105127975
2700.3 105127975 105226028 105264839 105217941 105163666 104968674 104940498 105021027 104890945 104909828 105092209 104997223
2710.9 104997223 104868637 104981560 105018967 104973976 104931297 104936188 104975418 104982712 104901344 104701996 104688408
2721.5 104688408 104657188 104594002 104704872 104880112 105096741 104890572 104585251 104614143 104528519 104322548
2731.1 104322548 104205894 104397003 104723808 104790649 104735626 104608093 104517159 104602783 104593040 104659088 104876305
2741.7A04876305l907O5209J99318j52687k50977L4447L5484J33980K05772j39724
2751.4A05003220k18377r1651Q4373O2454o8901p7370j38191R1614N1094l3371J52825
2762A04817719Q9111p3059j60187r3040j95115j06186J3154J07452J23894k05384M5716
2772.6A04364075N584p3326Q2901k01240l2196K228j44028p4295l0106k22595k49703
2783.2A03427299J18889M0520r4681k30659n0446L1235l31230l6568L1059p3303j07582
2793.8A02724533k16957n9280q7426j6975o3164k65182j98319j13205j70280j65650
2803.4A01368095j56364l37120j96388j7983j67595k57950l34259m58618m14352l00995
2813.1I8726471k56821j16531k29759m53919l95080l24189m47227n81520m79035m67651
$$ plain form
2741.7 104876305 104872398 104937607 105136925 104984238 104733261 104767708 104803192 104937172 105142944 105003220
2751.4 105003220 104784843 104693192 104777565 104840019 104771118 104693748 104555557 104647171 104698265 104664894 104817719
2762 104817719 104906830 104833771 104673584 104580544 104385429 104279243 104292397 104399849 104523743 104318359 104364075
2772.6 104364075 104369659 104296333 104379234 104177994 104145798 104148026 104003998 103929703 103899597 103677002 103427299
2783.2 103427299 103546188 103586708 103492027 103261368 103210922 103242157 102910927 102874359 102905418 102832115 102724533
2793.8 102724533 102507576 102448296 102360870 102343895 102280731 102015549 101817230 101704025 101533745 101368095
2803.4 101368095 101211731 100874611 100678223 100660240 100492645 100234695 99900436 99441818 99027466 98726471
2813.1 98726471 98469650 98353119 98123360 97669441 97274361 96950172 96502945 95921425 95442390 94974739
2822.7I4974739n24292p29050r13932o90415n03555o32622j084076j163399q98429
2831.4H7834969r11416j159004j279228j053032j399925j820007j751435j808273j943871
2840.1G4708778k416534k822197l150505l604641l762177l815124l877903m006062
2847.8D7253635l718940l236603k989681k665905j942524r89437n36105L2273O56072
2856.5C1862785J175457J851693K324993K475734K560673K840149K820911K588124
2864.2E0500519K200641J852894J586350J143490P02804K17373J89846L99571N89172
2872.9E9382660J134567J475788J325833J108818J005912Q21999N65933K98012O3782
2881.6F7183304o8657o0539m64554r48509p37786p24914q78235r32820j039901r87541
$$ plain form
2822.7 94974739 94450447 93721397 92807465 92117050 91613495 90980873 89896797 88733398 87834969
2831.4 87834969 86923553 85764549 84485321 83432289 82032364 80212357 78460922 76652649 74708778
2840.1 74708778 72292244 69470047 66319542 62714901 58952724 55137600 51259697 47253635
2847.8 47253635 43534695 40298092 37308411 34642506 32699982 31710545 31174440 31206713 31862785
2856.5 31862785 33038242 34889935 37214928 39690662 42251335 45091484 47912395 50500519
2864.2 50500519 52701160 54554054 56140404 57283894 57986698 58204071 58393917 58793488 59382660
2872.9 59382660 60517227 61993015 63318848 64427666 65433578 66255577 66821510 67119522 67183304
2881.6 67183304 67114647 67054108 66589554 65641045 64903259 64178345 63300110 62367290 61327389 60339848
2891.2F0339848j018490j106137j287899j258049j319091j358242j032959j192429
2898.9E0766552j372387j235901j155208j399006j367596j101765j461857j496040
2906.6D0176792j461456j426186j246761j466793j690643j822783j747980j961968
2914.3B7352222j896448j530052j547127j440807j440462j320334j135830q48434o32029
2923A5560699o20889m21951j66245K17082K19746K67571N63824P25170P02188P19086
2932.7A7766281J027105J277436J587124J623249J789381J937309J806427J953829
2940.4C0768141K005369K013714J755768J415313J453545J565155J199078P24994O70876
2949.1D3571953K66414j11457k08687k38205k6138l7377R602L39756M67483O43669
$$ plain form
2891.2 60339848 59321358 58215221 56927322 55669273 54350182 52991940 51958981 50766552
2898.9 50766552 49394165 48158264 47003056 45604050 44236454 43134689 41672832 40176792
2906.6 40176792 38715336 37289150 36042389 34575596 32884953 31062170 29314190 27352222
2914.3 27352222 25455774 23925722 22378595 20937788 19497326 18176992 17041162 16192728 15560699
2923 15560699 14939810 14517859 14351614 14568696 14788442 15056013 15619837 16345007 17047195 17766281
2932.7 17766281 18793386 20070822 21657946 23281195 25070576 27007885 28814312 30768141
2940.4 30768141 32773510 34787224 36542992 37958305 39411850 40977005 42176083 42901077 43571953
2949.1 43571953 43838367 43726910 43518223 43280018 43253880 43216503 43226105 43565861 44033344 44677013
2958.7D4677013J206543J359803J422912J665001J640907J963223K247444K178970
2966.4E8361816K194115K294174J940590J592186J628769J449661J241555R56848R77989
2975.1G2637703J039947P11266O53076O05149N37734P37748Q84910Q65685R14940P09175
2984.7H0297333O06720R11033Q51044P72163N97146K19879R8571K78161L59382o2874
2994.4H4928558k56538l18817o08017p48726n66788o10168j073578j139328j156334
3003.1G8450264r82758o70227o27464m32304m18290j47377L37044Q56591J240676J097489
3012.7G8703644J303489J779664K028137J965370J795341J785111J881813J600998
3020.4I2843567J075813J108574J215996R65294P10701P07222O34247L67424K60284
$$ plain form
2958.7 44677013 45883556 47243359 48666271 50331272 51972179 53935402 56182846 58361816
2966.4 58361816 60555931 62850105 64790695 66382881 68011650 69461311 70702866 71659714 72637703
2975.1 72637703 73677650 74388916 75041992 75647141 76184875 76922623 77807533 78673218 79588158 80297333
2984.7 80297333 80904053 81815086 82666130 83438293 84035439 84255318 84353889 84632050 84991432 84928558
2994.4 84928558 84672020 84353203 83745186 82996460 82429672 81819504 80745926 79606598 78450264
3003.1 78450264 77467506 76797279 76169815 75737511 75319221 75171844 75508888 76365479 77606155 78703644
3012.7 78703644 80007133 81786797 83814934 85780304 87575645 89360756 91242569 92843567
3020.4 92843567 93919380 95027954 96243950 97209244 97919945 98627167 99261414 99628838 99889122
3029.1I9889122M87022P41936M17862K24503K62443J54907K95983L80951J54045k69692
3038.7A02739082P7M69703R6711O8397L22838K00149J31943R7710n4589k16300M2655
3049.4A03898376L46093J9012j03859J80542J29906J8562J0658K8794j7685j55136
3059A04355263R3597K68173j8135j43455o7330O7261J94252J4916j43349m402Q3023
3069.6A04699814j6205j49673J10809L39729J42838P8323l227J6449K42363O2736j91902
3080.2A05332054R2117K55166M3655N0240m4907j34537j25427j824K31865j03469r4628
3090.8A05500305J49071o9710J06362K69699P6019p7934k02355j12182M74502N49851
3100.5A06663628l04039n27604j09588K79091R0614l90205O462K39906k9541M5792
$$ plain form
3029.1 99889122 100376144 101118080 101535942 101760445 102022888 102177795 102473778 102854729 103008774 102739082
3038.7 102739082 102739159 103208862 103305573 103373970 103696808 103896957 104028900 104126610 104072021 103855721 103898376
3049.4 103898376 104244469 104263481 104159622 104340164 104470070 104488632 104499290 104528084 104510399 104355263
3059 104355263 104448860 104717033 104698898 104555443 104488113 104555374 104749626 104764542 104621193 104616791 104699814
3069.6 104699814 104683609 104533936 104644745 104984474 105127312 105205635 105202408 105218857 105461220 105523956 105332054
3080.2 105332054 105424171 105679337 105722992 105773232 105728325 105593788 105468361 105466537 105698402 105594933 105500305
3090.8 105500305 105649376 105579666 105686028 105955727 106031746 105953812 105751457 105639275 106113777 106663628
3100.5 106663628 106359589 105831985 105722397 106001488 106092102 105701897 105708359 105948265 105918724 105964516
3110.1A05964516J02119L3295p5813Q865J57173l5667q6510J6792j8852p9056j31088
3120.7A05855774j45L387j03721k1919K0904J67511Q4290q2352J7395k3697j10893
3131.3A05806534k29218p9040K11372K21047L7063k78961j69899k7512K8595J06324
3141A05626305m5105J75460K33773j19004k23564m7249P4166L0281M2480j17279m3167
3151.6A05587097L2356q3122L8742o9290Q2993J3542j36627K48825j18965j74965K48436
3162.2A05669022p897k13997j42578J53938O8787l41675k20146N562J1589N2704K15042
3172.8A05250351K40761O6086j42098j12244J96679J99348j06308l64815k94395n3604
3182.4A04879761o5552J17058J42936j45545m5319J50154K53632J50711j62064k97935
$$ plain form
3110.1 105964516 106066635 106099930 106024117 106032982 106190155 106154488 106067978 106084770 106065918 105986862 105855774
3120.7 105855774 105855629 105859016 105755295 105733376 105754280 105921791 106006081 105923729 105941124 105917427 105806534
3131.3 105806534 105577316 105498276 105709648 105930695 105967758 105688797 105518898 105491386 105519981 105626305
3141 105626305 105581200 105756660 105990433 105871429 105647865 105600616 105674782 105705063 105747543 105630264 105587097
3151.6 105587097 105619453 105536331 105575073 105505783 105588776 105602318 105465691 105714516 105595551 105420586 105669022
3162.2 105669022 105661125 105447128 105304550 105458488 105527275 105185600 104965454 104971016 104982605 105035309 105250351
3172.8 105250351 105491112 105557198 105415100 105302856 105499535 105698883 105592575 105227760 104933365 104879761
3182.4 104879761 104814209 104931267 105074203 104928658 104883339 105033493 105287125 105437836 105275772 104977837
3192.1A04977837j76903n5641j39580o7642k8313m9858J54129K13531P7401k26616
3201.7A04678345j98021k8534r804J82030j19675j81831J25870j07628R2308K98515
3211.4A04731575j56097j92414R7321M5128j9219m9644k3148P1533j63185j19140J78085
3222A04400795N8807k1042J12671Q5221j7014j66664m26964j97723J16005M6554J21102
3232.6A04111748Q9454j2931j15296j60110l9757n3131n768K5833M6036q5739k10083
3243.2A03590256J33339R3620k20993q164J84304J24710r4780j68587O7185n3910j24702
3253.8A03522278m975r3406Q3519p2022k73788n2307M1008J1261j48369K32002M43329
3264.4A03688530o5605k99408j94374K06611J19637k04880q9195k4681J8272l00522
$$ plain form
3192.1 104977837 104800934 104745293 104605713 104538071 104509758 104459900 104614029 104827560 104904961 104678345
3201.7 104678345 104480324 104451790 104441986 104624016 104504341 104322510 104448380 104340752 104433060 104731575
3211.4 104731575 104575478 104383064 104480385 104525513 104506294 104456650 104433502 104505035 104341850 104222710 104400795
3222 104400795 104459602 104438560 104551231 104636452 104619438 104452774 104025810 103828087 103944092 103990646 104111748
3232.6 104111748 104201202 104188271 104072975 103912865 103873108 103819977 103814209 103840042 103886078 103800339 103590256
3243.2 103590256 103723595 103817215 103596222 103588058 103772362 103897072 103802292 103633705 103700890 103646980 103522278
3253.8 103522278 103517303 103423897 103507416 103435394 103161606 103109299 103150307 103161568 103013199 103245201 103688530
3264.4 103688530 103622925 103323517 103129143 103335754 103455391 103250511 103161316 103136635 103154907 102854385
3274A02854385k50114L12874Q8814j26778R1362r8641j69487r3330j80336R9259J70013
3284.7A02698021p4677q8691p6081L7964j40114l21571J04141K40204j4740j18118
3294.3A02246338j89697j63880M9500K38357K3407p2456O0951j68289j06133J15708
3303.9A02033806P6790j07735j60957J16584j68403j39641J13754o8542J90872k2789
3313.6A01863739k77374j00670N1529O4743j28670K4201l17223l13454L14377K02904
3323.2A01384102N4458P7500Q8142j38351k90062n8655Q2375J01822m8813j22216r9731
3333.8A01030571o6216j26678N3833K81929p7118k12898j27220N3993N5817k77550
3343.5A00588463j6998K90779o1241k36512R9701N2353n3696K4208j16188L8468p2472
$$ plain form
3274 102854385 102604271 102917145 103005959 102879181 102970543 102871902 102702415 102609085 102428749 102528008 102698021
3284.7 102698021 102623344 102534653 102458572 102496536 102356422 102034851 102138992 102379196 102364456 102246338
3294.3 102246338 102056641 101892761 101942261 102180618 102204025 102131569 102192520 102024231 101918098 102033806
3303.9 102033806 102110596 102002861 101841904 101958488 101790085 101650444 101764198 101695656 101886528 101863739
3313.6 101863739 101586365 101485695 101537224 101601967 101473297 101497498 101180275 100866821 101181198 101384102
3323.2 101384102 101438560 101516060 101604202 101465851 101175789 101117134 101199509 101301331 101252518 101130302 101030571
3333.8 101030571 100964355 100837677 100891510 101173439 101096321 100883423 100756203 100810196 100866013 100588463
3343.5 100588463 100571465 100862244 100801003 100564491 100664192 100716545 100662849 100687057 100570869 100609337 100536865
3354.1A00536865k68730J02287Q9287j04324P7461j29379k13654J25321p5287j46698
3363.7I9993149j9890n0415r2064j97502J9249K12921K86621M814k65838p9377M2382
3374.3I9854050J19293j49010k14775j81114o7246K82143p7362r7939K03362M5998
3384I9717400j40885r4559q2405k83088L242J46118M1726n6466j54914K07565j4237
3394.6I9289497k68020N0598J13190L4698k9465j87355k62977j69091j76971r5924
3404.2I8298180J22100K73262J90613q4846m0711q7158p6271Q3618q0398j33606j79947
3414.8I8284836j64528P3570J31966M6745k869J2566o7360n1071J34239P2373o0425
3425.5I8410042j58898k55691p8041J16966K72606K11716k76459m02443K9869K72598
$$ plain form
3354.1 100536865 100268135 100370422 100459709 100355385 100432846 100303467 100089813 100215134 100139847 99993149
3363.7 99993149 99973259 99922844 99830780 99633278 99652527 99865448 100152069 100156883 99891045 99811668 99854050
3374.3 99854050 99973343 99824333 99609558 99428444 99361198 99643341 99565979 99468040 99671402 99717400
3384 99717400 99576515 99481956 99399551 99116463 99119705 99265823 99307549 99251083 99096169 99303734 99289497
3394.6 99289497 99021477 99072075 99185265 99219963 99190498 99003143 98740166 98571075 98394104 98298180
3404.2 98298180 98420280 98693542 98884155 98799309 98758598 98671440 98595169 98678787 98598389 98464783 98284836
3414.8 98284836 98120308 98193878 98325844 98372589 98369720 98382286 98314926 98263855 98398094 98470467 98410042
3425.5 98410042 98251144 97995453 97917412 98034378 98306984 98518700 98242241 97839798 97869667 98142265
3435.1I8142265k03315l83515J55396K14790j75705k70958J62193K82494k11769k40967
3444.7I7470909j4152l045k27119j18019J86172P0061m7180o9580k9137L0571p0793
3455.3I7178688p294m1664O981J90308j35788k34947j05904n3581R4642k19436j13221
3466I6558784L04741L64731K98516l45864l35708M06066L08579k42615l05748J62743
3475.6I7174225J58874o7222J83052L31962P2716l7185J3229j05866Q0239Q6326m8362
3486.2I7841988N3550r3490k75299j75377K00027J27281j44836O6223R3239J89865
3495.8I7883171J35849k31087k7809K14905n8388p5035L87917K95807j69465j04385
3505.5I8251480r6069j93917R995J45019J31524M2846o6314J24481J03416j46255p2762
$$ plain form
3435.1 98142265 97938950 97555435 97710831 97925621 97749916 97478958 97641151 97923645 97711876 97470909
3444.7 97470909 97456757 97453712 97226593 97108574 97294746 97364807 97317627 97248047 97218910 97249481 97178688
3455.3 97178688 97171394 97129730 97136711 97327019 97191231 96956284 96850380 96796799 96891441 96672005 96558784
3466 96558784 96863525 97228256 97526772 97180908 96845200 97251266 97559845 97317230 97011482 97174225
3475.6 97174225 97333099 97265877 97448929 97780891 97853607 97816422 97829651 97723785 97804024 97890350 97841988
3486.2 97841988 97895538 97802048 97526749 97351372 97551399 97678680 97533844 97600067 97693306 97883171
3495.8 97883171 98019020 97787933 97760124 97975029 97916641 97841606 98229523 98525330 98355865 98251480
3505.5 98251480 98155411 97961494 97971489 98116508 98248032 98290878 98224564 98349045 98452461 98306206 98233444
3516.1I8233444J55419K11753J6587k36031O64M19006O2203o2332R4627p8644J34812
3526.7I8951508r667P8575J91162J21605J77414j81267J33248O6917k63824J48941
3536.4I9414612J55884J37298j1917j47690K11434L96431K44659J4328k06016j54015
3546A00055008L08891K71591J67405J97624K12311K67402l42621k26936K26685J89842
3555.6A01327202K70241Q7822L3042J85845K53250L80760J31088n5397J65925K18307
3565.3A02998085L50525L88428J8974O2027M9850k49450k95464m1176J41274L8345
3574.9A03461418J3184K46811M07028J36917P6736R3125k71469J11816N85030J05476
3584.6A04966072o8489J64116O7276P6706L05412J51528j32424j42814L64997L80257
$$ plain form
3516.1 98233444 98388863 98600616 98617203 98381172 98381836 98800842 98863045 98800713 98895340 98816696 98951508
3526.7 98951508 98941841 99020416 99211578 99333183 99510597 99329330 99462578 99529495 99265671 99414612
3536.4 99414612 99570496 99707794 99695877 99548187 99759621 100156052 100400711 100415039 100209023 100055008
3546 100055008 100363899 100635490 100802895 101000519 101212830 101480232 101137611 100910675 101137360 101327202
3555.6 101327202 101597443 101685265 101718307 101904152 102157402 102538162 102669250 102613853 102779778 102998085
3565.3 102998085 103348610 103737038 103756012 103818039 103867889 103618439 103322975 103281799 103423073 103461418
3574.9 103461418 103474602 103721413 104128441 104265358 104342094 104435219 104163750 104275566 104860596 104966072
3584.6 104966072 104897583 105061699 105128975 105205681 105511093 105662621 105530197 105387383 105752380 106132637
3594.2A06132637q4747j06514j43578P9529L03703r7229m4426L54035P0839k49535
3603.9A06214714J91J27434Q1092J67427K854O2515L2044M3602N7594k84210K98645
3614.5A06803902M54101k28149P4425M65980r6649J15234L73139o5399l67936m81704
3624.1A07046944j42739L11051K89139O03843J102165p02591n22987j98860O5010K87521
3633.8A08138496m8042l04367l26172j01761J24535J63299M8577K0088K69127j511
3643.4A07982269l19877m5319N90302J155487m23378o15105N34889K90611n44357m98733
3653A08106789j50338M4190j20842J85478L33412J9066j30264k26860l5355J71822
3662.7A08197098r3926j66137m013P514M6288L85933M39712j34796L45536j36078n55718
$$ plain form
3594.2 106132637 106047890 105941376 105797798 105877327 106181030 106083801 106039375 106393410 106464249 106214714
3603.9 106214714 106214905 106342339 106423431 106590858 106593712 106656227 106688271 106731873 106789467 106505257 106803902
3614.5 106803902 107258003 107029854 107104279 107570259 107473610 107588844 107961983 107896584 107528648 107046944
3624.1 107046944 106904205 107215256 107504395 108108238 109210403 108507812 107984825 107785965 107850975 108138496
3633.8 108138496 108090454 107786087 107459915 107358154 107482689 107645988 107694565 107714653 107983780 107982269
3643.4 107982269 107662392 107617073 108207375 109362862 108939484 108324379 108859268 109149879 108605522 108106789
3653 108106789 107956451 108000641 107879799 108065277 108398689 108417755 108287491 108060631 108025276 108197098
3662.7 108197098 108103172 107937035 107933022 107940536 107986824 108372757 108812469 108677673 109023209 108887131 108331413
3673.3A08331413n3543J480965N81344j197715m81987o6727k1324m2603J50513O0478
3682.9A08740814k23495n2544J06003P5027N50980Q72726p59658l10822J81953l23860
3692.6A08857124q5136J01494J86928O1698m36096j31508J67405J2558R5893L23639
3702.2A09153999j3038l22914j72272J4618J1314q1444j777O04072J35811l46283K8656
3712.8A09010742P9773o3110M6989P2533k274n8883r1133M8667K05681M91631j66771
3723.4A09573845l10265M7394l8902m2030l87429l7643N27397K32529N38986K47017
3733.1A10350899r9968k89444j008072J06651L85048J89514r773k0142k395l08365
3742.7A09293953k33551J775040Q0497j020912m10873p20604o66947J320900L85170
$$ plain form
3673.3 108331413 108277870 109758835 110340179 109142464 108660477 108593750 108572426 108529823 108680336 108740814
3682.9 108740814 108517319 108464775 108570778 108645805 109196785 110069511 109309853 108999031 109180984 108857124
3692.6 108857124 108771988 108873482 109060410 109122108 108686012 108554504 108721909 108734467 108830360 109153999
3702.2 109153999 109140961 108818047 108645775 108660393 108671707 108590263 108588486 109192558 109328369 108982086 109010742
3712.8 109010742 109090515 109027405 109074394 109146927 109144653 109085770 108994637 109043304 109248985 109740616 109573845
3723.4 109573845 109263580 109310974 109272072 109230042 108842613 108804970 109332367 109564896 110103882 110350899
3733.1 110350899 110250931 109961487 108953415 109060066 109445114 109634628 109624855 109604713 109602318 109293953
3742.7 109293953 109060402 110835442 110915939 109895027 109484154 108763550 108096603 109417503 109802673
3751.4A09802673L17139J06583n48249m19456k08367j28074L74420N68687l448n08850
3761A09353058l46848j65764o2591M25453O47423l96988j89423K31369K51267j87645
3770.7A09559311l09509n1255K2370L2867L4645J05828L0830j52374j69007n3817L921
3781.3A09053810l0876J00029J12755J36299J57928n1063k38083j83113J19888P7866
3790.9A09255440k3987k1912j33522p4302K9228L16093J84220j3420J2138J02287O64437
3801.5A10296700r2591n14366l81767j53N70564J79749n11482q3618l6377j76598r7877
3812.2A09152184j13991p7187K46147M57756K66602j74614j83823J81000L85758m11698
3821.8A09728134l79303L1731j7838k1377M91707K23518n74966k83547K57202J69380
$$ plain form
3751.4 109802673 110119812 110226395 109678146 109258690 109050323 108922249 109296669 109865356 109861908 109353058
3761 109353058 109006210 108840446 108777855 109203308 109850731 109453743 109264320 109495689 109746956 109559311
3770.7 109559311 109249802 109198547 109220917 109253784 109288429 109394257 109425087 109272713 109103706 109049889 109053810
3781.3 109053810 109022934 109122963 109235718 109372017 109529945 109478882 109240799 109057686 109177574 109255440
3790.9 109255440 109231453 109209541 109076019 109001717 109030945 109347038 109531258 109517838 109529976 109632263 110296700
3801.5 110296700 110204109 109689743 109307976 109307823 109878387 110058136 109546654 109463036 109426659 109250061 109152184
3812.2 109152184 109038193 108961006 109207153 109664909 109931511 109756897 109573074 109754074 110139832 109728134
3821.8 109728134 109348831 109380562 109362724 109341347 109833054 110056572 109481606 109198059 109455261 109624641
3831.4A09624641j76910J73256L37875k2133m62349j8310R19273l05938n21866J37123
3841.1A09684662j06697J7319Q46l69445j3962P0350J2413O943Q6205K02881J10923
3851.7A09702438N7824R6969O84494m02801n71816k07306o3026k63046k32796J01822
3861.3A08902756M56642o1333N8701Q89610m27864q83331j68419N79658J235894m5235
3871A10537079q36319o03363m0131J97464K0584Q2817k8305p2853l7346K45263L646
3881.6A09468536k88620K26815N1201n36133J52313N1208l24142K1332M72351P31079
3891.2A10025940j9013m54902j3115p4738l90426J55128L09586o0036J16875j92353
3900.9A09402946k23831j17004j03874K81532K46674K8076l62183l39584O9221J47438
$$ plain form
3831.4 109624641 109447731 109620987 109958862 109936729 109474380 109456070 110375343 110069405 109547539 109684662
3841.1 109684662 109577965 109595284 109596130 109226685 109212723 109283073 109295486 109302429 109388634 109591515 109702438
3851.7 109702438 109760262 109857231 110541725 110138924 109567108 109359802 109296776 109033730 108800934 108902756
3861.3 108902756 109359398 109298065 109356766 110246376 109818512 108935181 108766762 109346420 110582314 110537079
3871 110537079 109700760 109097397 109057266 109254730 109275314 109358131 109329826 109256973 109219627 109464890 109468536
3881.6 109468536 109179916 109406731 109457932 108921799 109074112 109125320 108801178 108822510 109294861 110025940
3891.2 110025940 110006927 109552025 109538910 109464172 109073746 109228874 109538460 109478424 109595299 109402946
3900.9 109402946 109179115 109062111 108958237 109239769 109486443 109514519 109152336 108812752 108881973 109029411
3910.5A09029411j05453O10M45511r796m78241j11473L02521O1134l83545r9449K01584
3921.1A08852814j20201Q7661M29558p6126l49701K20825J22986j30150j8829M0047
3930.8A09058884o5651q0139J39717j42060P561N2498l67149N3695K61414K3102l6774
3941.4A08905098K22504N00991k04269m25384j93459p4890L3523P2686k930j07315
3951A08726555j60187o4293J11954j8547O8283K13417J47392r5405m96956p8606L38577
3961.6A08692184J01471j587m631q7753k83424j04439J01074j12610j01623j3771l4592
3972.2A08150299O5544J86974K62741J79260j5457j42502k34230J5389L69583K32315
3981.9A09069916k30324m16100j15799j4732J15036L24410J08146q8882j87103j80893
$$ plain form
3910.5 109029411 108923958 108924568 109370079 109360283 108882042 108770569 109073090 109134224 108750679 108651230 108852814
3921.1 108852814 108732613 108820274 109249832 109173706 108824005 109044830 109167816 109037666 109018837 109058884
3930.8 109058884 108993233 108913094 109052811 108910751 108918312 108970810 108603661 108657356 108918770 108941872 108905098
3941.4 108905098 109127602 109628593 109424324 108998940 108805481 108730591 108764114 108836800 108833870 108726555
3951 108726555 108566368 108502075 108614029 108595482 108663765 108877182 109024574 108929169 108432213 108353607 108692184
3961.6 108692184 108793655 108792068 108787437 108699684 108416260 108311821 108412895 108300285 108198662 108184891 108150299
3972.2 108150299 108215843 108402817 108665558 108844818 108829361 108686859 108452629 108468018 108837601 109069916
3981.9 109069916 108839592 108423492 108307693 108292961 108407997 108732407 108840553 108751671 108564568 108383675
3991.5A08383675k8603J41052o8847k67113l5233Q4282J23894k0485K59346
4000.2A08571968
$$ plain form
3991.5 108383675 108355072 108496124 108427277 108160164 108124931 108209213 108333107 108312622 108571968
4000.2 108571968
##END=$$ End of the data block
