##TITLE=$$ Begin of the data block
##JCAMP-DX=5.00 $$ ACD/SpecManager v 10.08
##SPECTROMETER/DATA SYSTEM=Varian
##DATE=19 Mar 2013 14:10:12
##DATA TYPE=INFRARED SPECTRUM
##DATA CLASS=XYDATA
##ORIGIN=
##OWNER=
##NPOINTS=3735
##FIRSTX=399.26403809
##LASTX=4000.35498047
##MAXX=4000.35498047
##MINX=399.26403809
##MAXY=228.47265625
##MINY=0.00000100
##XFACTOR=1.0000000000
##YFACTOR=0.000001000000000
##FIRSTY=0.00000100
##DELTAX=0.96440572
##XUNITS=1/CM
##YUNITS=TRANSMITTANCE
##XYDATA=(X++(Y..Y))
399.3 1 1 1 1 1 1 1 1 1 1 1 1 114613914 1 9270331 9270331 9270331 9270331 9270331 9270331 1 1 1 113299110 228472656 73551598
423.4 73551598 1 1 1 95603806 95603806 1 1 1 1 107918457 3262344 7789448 7789448 4444851
436.9 4444851 20748510 114161705 114161705 114161705 78967178 2561118 2561118 2561118 2561118 2561118 2561118 2561118 2561118 1 1 1 1 1 1 1 1 1 228116776 87426666
460 87426666 126337677 52526749 27433571 37352848 37219219 46358948 73867744 136170517
467.7 136170517 168141891 78678528 84058937 106241913 129163132 122404182 109456711 127701530
475.5 127701530 113136337 87458900 67765236 87018112 145276154 123305511 128875320 101666313
483.2 101666313 46306469 57813046 91637970 103320374 114464706 127969986 118211304 117995354
490.9 117995354 131248047 147312073 126116714 91863358 101414841 122546265 96672134 87801529
498.6 87801529 105563896 107446304 102899254 110276619 109176506 102139877 96986534 96451057 109561005
507.3 109561005 117021057 118398117 113756477 100281189 111591164 121876854 102690399 100664413
515 100664413 104589592 99442123 102842606 108896378 102386948 97219872 97282745 95335426 95968781
523.7 95968781 99700432 106761734 104049080 96106384 94870216 100069283 103615540 100994934 106906258
532.4 106906258 107384117 98961456 98143250 97432472 99377739 105732681 105628807 99309723 98711029
541 98711029 101246902 101133095 101713852 99726471 103352257 106427315 99585022 97160645 101328827
549.7 101328827 105319572 101978203 95436317 95369820 98725410 98325699 99032074 100189568 99411781
558.4 99411781 100699570 100872040 100443405 102456573 105968185 102836288 97881348 101673737 103046074
567.1 103046074 101554192 100491066 99252075 101688919 101395508 100928490 100362694 98406281 97912125
575.8 97912125 97985374 100735352 101991676 101423347 101048653 99549294 99682785 98643669 98670387 100351891
585.4 100351891 98362701 96943062 96070663 95280075 95826759 96032433 98753433 101881516 102943665
594.1 102943665 101538567 99082542 97712791 98239883 100873634 100626534 100154312 100418129 99242218
602.8 99242218 99528702 99776215 101392487 102721748 101046700 98881424 97672607 96735901 97474464
611.4 97474464 102131134 102925980 99992546 99812752 99712158 99951187 102082680 103603455 103820900
620.1 103820900 104461853 103139015 100908989 99549942 98004677 98772263 100346512 100496536 100248154
628.8 100248154 100054482 100132683 101652298 101423553 100013100 101471832 101353485 102294197 102549568
637.5 102549568 99424438 99301468 99759766 100167252 100092041 99632309 101160789 101397499 98899109
646.2 98899109 98176094 101506142 103445992 103208450 102472015 103351097 104725166 101363777 100139381
654.8 100139381 101564384 101171005 102028679 103160446 102316299 101091301 99390755 97964119 97924271
663.5 97924271 97979561 99560570 100038651 98639023 102103165 99065536 96158302 96247101 98966225
672.2 98966225 99571434 98464577 97848770 96260620 96554474 95651253 94649452 95414421 94795105
680.9 94795105 93758919 92675720 93611046 94861275 95155869 95894455 96384010 95488503 93843796
689.6 93843796 94933182 95159866 94085403 94257286 93214211 92254074 92636383 93468277 93916321
698.2 93916321 93582344 92900253 92496101 91537529 91109093 92124397 92129654 91659538 90746567 89765320
707.9 89765320 89910583 91164101 92110992 90785721 90330780 91228165 91114738 89372894 87249290
716.6 87249290 86630173 86251518 86327011 86346359 85404442 84362373 83176865 83717239 85554810 86766212
726.2 86766212 87676819 87110710 86147705 86653831 86156296 85692719 88646751 92236366 92135414 90801468
735.8 90801468 90754700 91234665 92839027 94234474 94077713 93698654 93782486 94206146 95298721 96944420
745.5 96944420 97275253 96837090 96213089 97345253 99877228 99230560 99197762 100177742 99625214 99905197
755.1 99905197 99411240 99214569 100052849 98732384 97576256 99174835 100349495 100743050 100719315
763.8 100719315 98899399 98798157 99547562 99135078 100036995 101218201 101504173 101503075 100291687 99564781
773.5 99564781 101486092 102284500 102154633 102909149 102492714 102407280 102303215 101436470 100348145 100577347
783.1 100577347 101993622 101910095 101743233 102293350 103023643 102193314 101891914 103240334 101865936
791.8 101865936 101264099 102218910 102988617 104367378 103943489 102812149 102280151 102997177 103709198
800.5 103709198 102116051 101606621 102766090 103159439 102512230 101351601 102519356 104880493 103742989
809.1 103742989 102520477 103310074 102537399 102125847 102953186 102675957 102225052 102237877 103362976 104738281
818.8 104738281 104417206 103307304 101750694 101410950 102707344 103462967 103077332 101991959 101887161
827.5 101887161 102090210 101927940 101612358 101769226 102948914 102536461 101131546 100391144 100305458 99694305
837.1 99694305 99280525 100882439 101214973 100874962 101175270 101424843 101154831 99998238 100197746 99959877
846.8 99959877 99341110 99810829 99600410 99316818 100254944 100366882 98385063 97937721 98487045 98983467
856.4 98983467 99910995 99901009 99782890 99078659 98537926 98687729 98795906 99149597 100038170 101606667
866 101606667 101775551 100532524 99509476 99118134 99206520 99215698 99668823 101290222 102058624 100901451
875.7 100901451 100640205 100583084 99835274 99669121 100173843 101078140 101056755 100711098 101062737 101673553
885.3 101673553 101120766 100831009 102035828 102222054 101791328 100927795 100216537 100283897 100124405 100174271
895 100174271 100421791 101166687 101944649 102079239 101253929 100521500 100707466 101404709 102035126 100993950
904.6 100993950 100098709 99755264 99338707 99549812 99489555 99691734 99804794 99440697 98708534 97774277
914.3 97774277 96840569 97092224 98673935 98362488 97604263 97797478 98011238 98551933 98640358 98483574
923.9 98483574 98906746 99339966 98634933 98134216 98629364 99580658 99855209 98734360 99085770 100061317
933.6 100061317 99616692 99283920 99374931 99596817 99609535 99079300 98279549 98082275 98615715 99191223
943.2 99191223 98955315 98678177 99068420 99039665 99020882 98522438 97973778 98445145 98321793 97951279
952.8 97951279 98415817 98839348 98299255 97665199 98337128 99599571 99217453 98061951 98286118 98482765
962.5 98482765 97920898 97356033 97091118 97470596 97867172 97795197 97785950 97565231 97386147 97946228
972.1 97946228 97336418 96587616 96429863 95215981 95159874 96166672 96963623 97106438 96401085 96211716
981.8 96211716 95805573 95181793 95403008 95503891 95000290 95159134 95348282 95247772 95569710 95432259
991.4 95432259 95387268 95604309 96293587 96929077 96283508 95584534 95630592 95881378 95569618 95690987
1001.1 95690987 95888031 96148537 96761375 95980286 95590279 95536774 95405289 95467201 94079208 93336594
1010.7 93336594 93724861 93757080 93814667 93784912 92944374 91839500 91350449 91318657 91560043 91037148
1020.3 91037148 90063095 89772919 89444664 88453590 87560417 87388138 87106255 86427612 85971207 85510353
1030 85510353 84533195 84056656 83826515 83086090 82657654 82562195 82621391 82535622 82650597 82005409 81518341
1040.6 81518341 82591095 83211937 83566444 83177826 83012634 83717117 83655968 83654182 83472160 83402115
1050.2 83402115 83793877 84456070 84690376 84647255 84925453 84491165 84852402 85793129 86073235 85965202
1059.9 85965202 85718933 86153053 86637428 86858780 87010483 87304687 87787323 88447670 89008247 88637512
1069.5 88637512 88414215 89006027 88667839 87550545 88028908 89155609 89203529 88894157 88291786 86993652
1079.2 86993652 85969864 86363510 86285866 85282692 84655663 83999619 83678444 83514404 83119408 82702187
1088.8 82702187 82492401 81524704 80011574 79371490 79031082 78789841 78572243 78707779 78889824 78705574
1098.5 78705574 78529991 79125389 80112099 80121643 80864532 81271469 80868820 81211166 81243637 81797569
1108.1 81797569 82716835 82755478 82016663 81524055 81767067 81894470 81069115 79635208 79358521 79673569
1117.7 79673569 79545509 79299263 79517044 80128250 80477249 81241394 82391136 82924965 82702034 83109245
1127.4 83109245 83420189 83032562 82616905 81969315 82260681 82506554 81943077 80798294 79470406
1136.1 79470406 79091225 78506813 77610062 76753220 76442375 76390083 76189980 75868141 75088058 74866982
1145.7 74866982 74391609 73732658 73047707 72451454 71630455 69752747 68625580 67657722 66956444
1154.4 66956444 66429214 65678864 65151108 63965141 62939648 62091297 61668377 61040421 60269012
1163.1 60269012 60004036 59783199 59966656 59956486 59996212 59523693 59255836 59238586 58507526 58323448
1172.7 58323448 58388145 58255337 57994274 58116699 58172161 58648270 58832405 58376595 59345383 59983746
1182.4 59983746 60233154 59977051 59746998 60860523 61576645 62120762 62744579 63476562 64215836 65283958
1192 65283958 66102211 66212936 66647614 67178604 67996124 68525482 69125397 69656517 70307625 71735695
1201.6 71735695 72399086 72738701 73064018 73548454 74189186 74542099 74592949 74661087 75174049 75197235
1211.3 75197235 75696510 76279495 76220650 76639420 76949539 77009827 76937187 77106392 77385803 77395607 77569633
1221.9 77569633 77840836 77691849 77309761 77294914 77102341 76793129 76546539 76424393 76353760 76215202
1231.5 76215202 75932053 75112381 74844025 74799728 74737122 74545639 73802834 73535950 73337532 73164551
1241.2 73164551 73160622 73414162 73472725 73352402 73677139 73940567 74300812 74351517 74758545 75401108
1250.8 75401108 76057213 77005516 77309959 77645370 77873085 77910645 77920898 78073463 78334732 78384628
1260.5 78384628 78771202 78961777 79419235 79621933 79602097 80176689 80371605 80278084 80116592 80387024
1270.1 80387024 80778976 81070526 81018539 80477051 80624092 81022263 81079193 80643013 80598984 81253578
1279.8 81253578 81928589 82770699 83219795 83438614 83732506 84209229 84848289 85249001 85390289 85605858
1289.4 85605858 85824951 85734413 86001656 86178299 85865318 85757858 85760513 85592934 85239159 84860466
1299 84860466 84526611 84654526 84835136 84916672 85248032 85605316 86052635 86150085 86395554 86670441
1308.7 86670441 86707977 87034897 87174377 87096313 87098328 87288849 87243614 87119316 87046120 86901329 87008240
1319.3 87008240 87080345 87311668 87463905 87629028 87926270 88298141 88854187 88992844 89333923 89974319
1328.9 89974319 90163872 90146698 90240181 90231346 90133316 90137512 89980759 89806877 89736778 89871994 89724068
1339.6 89724068 89047653 88839630 88640587 88330040 87981171 87766029 87606812 87303528 87209923 86911079
1349.2 86911079 86783035 87130348 87469986 87563179 87793152 88247856 88504623 88763557 88824997 88733475
1358.8 88733475 88529167 88407997 88342094 87936378 87185997 86080780 85137001 84248581 83282776 82395195
1368.5 82395195 81788177 81305084 80669472 80330040 79877220 79635834 79477402 79035942 79055122 79152634
1378.1 79152634 79910004 80956764 82381485 84184525 85598679 86448166 87062912 87771431 88472359
1386.8 88472359 89072647 88887466 88953667 89265800 89237038 89345406 89562897 89887459 89968452 89719330
1396.4 89719330 89576447 89874771 90005188 90149429 90987564 91541458 92066994 92705460 93131882 93340668
1406.1 93340668 93647949 93899719 93559845 93390579 93231102 92624237 91790375 91142708 90596237 89982109
1415.7 89982109 89568756 89213737 89252602 89697510 89574745 89541115 89554642 89931190 90429443 90543739
1425.4 90543739 90637817 90588074 90135643 89573288 88901047 88404205 88276665 87514999 86535103 86189064
1435 86189064 86270416 85629242 84265221 83546684 82826950 82609070 82118614 81559708 81296562 80699379
1444.7 80699379 80227638 79931267 80113358 79396835 78832092 78399078 77281502 76327667 74990791
1453.3 74990791 74070610 72430946 71080292 71078514 70091263 70669510 69957809 69861794 69180176 68773819
1463 68773819 68499222 67567520 68087425 67820580 69382278 71743942 75902824 79905495 83415459
1471.7 83415459 89189560 91848541 94040619 94894913 96178398 96720390 97086334 97998131 98514526
1480.3 98514526 99522331 99987991 100827309 101493599 101781578 102471184 103151619 103627731 103331902 104244751
1490 104244751 104182526 104037964 104206291 103967407 104661049 105785080 106272827 105163628 104876152 105289635
1499.6 105289635 105127258 105092064 104775002 105126221 105719063 106262413 106273621 107142265 107116730 105945793
1509.3 105945793 106100578 105874207 106069817 106429573 106033821 106045029 106644760 107938911 107266220 106987854
1518.9 106987854 107288109 108511620 108782440 106624962 106431175 106440254 106932289 106995033 106680527 106874580
1528.6 106874580 107030518 107077682 106912903 107064796 107127861 107268066 107353813 107376648 107770432 108075699
1538.2 108075699 109282852 109763008 109240753 108971039 107912292 107355179 107061470 106767380 106595169
1546.9 106595169 106780869 107007271 107269394 107084160 106929863 107217064 107686668 108275818 107803879 107980766
1556.5 107980766 109081581 109924339 106646080 106599716 107309364 107055664 106926979 106708786 106990356
1565.2 106990356 107281815 107065468 107445602 108082237 108484055 107652107 107115623 106964386 106964661 107329834
1574.9 107329834 107971405 108596016 107912514 107563957 107247948 107022186 107111755 107148727 107083611 106784286
1584.5 106784286 106901772 107086853 107195511 107305573 107126251 107243217 107094154 106699776 106484467 106478981
1594.1 106478981 106593575 106920525 107164879 106859703 106750595 106627251 106684662 106860970 106773232 106645645
1603.8 106645645 106566917 106713348 106679916 106828735 107029823 107284325 107251335 106863716 106570267 106137772
1613.4 106137772 106320396 106581978 106641243 106233589 105992355 106232132 106126480 106178200 106143639 106288506
1623.1 106288506 106365753 105891815 105838425 105803818 106234795 106121635 105854164 105829460 105739449 105687653 105693909
1633.7 105693909 106467430 107168846 106434372 105925346 105570618 105409355 104897697 104494614 104065857 104177757
1643.3 104177757 104345009 104356400 104680588 104557587 104583237 103808327 103393890 103294563 103584854 104235504
1653 104235504 103785042 103641823 102953766 102859314 102821312 102899666 103104485 103253326 103499084 103776787
1662.6 103776787 104045685 103786880 103742844 103591423 103506538 103817772 103946220 104436523 104358398 103888474
1672.3 103888474 103563034 103569427 103442375 102849533 102813896 102691010 102964058 103014496 102768066 102557541
1681.9 102557541 102243568 102778702 102624924 101454666 100888504 100825325 100502289 100098915 99701027 98790199
1691.5 98790199 98093735 97589096 97624832 97738365 96762817 95533676 94656464 94493294 94153831 91916153
1701.2 91916153 90908821 90306068 89427605 88124207 86896660 84927170 83500656 82462944 81341057
1709.9 81341057 79715607 78241402 77238678 76130005 74842163 73471588 72299164 71038200
1717.6 71038200 69773766 69013962 68015732 67023529 66251892 65379715 64214699 62902546 61501774
1726.3 61501774 59768452 57838448 56102844 53195713 49956211 47651237 45545662 42605591
1734 42605591 36933239 35151833 33060173 31437620 30175209 29436211 28645464 28164183 28967524
1742.7 28967524 29591707 31571213 32774475 34803173 37090820 39910954 44165535 46203960 50605064
1751.3 50605064 54873016 58593689 62390678 66302101 70290138 74539238 78655518 81158745
1759 81158745 83859268 86160034 89387268 91585724 92507820 93998512 95102165 96223793 96964478
1767.7 96964478 98049599 98798859 99129036 100037621 101092232 101531715 101401306 101758713 102096855
1776.4 102096855 102360855 102571030 102842224 103358086 103304329 103536362 103738670 104081245 104398567 104313896
1786 104313896 104300880 104263809 104528526 104731300 104984070 105050865 105489883 105592705 105193069 105443672
1795.7 105443672 105606705 105732033 105943626 106000351 105951859 105941566 106298248 106246277 106162010 106367966
1805.3 106367966 106582359 106629814 106576309 106537956 106574188 106973511 106957321 106841095 106892273 106784470 106740288
1815.9 106740288 106926086 107249237 107278297 107095085 107006134 107134010 107199348 107378960 107930832 107741058
1825.6 107741058 107079224 107127518 107586510 107699928 107466965 107499374 107419273 107437508 107530411 107564705 107472908
1836.2 107472908 107414688 107598000 107731239 107588570 107364410 107491753 107776253 108291534 108417816 107991531
1845.8 107991531 108067787 108229141 108039513 107781212 107806137 107931129 107895828 107960953 108052612 107892860
1855.5 107892860 107715118 107840187 108000801 108097221 108146416 108031883 107969627 108010460 107906281 107767487
1865.1 107767487 107978111 108110420 108058037 108349457 108281364 108031548 107865463 107727455 107827347 107951599
1874.8 107951599 107966873 107968529 107871780 107790802 107712730 107630890 107879219 108104256 107950226 107798134 107797791
1885.4 107797791 107812820 107805389 107836372 108006966 108097816 107925568 107948822 108081566 108102058 108241150 108210648
1896 108210648 108019135 108034126 108094711 107935280 107784050 107831741 107948097 108106895 108196609 108221008 108170555
1906.6 108170555 108102470 108172821 108297493 108221291 107886086 107872780 108117554 108179588 108087051 107974594 107978813
1917.2 107978813 107978897 107987274 108039009 108171242 108378662 108436462 108155411 107855820 107857307 107941986 108044952
1927.8 108044952 108185478 108198746 108056801 107829948 107888206 108147385 108192177 107933800 107845810 107989700
1937.5 107989700 107942749 107943970 107992310 108038910 108133202 108115593 107977844 107917267 108124756 108155876 108048431
1948.1 108048431 108068481 108049576 108010017 108051460 108106300 108035698 107838173 107677155 107909561 108158470 108050110
1958.7 108050110 107964615 107907387 107964226 108198608 108257904 108216049 108334778 108377197 108394211 108277061 107823257
1969.3 107823257 107631477 107732727 108067612 108495636 108464485 108270966 108221115 108217522 108124413 108027344 107984207
1979.9 107984207 107900467 107899323 108142441 108386154 108279991 108136513 108084824 108178520 108272926 108062553 107939362
1990.5 107939362 107926804 107855385 107713287 107752151 107920113 107925262 107982643 108093521 108156448 108148582 108101227
2001.1 108101227 107971069 108005165 108151573 108047638 108059608 108019493 107866608 107901436 108086166 108253998
2010.7 108253998 108235847 108168747 108058578 108056290 108026451 108025414 108125008 108043526 107948608 107746246 107777672
2021.3 107777672 107975998 108067894 108186996 108115845 108050552 108050240 108039810 107901184 107813416 107792732 107632317
2032 107632317 107738441 107863472 107783066 107642273 107713943 108006012 108008217 107972305 108130661 108171745 107926231
2042.6 107926231 107801094 107811966 107764648 107896797 108020569 108110870 108185677 108223579 108168785 107914360 107771019
2053.2 107771019 107783165 107871506 107925491 108038132 108191910 108070007 107958488 107997284 108137634 108303879
2062.8 108303879 108259171 108268074 108242630 108059120 108139145 108101074 108009483 108257324 108199112 108060982 108158493
2073.4 108158493 108055077 107982819 108107399 108255730 108433365 108489655 108412216 108502747 108484673 108214485
2083.1 108214485 108005539 107795593 107900581 108251343 108157852 108089478 108370270 108390434 108240471 108174652
2092.7 108174652 108168442 108096848 107987862 108192619 108287178 108219398 108330437 108376930 108494781 108654152 108646744
2103.3 108646744 108619850 108699249 108690681 108594696 108464073 108268066 108303780 108348495 108425888 108630363 108690193
2113.9 108690193 108594574 108341927 108298134 108449638 108647079 108784294 108716003 108638901 108659470 108856911
2123.6 108856911 108930237 108892303 108773323 108509773 108427933 108528931 108689804 108616997 108548958 108637871 108566780
2134.2 108566780 108456024 108383438 108431694 108580910 108872345 109156212 109125343 108957527 108841095 108732727
2143.8 108732727 108714211 108733894 108557259 108692810 108936760 108742447 108604858 108600784 108626244 108551369 108413498
2154.4 108413498 108460236 108700600 108877579 108730644 108628159 108701401 108882378 108991264 108851974 108673187
2164.1 108673187 108635872 108794479 108821159 108660522 108504311 108650513 108984383 108963615 108901871 108893501 108719742
2174.7 108719742 108621605 108618736 108588829 108706078 108777679 108642975 108738861 108887909 108839081 108763222 108818687
2185.3 108818687 108949425 108889839 108767776 108774971 108818054 108770988 108898270 109092514 109105423 109083252 108890625
2195.9 108890625 108829300 109076973 109244682 109153069 109065468 109124908 109128685 109002548 108825699 108989487 109140259
2206.5 109140259 109063232 109100418 109066109 108985527 108826332 108838921 108931534 108837433 108774895 108765541 109021202
2217.1 109021202 109187813 109065407 108990074 108946846 108895027 108928871 108994026 109008827 109169701 109102173 109026375
2227.7 109026375 109288437 109296448 109151924 108977890 108774239 108728302 108860596 108928993 108842033 108902336 109088570
2238.3 109088570 109168747 109051704 109071587 109042946 108862679 108934296 109004959 108940598 108768890 108842163 109056145
2248.9 109056145 108968658 108891022 108886818 108981796 109030434 109011284 109080063 109046013 108922592 108872292 109026398
2259.5 109026398 109065109 108946968 109044662 109191635 109184158 109134956 109134041 109139603 109089813 109023148 109095703 109063911
2271.1 109063911 108966263 109097801 109138885 109113953 109083557 108992973 108960831 108934532 108986946 109045830 108970413
2281.7 108970413 108891472 109023560 109150215 108936615 108723984 108772118 108853760 108922012 108981529 108948746 108986069
2292.3 108986069 108996307 108850807 108844009 108843491 108831261 108849297 108689003 108804810 109021172 108904137 108870270
2302.9 108870270 108909851 109114952 109284683 108994102 108793282 108974884 109159294 108963333 108774529 108869431
2312.6 108869431 108968536 109072685 108946152 108687843 108574799 108870911 109345901 109362206 109212616 108981003
2322.2 108981003 108983109 109393845 109432472 109067902 109043182 109130241 108756264 108407082 108614548 109188637
2331.9 109188637 108879242 108421188 108768890 108730385 108609711 109018265 109424973 109151634 109175491 109392685
2341.5 109392685 108984421 109096573 109237831 109340576 109189972 108828568 108739548 108758858 109037514 109221596
2351.2 109221596 109333237 109076706 108790970 108851677 108894432 109689438 109776253 109313271 108769127 109411919
2360.8 109411919 110255424 109233025 109062218 109225220 109735748 109871292 109357094 108861832 108054535
2369.5 108054535 108136528 108121910 108386002 109067955 109046700 108966843 109122147 109174660 109085022 109099869 108890602
2380.1 108890602 108807243 108865051 108714371 108769493 108859032 109006775 109061180 108887527 108818184 108765709 108722733
2390.7 108722733 108803513 108851707 108731148 108773705 108851418 108881454 108873550 108803223 109036011 109088997 108936897
2401.3 108936897 108805702 108639481 108583000 108558258 108734985 108787392 108660866 108653328 108748817 108948647 109045273
2411.9 109045273 109027840 108912796 108858040 108863892 108800652 108746017 108681213 108693031 108716675 108730125 108738052 108710083
2423.5 108710083 108775314 108849915 108731926 108576866 108657951 108763817 108723244 108728134 108847923 109004120 109019806
2434.1 109019806 108771584 108695381 108920128 108947456 108842216 108837357 108888115 108849785 108839706 108868477 108770370
2444.7 108770370 108734932 108729439 108816772 108818367 108723969 108742142 108694115 108710213 108667519 108677544 108744835 108815292
2456.3 108815292 108895447 108807159 108830673 108567131 108376396 108579681 108553749 108583473 108742424 108865906
2465.9 108865906 108832664 108766098 108731255 108701691 108747612 108598701 108560295 108619286 108547379 108567024 108654556
2476.5 108654556 108554344 108382530 108472717 108532997 108556976 108592255 108624786 108707893 108698769 108722343 108608414
2487.1 108608414 108525673 108648506 108776115 108750534 108650436 108863884 108817207 108413269 108337608 108361038
2496.8 108361038 108286118 108301628 108472748 108679924 108637581 108410973 108402382 108474174 108415710 108421936 108404655
2507.4 108404655 108300827 108410370 108561401 108456108 108434723 108440254 108327942 108247704 108253799 108395370 108393410
2518 108393410 108366776 108397682 108292007 108246750 108308968 108375992 108375389 108323944 108289589 108458870 108563202 108301651
2529.6 108301651 108147842 108217377 108260605 108209686 108293716 108440941 108290115 108164062 108310822 108397316
2539.2 108397316 108171501 107948883 108070152 108245857 108119331 108025215 108216011 108295593 108129150 107953285
2548.9 107953285 108019890 108219925 108274460 108108360 107996902 108119980 108142815 108082245 107934624 107887947
2558.5 107887947 108029297 108073608 108183441 108183601 108031418 107868538 107872337 107999321 108027351 108056450 107912239
2569.1 107912239 107845619 107826645 107817619 107936813 107942383 108006119 107968224 107889717 107799744 107796562 107957420 107934059
2580.7 107934059 107969040 107864616 107699692 107838165 107977959 107903786 107741783 107703659 107637894 107567566
2590.3 107567566 107605530 107750061 107744446 107599693 107618729 107584381 107574135 107635483 107718102 107628067 107405922
2600.9 107405922 107576767 107758095 107667374 107606171 107647835 107717903 107683670 107498459 107375908 107421356 107492058
2611.5 107492058 107471535 107256882 107265854 107423386 107328728 107246124 107290611 107507393 107562317 107360954 107278542
2622.1 107278542 107342651 107312859 107180717 107229538 107222504 107186859 107120148 106909302 106969902 107144890 107101807
2632.8 107101807 106905029 106869499 107035255 107084923 107008209 106964920 106926186 106893845 106867676 106762596 106786842
2643.4 106786842 106797592 106761467 106747810 106765648 107096031 107083351 106650536 106526062 106720604 106800385 106647362
2654 106647362 106644867 106704697 106750229 106640984 106495789 106469604 106413689 106552269 106409248 106192520 106349701
2664.6 106349701 106406799 106378624 106345184 106295097 106226387 106247658 106218079 106057243 106063171 106115585 106101486
2675.2 106101486 106108765 106192703 106267601 106299904 106202095 106131401 106249596 106286110 106381676 106329773 106048271
2685.8 106048271 106055122 106298134 106402573 106400726 106584076 106606483 106324684 106231735 106448425 106544937 106468163
2696.4 106468163 106590019 106517464 106320595 106472130 106634964 106539551 106359886 106483383 106757599 106735039
2706 106735039 106440964 106175278 106231880 106343742 106185066 106085724 106118225 106127579 106239441 106281647 106161720
2716.6 106161720 106129707 106208511 106135338 105974037 105975563 106006020 106036522 106027382 106056137 106156212 105994057
2727.3 105994057 105699272 105687172 105838577 105673363 105591270 105853767 105950081 105894150 105860680 105908897 105872696
2737.9 105872696 105830101 105775375 105630241 105776123 105946243 106049545 106166321 106071518 105941772 105897736
2747.5 105897736 105783463 105710655 105903793 105900826 105689369 105658798 105741440 105848030 105833931 105774124 105682816
2758.1 105682816 105681786 105697372 105660690 105843941 105861420 105723549 105733521 105685417 105489998 105295197 105280167
2768.7 105280167 105358742 105304520 105142784 105230904 105401360 105298126 105104088 104933388 104791382 104661087
2778.4 104661087 104603210 104637703 104575752 104321632 104159187 104192703 104197495 104185951 104029282 103864372 103781662
2789 103781662 103561127 103407455 103338562 103295341 103150536 102931870 102947182 102862297 102645355 102655426 102563332
2799.6 102563332 102159851 101790970 101726006 101794418 101566490 101159363 100998749 100959831 100792793 100454582
2809.2 100454582 99868027 99385986 99249680 98878113 98383354 98159538 97912025 97593948 97172775 96793159
2818.9 96793159 96457634 95875977 95297729 94894485 94421753 93636848 92780899 92002930 91213608 90442123
2828.5 90442123 89475143 88459404 87505547 86403770 85102516 83744720 82642471 81393463 79714561
2837.2 79714561 77983032 76160995 74126717 71724663 68822708 65474266 61819237 58103897
2844.9 58103897 54236305 50163528 46106003 42355072 38895550 35785767 33312340 31330580
2852.6 31330580 29910908 29268047 29561745 30463820 31574165 33122025 35204453 37535072 40000305
2861.3 40000305 42683441 45325172 47904285 50203194 51853119 53237434 54472187 55099731 55319981
2870 55319981 55726116 56358994 57155842 58115883 59261280 60570095 61871269 63079411 63987816
2878.7 63987816 64544922 64968109 65244980 65198883 65045837 64706619 64040947 63356487 62524284 61670383
2888.3 61670383 60724533 59525932 58574940 57676899 56550655 55308590 54101536 52964653 51825531
2897 51825531 50758938 49551521 48281921 47052677 45837746 44604073 43150425 41751572 40507477
2905.7 40507477 39184563 37737129 36325489 34790268 33051205 31293562 29620821 28161032
2913.4 28161032 26475378 24698746 22957830 21339363 20133354 18769583 17532024 16508272
2921.1 16508272 15698509 15085259 14505480 14297153 14147452 14261995 14476608 14728777 15190616 15693205
2930.7 15693205 16418859 17157866 18247465 19596601 20852716 22209995 23821106 25574661 27178398
2939.4 27178398 28902079 30745476 32590065 34230774 35733829 37367828 38737621 39849903
2947.1 39849903 40617088 40996948 41272781 41441845 41441776 41255871 41197098 41153599 41174450 41595398 42124538
2957.7 42124538 42812359 43912582 45105473 46336361 47955917 49708683 51559582 53781963 55980549
2966.4 55980549 58153057 60525536 62648235 64478973 66224953 67861244 69441223 70821297
2974.1 70821297 71987480 73143906 74255470 75254837 76240128 77098495 77881241 78801285 79670815
2982.8 79670815 80450577 81282494 82154999 82891060 83487358 84059410 84528763 84975731 85372292 85655846
2992.5 85655846 85761765 85597404 85425972 85171265 84503998 83629105 82796021 81976158 81071564 79986252
3002.1 79986252 78845558 77742111 76694168 75844200 75239761 74815331 74520599 74654892 75539398
3010.8 75539398 76678848 77708900 79005417 80702454 82615036 84552689 86351990 88040672
3018.5 88040672 89712799 91207077 92607391 94039200 95317917 96308167 97151100 98005287 98576736
3027.2 98576736 99044174 99629250 100228752 100963425 101466690 101638939 101717743 101777328 102167007 102692299
3036.8 102692299 102942719 103063751 103209923 103447823 103613754 103661110 103833298 103907509 103958557 104164688
3046.5 104164688 104183678 104086998 104149345 104368233 104477539 104506935 104709526 104827049 104844109 104886940 104763657
3057.1 104763657 104568489 104483658 104677666 104955322 104878746 104799690 104960884 105084122 105093918 104983040
3066.7 104983040 104892235 104894417 104966682 105079338 105178749 105376305 105487625 105383720 105390129 105538368 105594597
3077.3 105594597 105658096 105685013 105664497 105860321 105940056 105855232 105993080 106129974 106055840 105918892 105921249
3087.9 105921249 106029205 106019279 105993576 106080360 106124977 106128883 106160103 106311424 106461113 106335190 106204399
3098.5 106204399 106378250 106704987 106603180 106298691 106347008 106419106 106426575 106201859 105963631 106111465
3108.2 106111465 106278511 106340759 106245644 106123795 106142616 106279030 106318794 106342926 106684334 106797333
3117.8 106797333 106655952 106511452 106339371 106374176 106422905 106382805 106345802 106201317 106098709 106213905
3127.5 106213905 106335060 106480026 106405731 106054886 105952423 105888588 105967842 106242645 106330276 106103409
3137.1 106103409 105754234 105861435 106121643 106156357 106089867 106074478 106092773 106062943 106180923 106168800 106034782
3147.7 106034782 106001083 106011314 105902962 105846100 106043243 106008102 105890961 105796844 105730850 105783295 105875359
3158.3 105875359 106014420 105848656 105863808 105949959 105715050 105651199 105555954 105467506 105536987 105547028 105494644
3168.9 105494644 105449333 105308014 105247231 105332680 105313049 105365273 105252167 105200630 105504143 105644653 105543083
3179.5 105543083 105235435 105053757 105165977 105247910 105202187 105103111 104985847 104829811 104810455 104979401
3189.2 104979401 105241768 105327133 105090347 104855110 104864258 104873230 104641708 104397842 104245255 104327545 104560486
3199.8 104560486 104559586 104444618 104466110 104394066 104292732 104578819 104735283 104642052 104477493 104233734 104326569
3210.4 104326569 104277763 104053848 103982956 104001892 104197220 104295609 104271904 104122856 103966919 103934509 103904213
3221 103904213 103892792 103811630 103635818 103584602 103821465 103977737 103824638 103606194 103579147 103488602 103229507
3231.6 103229507 103338211 103488312 103513275 103460648 103162071 103160461 103293236 103204605 103087929 103050064 103164284
3242.2 103164284 103270065 103136925 102944328 102879326 102797569 102802353 102864609 102895065 102866943 102705978 102634315
3252.8 102634315 102705292 102763222 102677200 102569229 102369545 102131897 102214310 102259216 102133774 102095703 102177872
3263.4 102177872 102287933 102172630 102044701 102115479 102155243 102189873 102232689 102081146 101971046 101908775
3273.1 101908775 101605515 101468025 101649429 101713890 101571953 101392212 101264420 101362701 101519737 101453812
3282.7 101453812 101298088 101094780 100969177 101108253 101213600 101141647 101174850 101127556 100935806 100910851
3292.4 100910851 100907295 100820160 100631439 100556648 100587570 100493729 100516396 100492714 100393890 100471977 100637207
3303 100637207 100559105 100398781 100499084 100505302 100520378 100367683 100043869 100068993 100072067 100052231 100089653
3313.6 100089653 100001511 99859840 99809853 99754539 99706444 99826248 99587669 99314949 99438560 99474808
3323.2 99474808 99400726 99446579 99587471 99477005 99345917 99327293 99341232 99550949 99481270 99247406 99116707
3333.8 99116707 99006836 99068352 99121872 99059959 98877014 98868584 99007874 98880501 98891762 98967102 98846481
3344.4 98846481 98799835 98679695 98659973 98717094 98578751 98576408 98648643 98517380 98293823 98195824 98167854
3355.1 98167854 98117348 98111259 98244850 98433281 98177422 97976784 98196198 98112648 98007019 97966469 97791336
3365.7 97791336 97841927 97860405 97756828 97793793 97843338 97768463 97574814 97466141 97529510 97460182 97302834
3376.3 97302834 97279945 97284401 97235687 97225243 97299026 97490692 97787094 97588852 97122414 97151405 97044960
3386.9 97044960 96738358 96852516 97235970 97339096 97023170 96903168 97078621 97040649 96693436 96361687
3396.5 96361687 96504799 96984467 97173485 96995895 96737816 96514763 96460625 96456383 96453751 96526108 96514259
3407.1 96514259 96382614 96229958 96273155 96263268 96105461 96064110 95913933 95857315 96028214 96204025 96319038
3417.7 96319038 96223518 96172607 96145744 96027283 96111359 96158974 96146187 96078751 95866096 95904877 96023239
3428.3 96023239 96053268 96146973 96114479 95882538 95592323 95614853 95931015 95971703 95544319 95326416 95600143
3439 95600143 95759804 95836708 95889359 95865952 95797432 95558136 95463806 95511566 95476372 95406853 95453117 95445610
3450.5 95445610 95312668 95357262 95366913 95365082 95369156 95324860 95314316 95260780 95425652 95472427 95198936 95057838
3462.1 95057838 95281372 95580055 95434578 95264511 95363564 95501816 95619972 95630913 95736366 95760109
3471.7 95760109 95564629 95508835 95524834 95815300 96133156 95935661 95978302 96117653 95820099 95746666
3481.4 95746666 95860405 96035263 96188652 96206284 96235359 96213943 96330505 96220001 95948326 96095963
3491 96095963 96181885 96092560 96217560 96432907 96526421 96482750 96460075 96535500 96753807 96914467 96949387
3501.6 96949387 97202881 97191711 96851593 96919319 96996376 96983696 97144073 97321831 97479340 97502083 97397552
3512.2 97397552 97324692 97397766 97364586 97117203 97213478 97529129 97622391 97573036 97541435 97728081 97971382
3522.9 97971382 98148949 98308754 98385490 98522285 98462639 98305496 98409691 98537422 98633446 98659286
3532.5 98659286 98775612 98885345 98913071 99198082 99348427 99302292 99200928 99092590 99225845 99431305
3542.1 99431305 99699074 99906067 99981728 100101753 100330849 100515846 100372604 100398262 100811775 101126717
3551.8 101126717 101018982 100988304 101089111 101158936 101541489 101753105 101711128 101899185 102072350 102347038
3561.4 102347038 102578072 102436096 102296867 102499084 103117065 103838120 103818367 103701241 103899475 103652534
3571.1 103652534 103514740 103905769 104291893 104307281 103898926 103895157 104251717 104288475 104280167 104448013 104582382
3581.7 104582382 104820068 105263535 105456375 105531540 105753700 105998962 106151611 105878281 105765251 105969650
3591.3 105969650 106315941 106452034 106412186 106569389 106447151 106407524 106654991 106813339 106779388 106749817
3601 106749817 106962341 107059853 107024582 107098091 107204140 107367943 107767090 108149315 108034691 107652969
3610.6 107652969 107596153 107742599 107783432 107827003 108058685 108070152 108183479 108592133 108668564 108660141 108492844
3621.2 108492844 108188766 108033943 108057678 108318336 108641701 108922562 109343323 109678871 109246521 109147049
3630.9 109147049 109044876 109043633 109239586 108993225 108739876 108825020 108914543 109022331 109070671 108978432 108898163
3641.5 108898163 109103218 109237808 108976372 108900429 109389114 110770531 110885101 110327957 110654930 110503098
3651.1 110503098 109835915 109151962 109074898 109479225 109569489 109533806 109328300 109302826 109455841 109436043
3660.8 109436043 109414124 109543106 109710670 109510536 109304520 109447281 109658226 109980476 110504143 110814659
3670.4 110814659 110559334 110096794 109655571 109851028 111411835 111753647 110967545 110378273 110171242
3679.1 110171242 110061638 109907494 110130707 110246063 109981125 109925629 110180168 110326317 110891548 111412453
3688.7 111412453 110503708 110391327 110603752 110319504 109997604 109967903 110223595 110379776 110198334 109915001
3698.4 109915001 109768051 109678925 109938660 110625076 110702744 110365692 110107071 110134064 110137695 110200348 110572678
3709 110572678 111117119 111093399 110693268 110648720 110778076 110514793 110201019 110058472 110036873 110318336
3718.6 110318336 110414543 110224869 110454788 111096008 111179581 110854340 110650406 110715561 110749649 110496658
3728.3 110496658 110290260 110510612 110985359 111380058 110909119 110687546 110804855 110560753 110754555 110896599
3737.9 110896599 110853813 110794823 110855934 110956078 110552673 110372345 111705437 111166939 110960320 111323891
3747.5 111323891 110937561 110435883 111197334 111251343 111723541 111454422 110664940 110250908 110155312 110440521
3757.2 110440521 110709160 110830025 111102386 111009720 110595749 110254807 110153000 110408096 110898605 110704025
3766.8 110704025 110530273 110809883 111023643 110580063 110372391 110373802 110446075 110562157 110497467 110524422
3776.5 110524422 110459282 110315376 110448990 110338783 110214500 110129219 110240860 110527985 110643860 110776955
3786.1 110776955 110590576 110164734 110118393 110445595 110683594 110669510 110480347 110114616 110040428 110370819
3795.8 110370819 110471741 110261971 110432541 110713974 111061378 111974144 111647446 110844322 110450745 110586670
3805.4 110586670 111224243 111137146 110534111 110581543 110447472 110183868 110248535 110137314 110046852 110541748
3815.1 110541748 111052719 110884773 110779366 110873817 111304749 111644569 111180458 110614349 110348831 110505135
3824.7 110505135 110690247 111117058 111432709 110816452 110444649 110704300 111011055 110765007 110547485 110782417
3834.3 110782417 111077660 110846649 110773102 111243271 111205658 111139954 111193092 110830421 110717873 110770477
3844 110770477 110406181 110061501 110039597 110256844 110495804 110752403 110990814 111647888 112445663 112190315
3853.6 112190315 111481361 110585243 110124268 109999718 110246185 110340668 110314926 110657875 110962250 110411118
3863.3 110411118 110188553 110859573 110639900 110101822 109888176 110150810 111155960 111141708 110757286 110644722
3872.9 110644722 110917725 110734283 110354393 110416878 110441872 110475746 110708740 111157310 110809196 110488434
3882.6 110488434 110561607 110436157 110489479 110909828 110853867 110482071 110089470 110148422 110639679 110965744
3892.2 110965744 110664978 110577164 110413826 109960358 110000519 110417274 110720543 110492073 110432381 110911156
3901.8 110911156 111190414 111353790 111235168 110767593 110557198 110335754 110155800 110182571 110123474 109915535
3911.5 109915535 110123459 110635605 110639397 110263863 110246803 110573708 110461906 109928261 109810097 110216896
3921.1 110216896 110247185 110452606 110886017 110931786 110581779 110385399 110154289 109866165 110134361 110378296
3930.8 110378296 110467575 110561134 110493576 110563812 110174080 109684196 109696121 109978981 110248390 110199677 110053276
3941.4 110053276 110282944 110625908 110557663 110364845 110075157 110091301 110274277 110312172 110509377 110173721
3951 110173721 109823997 109910591 109969391 109957024 110040009 110212730 110275658 110256180 109944206 109841034 110124741
3961.6 110124741 110176941 110239029 110093025 109953995 110061577 109883957 109737396 109884232 109904747 109793327
3971.3 109793327 109659645 109412666 109679276 110219963 110285973 110243431 110049751 109834793 109881950 109936317
3980.9 109936317 110010162 110052895 110051224 110007545 109837410 109979156 110173973 109963478 109872665 109860565 109869942
3991.5 109869942 109930450 109884285 109867981 109732056 109565697 109619202 109902870 109972206 109948402
4000.2 109948402
##END=$$ End of the data block
