##TITLE=$$ Begin of the data block
##JCAMP-DX=5.00 $$ ACD/SpecManager v 10.08
##SPECTROMETER/DATA SYSTEM=Varian
##DATE=19 Mar 2013 14:07:54
##DATA TYPE=INFRARED SPECTRUM
##DATA CLASS=XYDATA
##ORIGIN=
##OWNER=
##NPOINTS=3735
##FIRSTX=399.26403809
##LASTX=4000.35498047
##MAXX=4000.35498047
##MINX=399.26403809
##MAXY=166.27026367
##MINY=0.00000100
##XFACTOR=1.0000000000
##YFACTOR=0.000001000000000
##FIRSTY=29.20288849
##DELTAX=0.96440572
##XUNITS=1/CM
##YUNITS=TRANSMITTANCE
##XYDATA=(X++(Y..Y))
$$ plain form
399.3 29202888 29202888 29202888 79260193 79260193 79260193 79260193 79260193 79260193 79260193 79260193 79260193 48832005 5694552 20829294 20829294 20829294 20829294 20829294 20829294 1 1 56569756 36372116
421.4 36372116 36637806 1 1 1 1 1 1 27552990 44817291 44817291 44817291 1 1 28576166 28576166 1
436.9 1 1 57525642 57525642 57525642 32698284 21598883 21598883 21598883 21598883 21598883 21598883 21598883 21598883 1 1 1 1 1 1 1 1 1 107008423 121727737 101739883
461 101739883 44292542 37000141 62487846 53264313 52728252 65771042 105030678 160179398
468.7 160179398 75888382 70802589 88072777 113510201 124677505 109431908 107770325 85186760
476.4 85186760 81831337 72751122 86267281 151900314 121326904 105432816 102454079 73154747
484.1 73154747 73583488 88752502 90936920 97152992 123555313 122008659 110481316 128377960
491.8 128377960 166270264 162684845 115062263 107460403 118694778 97045593 96939293 120755791
$$ packed form
399.3B9202888UN0057305%Zl0428188m3137453J5134742%Wk0829293%N6569755k0197640
421.4C6372116K65690l6637805%WK7552989J7264301%Tm4817290%K8576165%k8576165
436.9A%N7525641%Tk4827358j1099401%Yk1598882%ZJ07008422J4719314j9987854
461A01739883n7447341p292401K5487705r223533n36061J3042790L9259636N5148720
468.7A60179398q4291016n085793J7270188K5437424J1167304j5245597j661583k2583565
476.4H5186760l355423r080215J3516159O5633033l0573410j5894088k978737k9299332
484.1G3154747M28741J5169014K184418O216072K6402321j546654j1527343J7896644
491.8A28377960L7892304l585419m7622582p601860J1234375k1649185j06300K3816498
$$ plain form
499.6 120755791 115178619 102280708 102734550 102447716 108933220 115290230 109350189 108517418 112514000
508.2 112514000 123094765 118377159 98914696 108035324 119284607 107761742 107751350 110159439
516 110159439 109424614 111032501 111362152 106741089 103601791 102930618 100485268 100217865 102522743
524.6 102522743 107752960 106819893 103456940 104491913 107600670 108525650 104450981 105921761 106125519
533.3 106125519 101782318 99821968 98024117 100774574 106670090 106357986 100898407 104432358 110083542
542 110083542 108425301 108931511 104944977 104468948 107907791 103863602 103028419 105314583 107220924
550.7 107220924 105304893 99879944 100804642 103067284 99221268 99383568 102561333 103412842 105742661
559.4 105742661 106427284 104301003 104692444 108458969 107740273 104200562 106067223 106291985 103928276
$$ packed form
499.6A20755791n577172j2897911M53842k86834O485504O357010n940041q32771L996582
508.2A12514000J0580765m717606j9462463R120628J1249283j1522865j0392K408089
516A10159439p34825J607887L29651m621063l139298o71173k445350k67403K304878
524.6A02522743N230217r33067l362953J034973L108757R24980m074669J470780K03758
533.3A06125519m343201j960350j797851K750457N895516l12104n459579L533951N651184
542A10083542j658241N06210l986534m76029L438843m044189q35183K286164J906341
550.7A07220924j916031n424949R24698K262642l846016J62300L177765Q51509K329819
559.4A05742661O84623k126281L91441L766525p18696l539711J866661K24762k363709
$$ plain form
568 103928276 102239792 101248634 102184120 103046791 105349907 105991058 104533485 102701317 101416061
576.7 101416061 103828545 105240005 105910812 104890694 101211937 101884827 102451195 102733727 104864204
585.4 104864204 103236908 102181686 101734550 99870773 99666245 100497047 103957207 106482948 105552299
594.1 105552299 104046272 102595688 100934647 100853027 102663918 102931587 103243530 103012787 102522629
602.8 102522629 104195091 103885506 103155716 103813499 103013138 100412521 99249977 99910919 101527847
611.4 101527847 105744247 106765617 104743713 105069450 105071190 104010414 104343086 105679565 106232285
620.1 106232285 105957214 103885704 102244987 101860626 101108276 101354103 102428871 103818604 104199760
628.8 104199760 102971184 101076859 101602760 103051453 103051483 103954277 103293716 104708260 104938614 101461060
$$ packed form
568A03928276j688484r91158R35486Q62671K303116O41151j457573j832168j285256
576.7A01416061K412484J411460O70807j020118l678757O72890N66368K82532K130477
585.4A04864204j627296j055222m47136j863777k04528Q30802L460160K525741r30649
594.1A05552299j506027j450584j661041q1620J810891K67669L11943k30743m90158
602.8A02522629J672462l09585p29790O57783q00361k600617j162544O60942J616928
611.4A01527847M216400J021370k021904L25737J740j060776L32672J336479N52720
620.1A06232285k75071k071510j640717l84361p52350K45827J074768J389733L81156
628.8A04199760j228576j894325N25901J448693L0R02794o60561J414544K30354l477554
$$ plain form
638.4 101461060 101833740 102042030 102221573 102150383 101136635 102837120 103192856 101816071 102068520
647.1 102068520 104221809 105849648 106013458 104687721 104697243 106763298 104639038 103079582 104393448
655.8 104393448 103732048 103734039 104574554 103739098 102168495 100582848 99957375 100122459 100023636 100956032
665.4 100956032 101399078 102262466 108765335 103001503 98939850 99673088 102921715 102920410 101475967
674.1 101475967 100658684 99913414 100397453 99439896 98506042 98076591 97718933 97642769 97497261 99422295
683.8 99422295 100031731 98906021 98556038 98834526 98562836 97715851 98462929 98441162 98266617 98751534
693.4 98751534 97787163 96612892 96871841 98275139 99063560 98562927 97474113 97147545 96247009
702.1 96247009 96144180 97602837 97436630 97487411 97133369 96690399 97255836 97031586 96585121 95777931
$$ packed form
638.4A01461060L72680K08290J79543p1190j013748J700485L55736j376785K52449
647.1A02068520K153289J627839J63810j325737R522K066055k124260j559456J313866
655.8A04393448o61400J991Q40515q35456j570603j585647o25473J65084r8823R32396
665.4A00956032M43046Q63388O502869n763832m061653P33238L248627j305j444443
674.1A01475967q17283p45270M84039r57557r33854m29451l57658p6164j45508J925034
683.8I9422295O09436j125710l49983K78488k71690q46985P47078k1767j74545M84917
693.4I8751534r64371j174271K58949J403298P88421n00633j088814l26568r00536
702.1I6247009j02829J458657j66207N0781l54042m42970N65437k24250m46465q07190
$$ plain form
711.7 95777931 95358612 95748543 96441856 95295914 93716911 94017014 93884888 94248611 94216019 93501419
721.4 93501419 92875206 90996986 90782372 92321815 93283592 94070290 94649368 94291466 94098808 94322830
731 94322830 94297226 96232155 98860062 97905594 95974106 95774300 96292595 98164268 99556053 98939713
740.7 98939713 98677216 98716652 98680695 99252464 100739883 101321907 99782799 98693817 99830345 101732971
750.3 101732971 101663055 101563560 102066475 101131409 100940781 101129768 101064293 101342537 100250053 99800888
760 99800888 101306702 101693069 101433029 101366058 100507011 100878906 102060646 101978745 101589096 101667015
769.6 101667015 101899460 101940956 100649132 99866646 101907921 103112831 103232384 103555969 102951553
778.3 102951553 102628937 102239830 102372864 102081757 101927299 102617989 101347801 100781731 102303017
$$ packed form
711.7I5777931m19319L89931O93313j145942j579003L00103j32126L63723l2592p14600
721.4I3501419o26213j878220k14614J539443R61777P86698N79078l57902j92658K24022
731I4322830k5604J934929K627907r54468j931488j99806N18295J871673J391785o16340
740.7I8939713k62497L9436l5957N71769J487419N82024j539108j088982J136528J902626
750.3A01732971o9916r9495N02915r35066j90628J88987o5475K78244j092484m49165
760I9800888J505814L86367k60040o6971q59047L71895J181740q1901l89649P7919
769.6A01667015K32445M1496j291824p82486K041275J204910J19553L23585o04416
778.3A02951553l22616l89107J33034k91107j54458O90690j270188n66070J521286
$$ plain form
787 102303017 103544357 102600311 102408722 104058014 102633797 101330559 102043633 102821106 104038216
795.6 104038216 103989609 103406128 103292961 103371513 103227180 102254829 102450523 103851303 104010246 102815414
805.3 102815414 101535355 102104462 103595596 102901474 102988976 104208626 103386520 103151375 103291985
814 103291985 102432014 102439430 102426147 102850365 104207832 104416794 103754372 102687340 102264946 102581436
823.6 102581436 102628571 103182526 103509987 103487183 102702286 101824974 101924622 101832336 102825287 103506798
833.3 103506798 102285675 101390495 101005531 100339882 100440926 101784531 102054382 101712158 101881126
841.9 101881126 102262650 102045753 100864410 101070107 101410271 100834320 100670769 100401558 100366974 101407410
851.6 101407410 101972588 100690094 100263542 100936249 101374023 101574753 101445679 101879745 101616394 100599205
$$ packed form
787A02303017J241340r44046j91589J649292j424217j303238P13074P77473J217110
795.6A04038216m8607n83481j13167P8552j44333r72351J95694J400780J58943j194832
805.3A02815414j280059N69107J491134o94122Q7502J219650q22106k35145J40610
814A03291985q59971P416j3283M24218J357467K08962o62422j067032m22394L16490
823.6A02581436M7135N53955L27461k2804p84897q77312R9648r2286R92951O81511
833.3A03506798j221123q95180l84964o65649J01044J343605K69851l42224J68968
841.9A01881126L81524k16897j181343K05697L40164n75951j63551k69211l4584J040436
851.6A01407410N65178j282494m26552O72707M37774K00730j29074M34066k63351j017189
$$ plain form
861.2 100599205 100631668 101313042 101404510 101309891 101509666 101875435 102106865 101275528 100941307 101133476
870.9 101133476 101145027 101779411 102376503 102588112 102065407 101769890 101461609 100915596 101603050 102381287
880.5 102381287 102160629 101759567 101994865 102391373 102726067 102097290 101519409 102561905 102914230 102512062
890.2 102512062 102178230 102142105 102171654 101708961 101850449 102219147 102446182 102745987 102459297 101418259
899.8 101418259 101464867 102408783 102924202 103228966 102411804 101547318 101289696 101571762 101901115 101710052
909.4 101710052 101720566 101234749 101103432 100830933 100088715 99889343 100505180 101555824 100872749 100144608
919.1 100144608 100088615 100182487 100826416 100802216 100388412 100169418 100494583 100272034 100238487 101147011
928.7 101147011 101350899 100952797 100468834 101319061 102064087 101426064 101348511 101474342 101483589 101648682
$$ packed form
861.2A00599205L2463O81374R1468r4619J99775L65769K31430q31337l34221J92169
870.9A01133476J1551O34384N97092K11609n22705k95517l08281n46013O87454P78237
880.5A02381287k20658m01062K35298L96508L34694o28777n77881J042496L52325m02168
890.2A02512062l33832l6125K9549m62693J41488L68698K27035K99805k86690j041038
899.8A01418259M6608R43916N15419L04764q17162q64486k57622K82066L29353j91063
909.4A01710052J0514m85817j31317k72499p42218j99372O15837J050644o83075p28141
919.1A00144608n5993R3872O43929k4200m13804k18994L25165k22549l3547R08524
928.7A01147011K03888l98102m83963Q50227P45026o38023p7553J25831R247J65093
$$ plain form
938.4 101648682 101453300 100797478 100980949 101744652 101969917 101810371 101650871 101857964 101384933 101089073
948 101089073 101130081 100756989 101223343 101442482 101234299 101617821 101962303 101462479 100647415 101291451
957.7 101291451 102571556 102322975 101470726 101728218 101944115 101236206 100746567 100814812 101295097 101386887
967.3 101386887 101171082 101577408 101404770 101208694 101637901 101081787 101123192 101515228 100598030 100018486
976.9 100018486 100047684 100692192 101056473 100707962 100938278 100733040 99968445 100191872 100722626 100439194
986.6 100439194 100740471 100909004 100382263 100922623 101113976 100586853 100357506 100621742 101092773 100706322
996.2 100706322 100259323 100485672 100574081 100123901 100180702 100394119 100412537 100560555 100102196 100142876
1005.9 100142876 100262833 99901115 99474945 98458733 98458046 99280273 99212608 99010918 99074112 98565285
$$ packed form
938.4A01648682j95382o55822J83471P63703K25265j59546j59500K07093m73031k95860
948A01089073M1008l73092M66354K19139k08183L83522L44482m99824q15064O44036
957.7A01291451J280105k48581q52249K57492K15897p07909m89639O8245M80285R1790
967.3A01386887k15805M06326j72638j96076M29207n56114M1405L92036r17198n79544
976.9A00018486K9198O44508L64281l48511K30316k05238p64595K23427N30754k83432
986.6A00439194L01277J68533n26741N40360J91353n27123k29347K64236M71031l86451
996.2A00706322m46999K26349Q8409m50180N6801K13417J8418J48018m58359M0680
1005.9A00142876J19957l61718m26170j016212o87Q22227o7665k01690O3194n08827
$$ plain form
1015.5 98565285 97965538 97440041 96975723 97367744 97373573 96900124 96903442 96630035 95722092 94865921
1025.2 94865921 94825233 95007629 94632111 93886398 93074165 92261681 92061440 92180763 92210892 92549599
1034.8 92549599 92176071 91359734 91300735 91891518 91649979 91206085 91884941 92043488 92014145 92051559
1044.5 92051559 92152191 92557831 92402519 92321457 92392166 92787148 93356461 93619728 93478867 93388359
1054.1 93388359 93945251 94023994 93994102 94612076 95264763 95233459 94840096 94995857 95301598 95400032
1063.7 95400032 95238335 95540878 96367722 96773170 96766747 96509216 96642883 97410004 97187508 96065071
1073.4 96065071 96539627 97812225 98147232 97657150 96443008 95764107 95777626 96245903 96289131 95205032
1083 95205032 94689293 94458244 94210114 94490036 94417435 94126862 94117943 93436256 92505615 92494942 92454086
$$ packed form
1015.5I8565285n99747n25497m64318L92021N829m73449L318k73407r07943q56171
1025.2I4865921m0688J82396l75518p45713q12233q12484k00241J19323L0129L38707
1034.8I2549599l73528q16337n8999N90783k41539m43894O78856J58547k9343L7414
1044.5I2051559J00632M05640j55312q1062P0709L94982N69313K63267j40861r0508
1054.1I3388359N56892P8743k9892O17974O52687l1304l93363J55761L05741R8434
1063.7I5400032j61697L02543Q26844M05448o423k57531J33667P67121k22496j122437
1073.4I6065071M74556J272598L35007m90082j214142o78901J3519M68277M3228j084099
1083I5205032n15739k31049k48130K79922p2601k90573q919o81687r30641j0673m0856
$$ plain form
1093.6 92454086 91834488 91306625 91162094 91105255 91053413 91188713 91991127 92677742 92387398 92702126
1103.3 92702126 92989166 92969101 93379410 93243530 93281174 93764931 93799812 93257927 92770622 92946167
1112.9 92946167 93434441 92948212 91773216 91602982 91797112 92022209 92163208 91970291 92282181 92550499
1122.6 92550499 92759048 93379768 93842476 94191338 94791901 94896896 94730888 94368736 93835869 94381195
1132.2 94381195 94662354 93968185 93311249 93007126 93029572 92591049 92027992 91835266 91950111 91872757
1141.9 91872757 91835350 91755081 91064034 90626808 90312477 90115944 89717194 89171440 88530128 87467484
1151.5 87467484 86962173 86276947 85351219 84519623 84066208 83684921 82483429 81565750 81127876 81359291
1161.1 81359291 81013054 79929466 79464928 79355591 79436981 78944809 78727951 78782616 78642365 78187569
$$ packed form
1093.6I2454086o19598n27863j44531n6839n1842J35300Q02414O86615k90344L14728
1103.3I2702126K87040k0065M10309j35880L7644M83757L4881n41885m87305J75545
1112.9I2946167M88274m86229j174996j70234J94130K25097J40999j92917L11890K68318
1122.6I2550499K08549O20720M62708L48862O00563J04995j66008l62152n32867N45326
1132.2I4381195K81159o94169o56936l04123K2446m38523n63057j92726J14845p7354
1141.9I1872757l7407q0269o91047m37226l14331j96533l98750n45754o41312j062644
1151.5H7467484n05311o85226r25728q31596m53415l81287j201492r17679m37874K31415
1161.1H1359291l46237j083588m64538j09337Q1390m92172k16858N4665j40251m54796
$$ plain form
1170.8 78187569 77306725 77395889 77683250 77487762 77266777 77058502 76853752 77031189 77158058 76995575
1180.4 76995575 77493240 77899414 78080933 77871628 77817368 78712669 79174591 79312477 79877747 80503731
1190.1 80503731 80909874 81505066 81871391 82154495 82614326 83043068 83988960 84540176 84963020 85491753
1199.7 85491753 85741852 86227898 86664391 87033333 87229164 87554092 87846069 87916435 88076332 88372452
1209.4 88372452 88862869 89119484 89498070 89574684 89440933 89700043 89752724 89786636 89826721 90112793
1219 90112793 90444984 90444412 90738396 91077606 90824516 90425011 90365494 90368050 90440697 90309357 89975151
1229.6 89975151 89824547 89652458 89435081 89360481 89455757 89427170 89315323 88799599 88308258 88188873
1239.3 88188873 87791847 87517380 87384628 87667831 87885048 87831970 88050499 88028107 88252350 88365669
$$ packed form
1170.8G8187569q80844Q9164K87361j95488k20985k08275k04750J77437J26869j62483
1180.4G6995575M97665M06174J81519k09305n4260Q95301M61922J37886N65270O25984
1190.1H0503731M06143N95192L66325K83104M59831M28742R45892N51216M22844N28733
1199.7H5491753K50099M86046M36493L68942J95831L24928K91977P0366J59897K96120
1209.4H8372452M90417K56615L78586P6614j33751K59110N2681L3912M0085K86072
1219I0112793L32191n72K93984L39210k53090l99505n9517K556P2647j31340l34206
1229.6H9975151j50604j72089k17377p4600R5276k8587j11847n15724m91341j19385
1239.3H8188873l97026k74467j32752K83203K17217n3078K18529k2392K24243J13319
$$ plain form
1248.9 88365669 88402168 88757477 89161697 89776672 90243484 90488358 90631714 90765305 90710976 90893448
1258.5 90893448 91222321 91277107 91358955 91269371 91543472 91734520 91909294 92398018 92299377 92211166 92401520
1269.2 92401520 92609077 92668289 92770027 92812698 92565216 92596367 92819000 92980659 92700691 92587677
1278.8 92587677 93117592 93618050 93911156 94033905 94255035 94459587 94792130 95349815 95755913 95878845
1288.4 95878845 95775139 95777893 95904221 96153183 96222878 95955963 95923531 95947174 95640488 95262299 95016724
1299 95016724 95015282 95213051 95246704 95282204 95470253 95733940 95984756 96145401 96488998 96525726 96357361
1309.7 96357361 96436813 96504692 96553268 96771423 97106689 97103203 96983650 96818642 96634262 96685760 96958641
1320.3 96958641 97352966 97339127 97321259 97483727 97718643 98106552 98173409 98314949 98759224 98996231
$$ packed form
1248.9H8365669L6499L55309M04220O14975M66812K44874J43356J33591n4329J82472
1258.5I0893448L28873N4786Q1848q9584K74101J91048J74774M88724r8641q8211J90354
1269.2I2401520K07557N9212J01738M2671k47482L1151K22633J61659k79968j13014
1278.8I2587677N29915N00458K93106J22749K21130K04552L32543N57685M06098J22932
1288.4I5878845j03706K754J26328K48962O9695k66915l2432K3643l06686l78189k45575
1299I5016724j442J97769L3653L5500J88049K63687K50816J60645L43597L6728j68365
1309.7I6357361P9452O7879M8576K18155L35266l486j19553j65008j84380N1498K72881
1320.3I6958641L94325j3839j7868J62468K34916L87909O6857J41540M44275K37007
$$ plain form
1329.9 98996231 98828270 98691910 98772736 98856819 98847389 98654366 98598793 98795387 98916122 98480003 98098999
1340.5 98098999 98182938 97915932 97665024 97488937 97165985 96910614 96848610 97019295 96974174 96824089
1350.2 96824089 96999069 97269020 97258179 97420929 97795143 98007050 98174843 98201630 98155899 97937447
1359.8 97937447 97940674 98073074 97762657 96999397 96064964 95442238 94782257 93960030 93363342 93021172
1369.4 93021172 92543129 92039658 91915459 91693436 91804840 91760994 91149475 91105675 91558289 92394455
1379.1 92394455 93122482 94013710 95068161 95872635 96271698 96652824 97181702 97521629 97848267 97476089
1388.7 97476089 97425995 97734116 97555748 97538246 97616776 97860970 98165344 98121704 98101105 98146988 98292908
1399.3 98292908 98420349 98843719 99321571 99804108 100211205 100400139 100474609 100474426 100529015 100392220 100303322
$$ packed form
1329.9I8996231j67961j36360Q0826Q4083r430j93023n5573J96594J20735m36119l81004
1340.5I8098999Q3939k67006k50908j76087l22952k55371o2004J70685m5121j50085
1350.2I6824089J74980K69951j0841J62750L74214K11907J67793K6787m5731k18452
1359.8I7937447L227J32400l10417p63260r34433o22726o59981q22227n96688l42170
1369.4I3021172m78043n03471j24199k22023J11404m3846o11519m3800M52614Q36166
1379.1I2394455P28027Q91228J054451Q04474L99063L81126N28878L39927L26638l72178
1388.7I7476089n0094L08121j78368j7502P8530K44194L04374m3640k0599M5883J45920
1399.3I8292908J27441M23370M77852M82537M07097J88934P4470j83N4589j36795q8898
$$ plain form
1409.9 100303322 100326889 100016685 99594727 99340904 98888298 98232140 97882256 97798126 97759773 98096298
1419.6 98096298 98012634 97810547 97836342 98033539 98226151 98311165 98333504 98336761 98199959 97805275 97152924
1430.2 97152924 96918068 96866928 96430992 96075615 95930527 95893845 95712112 94965355 94294739 93689911
1439.8 93689911 93562927 93189796 92752884 92567451 92152466 91861526 91770935 92017464 91686401 91167076
1449.5 91167076 90851288 90292831 89511757 88596573 88064041 87067261 86577240 86404236 85087433 85318771
1459.1 85318771 85114174 85032417 84450912 84501389 84748795 84247871 84145897 84014420 85183609 86663681
1468.8 86663681 89379410 92191261 95097717 99334938 100343925 100674004 100714867 101571564 101922318
1477.5 101922318 102039795 102456154 102625664 103198845 103466103 103944427 104322235 104497932 104940033 105329445
$$ packed form
1409.9A00303322K3567l10204m21958k53823m52606o56158l49884q4130l8353L36525
1419.6I8096298q3664k02087K5795J97197J92612Q5014K2339L257j36802l94684o52351
1430.2I7152924k34856n1140m35936l55377j45088l6682j81733p46757o70616o04828
1439.8I3689911j26984l73131m36912j85433m14985k90940r0591K46529l31063n19325
1449.5I1167076l15788n58457p81074r15184n32532r96780m90021j73004j316803K31338
1459.1H5318771k04597q1757n81505N0477K47406n00924j01974j31477J169189J480072
1468.8H6663681K715729K811851K906456M237221J008987L30079M0863Q56697L50754
1477.5A01922318J17477M16359J69510N73181K67258M78324L77808J75697M42101L89412
$$ plain form
1487.1 105329445 105567322 105511848 106217865 105997993 105857910 105972054 105794525 106091499 106808685 107517342
1496.7 107517342 106782486 106480598 106686897 106467453 106314278 106165932 106341965 106559937 106785820 106523987
1506.4 106523987 107634109 107746056 106899620 106954178 106788521 107083542 107462715 107125702 106954376 107167381
1516 107167381 107873352 107464897 107315567 107465546 108206062 108549492 107336319 106986450 106694183 106986023
1525.7 106986023 107215302 107101089 107237099 107303917 107272942 107103615 107089790 106996918 107395294 107471344
1535.3 107471344 107462906 107810005 107855927 107533775 107326157 108088943 108863533 107961723 107135887 106844017
1545 106844017 106850487 106823708 106844368 106853676 107102234 107113174 106951622 107204628 107357658 107258865 107344612
1555.6 107344612 107565964 107814117 107071449 104623955 106577560 107146919 106862732 106758965 106464279
$$ packed form
1487.1A05329445K37877n5474P06017k19872j40083J14144j77529K96974P17186P08657
1496.7A07517342p34856l01888K06299k19444j53175j48346J76033K17972K25883k61833
1506.4A06523987J110122J11947q46436N4558j65657K95021L79173l37013j71326K13005
1516A07167381P05971m08455j49330J49979P40516L43430j213173l49869k92267K91840
1525.7A06986023K29279j14213J36010O6818l0975j69327j3825r2872L98376P6050
1535.3A07471344q438L47099M5922l22152k07618P62786P74590r01810q25836k91870
1545A06844017O470k6779K0660R308K48558J0940j61552K53006J53030r8793Q5747
1555.6A07344612K21352K48153p42668k447494J953605N69359k84187j03767k94686
$$ plain form
1564.2 106464279 106618378 107009079 106807770 106948433 107476059 107764862 107040611 106609329 106627502 106720512
1573.9 106720512 106875305 107489029 108106537 107245316 106796066 106662186 106653816 106744690 106823128 106762123
1583.5 106762123 106557556 106630470 106725113 106758186 106744667 106698914 106815071 106670403 106444794 106327759
1593.2 106327759 106364716 106548042 106801918 106801445 106484154 106380867 106303810 106348251 106394569 106456314 106424873
1603.8 106424873 106252243 106379448 106417671 106488007 106563362 106745064 106681480 106371147 106171501 105814346
1613.4 105814346 105970078 106165840 106219116 106444595 106111992 106045906 105858284 105828468 105872047 106028664
1623.1 106028664 106076988 105708221 105576866 105620384 106063026 105930641 105658112 105644920 105648956 105608002 105583130
1633.7 105583130 106018028 106357536 106194633 105978477 105640213 105432892 105001335 104768311 104697296 104839050
$$ packed form
1564.2A06464279J54099L90701k01309J40663N27626K88803p24251m31282J8173R3010
1573.9A06720512J54793O13724O17508q61221m49250j33880q370R0874P8438o1005
1583.5A06762123k04567P2914R4643L3073j3519m5753J16157j44668k25609j17035
1593.2A06327759L6957J83326K53876m73l17291j03287p7057M4441M6318O1745l1441
1603.8A06424873j72630J27205L8223P0336P5355J81702o3584l10333j99646l57155
1613.4A05814346J55732J95762N3276K25479l32603o6086j87622k9816M3579J56617
1623.1A06028664M8324l68767j31355M3518M42642j32385k72529j3192M036m0954k4872
1633.7A05583130M34898L39508j62903k16156l38264k07321m31557k33024p1015J41754
$$ plain form
1643.3 104839050 104854469 104774467 104788261 104880974 105288841 104709290 104372299 104441086 105062248 106718964
1653 106718964 105019951 104623566 104070847 104008095 104008270 104019157 104217720 104368454 104484505 104501366 104533974
1663.6 104533974 104366737 104302460 104247246 104142548 104254372 104547218 104861115 104931282 104606163 104285088
1673.2 104285088 104408470 104564217 104214874 104065849 103871849 103965996 104213310 104279556 103898018 103347885
1682.9 103347885 102630028 103305084 103530624 102990105 102869034 102719475 102513283 102189369 101593300 101315475
1692.5 101315475 101053261 100923424 100763069 100850227 100328461 99342499 98600998 97604866 97629959 97385826
1702.1 97385826 96970108 96107605 95092064 94347252 93417358 92640442 91857971 91082512 89990471
1710.8 89990471 89076180 88398476 87713036 87119019 86087845 85295586 84668739 83847229 83190903 82649422
$$ packed form
1643.3A04839050J5419q0002J3794R2713M07867n79551l36991O8787O21162J656716
1653A06718964j699013l96385n52719o2752J75J0887J98563J50734J16051J6861L2608
1663.6A04533974j67237o4277n5214j04698J11824K92846L13897P0167l25119l21075
1673.2A04285088J23382J55747l49343j49025j94000R4147K47314O6246l81538n50133
1682.9A03347885p17857O75056K25540n40519j21071j49559k06192l23914n96069k77825
1692.5A01315475k62214j29837j60355Q7158n21766r85962p41501r96132K5093k44133
1702.1I7385826m15718q62503j015541p44812r29894p76916p82471p75459j092041
1710.8H9990471r14291o77704o85440n94017j031174p92259o26847q21510o56326n41481
$$ plain form
1720.5 82649422 82137688 81542542 80911087 80112518 79226326 78087540 76794815 75478035 73961227
1729.1 73961227 71577728 69032570 67221657 65514030 62386017 56224129 54747322 53077904
1736.9 53077904 51591644 50530594 49860775 49649445 49816990 51304031 53097721 55765720 57928379
1745.5 57928379 60922913 63932411 67098961 70869286 72753510 76709663 79700752 81785698
1753.3 81785698 84259048 86551720 88884026 91410210 93204803 94261841 95485237 96453018 98231934
1761.9 98231934 99210129 99427483 100000946 100382011 100789558 101031036 101753403 102056648 102059471 102628929
1771.6 102628929 103350960 103486168 103269676 103440269 103581917 103714096 103866760 103999611 104313721 104240067
1781.2 104240067 104289276 104379929 104482315 104598518 104644966 104652603 104584740 104746101 104930504 105209717 105319717
$$ packed form
1720.5H2649422n11734n95146o31455p98569q86192j138786j292725j316780j516808
1729.1G3961227k383499k545158j810913j707627l128013o161888j476807j669418
1736.9E3077904j486260j061050o69819k11330J67545J487041J793690K667999K162659
1745.5E7928379K994534L009498L166550L770325J884224L956153K991089K084946
1753.3H1785698K473350K292672K332306K526184J794593J057038J223396R67781J778916
1761.9I8231934R78195K17354N73463L81065M07547K41478P22367L03245K823N69458
1771.6A02628929P22031J35208k16492J70593J41648J32179J52664J32851L14110p3654
1781.2A04240067M9209R0653J02386J16203M6448P637o7863J61361J84403K79213J10000
$$ plain form
1791.8 105319717 105644302 105585663 105092918 105125107 105319023 105464027 105514427 105386345 105400299 105437767
1801.5 105437767 105705788 105725578 105616158 105782440 105885048 105769341 105730011 105786255 105845490 106117409
1811.1 106117409 106186531 106072456 106021523 106059242 106150314 106176476 106304695 106357437 106200150 106126198 106165588
1821.7 106165588 106124527 106143478 106438484 106560181 106265892 106321320 106602798 106666344 106520638 106465675
1831.4 106465675 106407883 106286682 106277107 106341980 106372391 106475960 106520447 106520882 106395836 106358780 106559502
1842 106559502 106681641 107065895 107127747 106728020 106704628 106861259 106813438 106598961 106697769 106926514 106919830
1852.6 106919830 106852501 106861282 106779678 106634460 106714561 106829826 106917046 107024704 107014687 107035492 107043953
1863.2 107043953 106823586 106749435 106967331 106961838 106977386 107146034 107133148 107110046 106898300 106736717 106800629
$$ packed form
1791.8A05319717L24585n8639m92745L2189J93916J45004N0400j28082J3954L7468
1801.5A05437767K68021J9790j09420J66282J02608j15707l9330N6244N9235K71919
1811.1A06117409O9122j14075n0933L7719R1072K6162J28219N2742j57287p3952L9390
1821.7A06165588m1061J8951K95006J21697k94289N5428K81478O3546j45706n4963
1831.4A06465675n7792j21201r575O4873L0411J03569M4487M35j25046l7056K00722
1842A06559502J22139L84254O1852l99727k3392J56631m7821k14477R8808K28745o684
1852.6A06919830o7329Q781q1604j45218Q0101J15265Q7220J07658j0017K0805Q461
1863.2A07043953k20367p4151K17896n493J5548J68648j2886k3102k11746j61583O3912
$$ plain form
1873.8 106800629 106809174 106748428 106813988 106875397 106776970 106637932 106548210 106737480 106941902 106824425 106753548
1884.4 106753548 106827393 106848755 106802353 106723351 106861893 107104965 106993889 107024223 107094147 107057152 107302773
1895 107302773 107331886 107128189 107113548 107088165 106944695 106798073 106770821 106892944 107091675 107234879 107268005
1905.6 107268005 107116287 106993698 107097099 107245766 107288780 107108948 107071732 107198479 107282188 107290016
1915.3 107290016 107093887 107038254 107193962 107216454 107255386 107332603 107415993 107495499 107335152 107108498 107031235
1925.9 107031235 107032082 107145416 107300705 107396103 107347343 107168976 107175896 107290192 107286354 107130768 107118332
1936.5 107118332 107316200 107379005 107377876 107354736 107332237 107371933 107351822 107254044 107251320 107366074 107349709
1947.1 107349709 107358055 107474869 107464409 107324394 107310822 107367218 107318024 107264633 107165443 107203835 107432091
$$ packed form
1873.8A06800629Q545o0746O5560O1409r8427j39038q9722J89270K04422j17477p0877
1884.4A06753548P3845K1362m6402p9002J38542K43072j11076L0334O9924l6995K45621
1895A07302773K9113k03697j4641k5383j43470j46622k7252J22123J98731J43204L3126
1905.6A07268005j51718j22589J03401J48667M3014j79832l7216J26747Q3709P828
1915.3A07290016j96129n5633J55708K2492L8932P7217Q3390P9506j60347k26654p7263
1925.9A07031235Q47J13334J55289R5398m8760j78367O920J14296l838j55586j2436
1936.5A07118332J97868O2805j129k3140k2499L9696k0111r7778k724J14754j6365
1947.1A07349709Q346J16814j0460j40015j3572N6396m9194n3391r9190L8392K28256
$$ plain form
1957.7 107432091 107529053 107476791 107379196 107341667 107482994 107573166 107535309 107620377 107660690 107677940 107573601
1968.3 107573601 107351387 107376099 107361893 107444695 107711700 107711243 107513878 107431458 107440056 107333481 107366615
1978.9 107366615 107537598 107704567 107733772 107673477 107729279 107593788 107476723 107501968 107591537 107598434 107375092
1989.5 107375092 107344360 107420143 107470490 107398087 107324501 107403336 107470482 107510918 107504944 107602859 107688217 107608963
2001.1 107608963 107474861 107464714 107544250 107556892 107680138 107708260 107613289 107560486 107526566 107623230 107789841
2011.7 107789841 107794350 107669060 107684258 107629723 107614479 107735641 107786171 107785072 107548042 107441498 107495293
2022.3 107495293 107488762 107580399 107692436 107730843 107748558 107737495 107570358 107519241 107469086 107452774 107606865
2032.9 107606865 107543633 107448875 107369812 107455650 107610115 107621506 107742584 107825623 107812035 107673660 107672569
$$ packed form
1957.7A07432091R6962n2262r7595l7529J41327R0172l7857Q5068M0313J7250j04339
1968.3A07573601k22214K4712j4206Q2802K67005m57j97365q2420Q598j06575L3134
1978.9A07366615J70983J66969K9205o0295N5802j35491j17065K5245Q9569O897k23342
1989.5A07375092l0732P5783N0347p2403p3586P8835O7146M0436n974R7915Q5358p9254
2001.1A07608963j34102j0147P9536J2642J23246K8122r4971n2803l3920R6664J66611
2011.7A07789841M509j25290J5198n4535j5244J21162N0530j099k37030j06544N3795
2022.3A07495293o531R1637J12037L8407J7715j1063j67137n1117n0155j6312J54091
2032.9A07606865o3232r4758p9063Q5838J54465J1391J21078Q3039j3588j38375j091
$$ plain form
2043.5 107672569 107685371 107567719 107633766 107650246 107638031 107609680 107634232 107748604 107743362 107679527 107624573
2054.1 107624573 107743561 107791046 107685326 107725624 107757797 107649704 107585312 107702133 107830444 107874733
2063.8 107874733 107915085 107807884 107641869 107757530 107827454 107809723 107991989 107955009 107822441 107811989
2073.4 107811989 107749634 107745186 107752113 107733345 107840828 107976601 107984024 108053665 108043030 107850807 107681778
2084 107681778 107490509 107542656 107810265 107786133 107674698 107819275 107924065 107919357 107858086 107737068 107699120
2094.6 107699120 107706039 107838181 107826080 107727028 107819069 107825500 107894897 107988297 107974503 108039040 108152641
2105.2 108152641 108093498 107931847 107814041 107663078 107721893 107852791 108007355 108194710 108125175 107948631
2114.9 107948631 107808479 107887001 107995636 108003586 108069214 108141953 108128525 108088814 108236496 108245071 108107338
$$ packed form
2043.5A07672569J2802j17652O6047J6480j2215k8351K4552J14372n242o3835n4954
2054.1A07624573J18988M7485j05720M0298L2173j08093o4392J16821J28311M4289
2063.8A07874733M0352j07201j66015J15661O9924j7731J82266l6980j32568j0452
2073.4A07811989o2355m448O927j8768J07483J35773P423O9641j0635j92223j69029
2084A07681778j91269N2147K67609k4132j11435J44577J04790m708o1271j21018l7948
2094.6A07699120O919J32142j2101r9052R2041O431O9397R3400j3794O4537J13601
2105.2A08152641n9143j61651j17806j50963N8815J30898J54564J87355o9535j76544
2114.9A07948631j40152P8522J08635P950O5628P2739j3428l9711J47682Q575j37733
$$ plain form
2125.5 108107338 107997780 107949043 107977859 107929207 107981873 108030914 108134354 108160553 108002449 107874207 107711639
2136.1 107711639 107747246 107824814 108018684 108286835 108219749 108097221 108112762 108160606 108144943 108062881 107840134
2146.7 107840134 107980988 108297699 108111130 107971298 107904556 107823814 107814888 107771782 107837662 108070198 108222549
2157.3 108222549 108018578 107957657 108120628 108232910 108174568 107994286 107973305 107946815 108012222 107999023 107849396
2167.9 107849396 107844994 107971184 108200829 108189430 108076569 107955696 107700279 107596603 107672302 107725838
2177.6 107725838 107725273 107743942 107666786 107722015 107965225 108006409 107878204 107884804 108093285 108053322 107827415
2188.2 107827415 107838860 107870979 107792007 107845863 108015427 108098213 108134010 108034218 107881691 107942696 108038689
2198.8 108038689 108073257 108079819 108030159 108047943 107997475 107892738 108032944 108152618 108112030 108053749 108021622
$$ packed form
2125.5A08107338j09558m8737K8816m8652N2666M9041J03440K6199j58104j28242j62568
2136.1A07711639L5607P7568J93870K68151o7086j22528J5541M7844j5663q2062k22747
2146.7A07840134J40854L16711j86569j39832o6742q0742q926m3106O5880K32536J52351
2157.3A08222549k03971o0921J62971J12282n8342j80282k0981k6490O5407j3199j49627
2167.9A07849396m402J26190K29645j1399j12861j20873k55417j03676P5699N3536
2177.6A07725838n65J8669p7156N5229K43210M1184j28205O600K08481l9963k25907
2188.2A07827415J1445L2119p8972N3856J69564Q2786L5797r9792j52527O1005R5993
2198.8A08038689L4568O562m9660J7784n0468j04737J40206J19674m0588n8281l2127
$$ plain form
2209.4 108021622 107950615 107797241 107873497 107951088 107924706 107868187 107683655 107839500 108099960 108053604 107904175
2220 107904175 107795784 107825249 107833725 107697151 107721886 107966789 107976471 107977264 108080612 107911682 107833763 107904076
2231.6 107904076 107814362 107771683 107899544 107884865 107749619 107738503 107876488 108005424 107894485 107825768
2241.2 107825768 107749809 107623817 107736191 107808624 107755699 107697044 107800560 107939957 107786301 107624878
2250.9 107624878 107687515 107790909 107805878 107814438 107883842 107997711 107905479 107751015 107852959 107858162 107753563
2261.5 107753563 107775154 107902466 107916267 107791290 107860809 107977737 107899887 107728554 107673210 107742798 107873749
2272.1 107873749 108008080 107947647 107837173 107790436 107738503 107749451 107743156 107709290 107817505 107832893 107704689
2282.7 107704689 107788673 107846992 107665756 107500214 107543427 107666588 107666771 107598564 107554207 107658287 107705460
$$ packed form
2209.4A08021622p1007j53374P6256P7591k6382n6519j84532J55845K60460m6356j49429
2220A07904175j08391K9465Q476j36574K4735K44903R682P93J03348j68930p7919P0313
2231.6A07904076q9714m2679J27861j4679j35246j1116J37985J28936j10939o8717
2241.2A07825768p5959j25992J12374P2433n2925n8655J03516J39397j53656j61423
2250.9A07624878O2637J03394J4969Q560O9404J13869r2232j54464J01944N203j04599
2261.5A07753563K1591J27312J3801j24977O9519J16928p7850j71333n5344O9588J30951
2272.1A07873749J34331o0433j10474m6737n1933J0948o295l3866J08215J5388j28204
2282.7A07704689Q3984N8319j81236j65542M3213J23161J83o8207m4357J04080M7173
$$ plain form
2293.3 107705460 107644638 107736198 107796951 107750504 107588654 107461136 107644569 107712967 107527077 107459953 107421562
2303.9 107421562 107609177 107946091 107851494 107698082 107818916 107846535 107723068 107861259 108040161 107951324
2313.5 107951324 107895584 107806801 107814148 107708473 107669418 108022163 108024277 108096313 108203087 108086334 108189362
2324.2 108189362 108226685 108181328 108093384 107960098 107670158 107503212 107745079 108025696 107777016 107107437
2333.8 107107437 107246368 107822052 107829109 107907288 108259323 108047462 107936646 108023628 107553329 107565460
2343.4 107565460 107934181 108139282 108168365 107975800 107709511 107525055 107669151 107796776 107781242 107799858
2353.1 107799858 107981026 108173439 107936157 108237541 108604218 108264191 107617081 108039970 108732300 108407501
2362.7 108407501 108565689 108782295 108967590 108628822 108049301 107623840 107259903 107769951 107720970 107592720
$$ packed form
2293.3A07705460o0822R1560O0753m6447j61850j27518J83433O8398j85890o7124l8391
2303.9A07421562J87615L36914r4597j53412J20834K7619j23467J38191J78902q8837
2313.5A07951324n5740q8783P347j05675l9055L52745K114P2036J06774j16753J03028
2324.2A08189362L7323m5357q7944j33286k89940j66946K41867K80617k48680o69579
2333.8A07107437J38931N75684P057P8179L52035k11861j10816Q6982m70299J2131
2343.4A07565460L68721K05101K9083j92565k66289j84456J44096J27625j5534J8616
2353.1A07799858J81168J92413k37282L01384L66677l40027o47110M22889O92330l24799
2362.7A08407501J58188K16606J85295l38768n79521m25461l63937N10048m8981j28250
$$ plain form
2372.4 107592720 108039093 107874954 107671196 107960548 108158157 108040504 107892883 107654930 107481003 107411682
2382 107411682 107376358 107440773 107477150 107641693 107778534 107669258 107477295 107435509 107500702 107544098 107566628
2392.6 107566628 107441635 107423706 107440010 107485321 107578003 107535667 107656822 107617424 107438934 107399162 107445000
2403.2 107445000 107512756 107378632 107390320 107476654 107385765 107329399 107374397 107475807 107506737 107439102 107397194
2413.8 107397194 107481407 107530632 107577950 107573212 107427284 107324310 107242744 107290565 107417542 107491707 107482872
2424.5 107482872 107475517 107498062 107357224 107342209 107442657 107458366 107538437 107553894 107523262 107537056 107472641
2435.1 107472641 107449501 107569519 107628128 107540390 107533333 107604126 107489975 107513725 107632500 107515854 107496513
2445.7 107496513 107521339 107614662 107683121 107586517 107583321 107587090 107584419 107447899 107315437 107413849 107653473
$$ packed form
2372.4A07592720M46373j64139k03758K89352J97609j17653j47621k37953j73927o9321
2382A07411682l5324O4415L6377J64543J36841j09276j91963m1786O5193M3396K2530
2392.6A07566628j24993j7929J6304M5311R2682m2336J21155l9398j78490l9772M5838
2403.2A07445000O7756j34124J1688Q6334r0889n6366M4998J01410L0930o7635m1908
2413.8A07397194Q4213M9225M7318m738j45928j02974q1566M7821J26977P4165q835
2424.5A07482872p355K2545j40838j5015J00448J5709Q0071J5457l0632J3794o4415
2435.1A07472641k3140J20018N8609q7738p057P0793j14151K3750J18775j16646j9341
2445.7A07496513K4826R3323O8459r6604l196L769k671j36520j32462R8412K39624
$$ plain form
2456.3 107653473 107654221 107334473 107298576 107249954 107273674 107470039 107378159 107459175 107608269 107608109 107645363 107665504
2467.8 107665504 107600670 107547592 107641235 107583130 107417770 107397911 107351364 107322754 107474457 107455254 107338570
2478.5 107338570 107382378 107370529 107395187 107392166 107485046 107600266 107542465 107582573 107596481 107638786 107602013
2489.1 107602013 107532738 107522568 107478645 107636307 107530319 107226585 107234566 107325760 107390938 107511024 107572708
2499.7 107572708 107566040 107604355 107473793 107357903 107398537 107363876 107398331 107438866 107396492 107493431 107610016
2510.3 107610016 107529747 107566994 107638931 107460548 107248016 107185364 107317429 107320244 107270927 107372391 107287109
2520.9 107287109 107149666 107327240 107571976 107540894 107445992 107375931 107425697 107433952 107162392 107096245 107233566
2531.5 107233566 107311287 107295959 107358711 107503571 107407814 107333855 107436172 107480476 107261002 107111031 107373795
$$ packed form
2456.3A07653473P48l19748l5897m8622K3720J96365r1880Q1016J49094j60L7254K0141
2467.8A07665504o4834n3078R3643n8105j65360j9859m6547k8610J51703j9203j16684
2478.5A07338570M3808j1849K4658l021R2880J15220n7801M0108J3908M2305l6773
2489.1A07602013o9275j0170m3923J57662j05988l03734P981R1194O5178J20086O1684
2499.7A07572708o668L8315j30562j15890M0634l4661L4455M0535m2374R6939J16585
2510.3A07610016q0269L7247P1937j78383k12532o2652J32065K815m9317J01464q5282
2520.9A07287109j37443J77574K44736l1082r4902p0061M9766Q255k71560o6147J37321
2531.5A07233566P7721j5328O2752J44860r5757p3959J02317M4304k19474j49971K62764
$$ plain form
2542.1 107373795 107504791 107337387 107264610 107374840 107495110 107410179 107181625 107194229 107388680 107380234
2551.7 107380234 107220154 107208618 107380768 107403191 107360748 107374214 107330467 107273911 107231575 107335297 107420052
2562.4 107420052 107359764 107240669 107209869 107260246 107233025 107262482 107252800 107233551 107266579 107293167 107221436
2573 107221436 107090446 107133614 107109398 107088188 107130447 107289917 107469276 107318535 107286263 107337723 107312813
2583.6 107312813 107350861 107342712 107262215 107147430 107101631 107065994 107034103 107008362 107137863 107177414 107050217
2594.2 107050217 107121277 107047020 107010460 107125214 107173050 107116524 106927643 107102615 107370583 107318359 107220276
2604.8 107220276 107157661 107114975 107057564 106945351 106913399 107037422 107167778 107197250 107001099 106971664 107176262
2615.4 107176262 107095299 106968132 107011726 107118423 107027023 106870392 106960197 107073097 107078789 106968559 106921066
$$ packed form
2542.1A07373795J30996j67404p2777J10230J20270q4931k28554J2604J94451q446
2551.7A07380234j60080j1536J72150K2423m2443J3466m3747n6556m2336J03722Q4755
2562.4A07420052o0288j19095l0800N0377k7221K9457r682j9249L3028K6588p1731
2573A07221436j30990M3168k4216k1210M2259J59470J79359j50741l2272N1460k4910
2583.6A07312813L8048q149q0497j14785m5799l5637l1891k5741J29501L9551j27197
2594.2A07050217P1060p4257l6560J14754M7836n6526j88881J74972K67968n2224r8083
2604.8A07220276o2615m2686n7411j12213l1952J24023J30356K9472j96151k9435K04598
2615.4A07176262q0963j27167M3594J06697r1400j56631Q9805J12900N692j10230m7493
$$ plain form
2626 106921066 106835884 106828400 106997070 106915237 106866798 106956848 106949890 106796547 106672249 106842873 106964409
2636.6 106964409 106916580 106923096 106950783 106905373 106805420 106751022 106780731 106813599 106733559 106574379 106613716
2647.2 106613716 106981194 107051796 106653564 106560577 106741234 106695229 106623756 106709900 106823746 106824341 106656212
2657.8 106656212 106619461 106603683 106519562 106625755 106557487 106447449 106598732 106674370 106619705 106597404 106601250
2668.4 106601250 106575287 106599663 106551483 106441101 106426247 106417587 106354927 106290657 106407272 106548599 106526260
2679 106526260 106482666 106591042 106772484 106799255 106756142 106586037 106405533 106527550 106768730 106768517 106676651
2689.6 106676651 106801529 106844948 106717720 106640007 106767494 106830269 106644722 106736603 106759308 106571175
2699.3 106571175 106650955 106752769 106767075 106702217 106664536 106739319 106801414 106747459 106551636 106653770 106853081
$$ packed form
2626A06921066q5182p484J68670q1833m8439R0050o958j53343j24298J70624J21536
2636.6A06964409m7829O516K7687m5410r9953n4398K9709L2868q0040j59180L9337
2647.2A06613716L67478P0602l98232r2987J80657m6005p1473Q6144J13846N95j68129
2657.8A06656212l6751j5778q4121J06193o8268j10038J51283P5638n4665k2301L846
2668.4A06601250k5963K4376m8180j10382j4854q660o2660o4270J16615J41327k2339
2679A06526260m3594J08376J81442K6771m3113j70105j80504J22017K41180k13r1866
2689.6A06676651J24878M3419j27228p7713J27487O2775j85547R1881K2705j88133
2699.3A06571175P9780J01814J4306o4858l7681P4783O2095n3955j95823J02134J99311
$$ plain form
2709.9 106853081 106605568 106417046 106522949 106643204 106731461 106724907 106720123 106704285 106620758 106552559 106473343
2720.5 106473343 106455978 106477180 106493607 106507210 106542023 106621803 106495323 106242653 106260414 106427757 106363747
2731.1 106363747 106262695 106450272 106682846 106696541 106582840 106497688 106468658 106508354 106520195 106483315 106584282
2741.7 106584282 106703400 106640465 106560539 106593636 106615273 106558037 106409073 106398308 106570724 106551964 106425598
2752.3 106425598 106408287 106536491 106584526 106420883 106288933 106271355 106412804 106432167 106448639 106702072
2762 106702072 106727753 106628067 106619743 106573822 106467766 106344017 106296303 106319794 106317558 106253967 106261070 106283066
2773.5 106283066 106316734 106341362 106179924 106033928 105971779 105941170 106051224 106046158 105766663 105671616 105801262
2784.2 105801262 105861404 105897728 105784668 105650970 105616005 105456436 105306999 105300255 105310898 105197807 105066010
$$ packed form
2709.9A06853081k47513j88522J05903J20255Q8257o554m784j5838q3527o8199p9216
2720.5A06473343j7365K1202J6427J3603L4813P9780j26480k52670J7761J67343o4010
2731.1A06363747j01052J87577K32574J3695j13701q5152k9030L9696J1841l6880J00967
2741.7A06584282J19118o2935p9926L3097K1637n7236j48964j0765J72416j8760j26366
2752.3A06425598j7311J28204M8035j63643j31950j7578J41449J9363J6472K53433
2762A06702072K5681r9686q324m5921j06056j23749m7714K3491k236o3591P103K1996
2773.5A06283066L3668K4628j61438j45996o2149l0609J10054n066k79495r5047J29646
2784.2A05801262O0142L6324j13060j33698l4965j59569j49437o744J0643j13091j31797
$$ plain form
2794.8 105066010 105046898 105001389 105025719 105216255 105237007 105010063 104797508 104731628 104706017 104433228 104107254
2805.4 104107254 104035133 104001205 103916351 103815308 103546921 103233711 103084366 102874580 102662483 102609581
2815 102609581 102487259 102279465 101980721 101726746 101594276 101190063 100701561 100566681 100376335 99956108
2824.7 99956108 99557816 99004356 98493950 98131874 97616875 96988983 96330780 95749008 95052872 94160538
2834.3 94160538 93405174 92680763 91758308 90606628 89282982 87928970 86382423 84444252 82287437
2843 82287437 79925079 77287712 74373077 71227058 68122040 65137512 62221035 59559666 57305119
2851.7 57305119 55511589 54295292 53718288 53960342 54846542 56034779 57554333 59503395 61740215
2860.3 61740215 63893013 66031906 68399727 70640030 72296822 73444023 74440971 75392456 75927780
$$ packed form
2794.8A05066010j9112m5509K4330J90536K0752k26944k12555o5880k5611k72789l25974
2805.4A04107254p2121l3928q4854j01043k68387l13210j49345k09786k12097n2902
2815A02609581j22322k07794k98744k53975j32470m04213m88502j34880j90346m20227
2824.7I9956108l98292n53460n10406l62076n14999o27892o58203n81772o96136q92334
2834.3I4160538p55364p24411r22455j151680j323646j354012j546547j938171k156815
2843H2287437k362358k637367k914635l146019l105018k984528k916477k661369k254547
2851.7E7305119j793530j216297n77004K42054Q86200J188237J519554J949062K236820
2860.3F1740215K152798K138893K367821K240303J656792J147201R96948R51485N35324
$$ plain form
2869 75927780 76002541 76104843 76500336 77092804 77866692 78786362 79712296 80594421 81232338 81751961
2878.7 81751961 82210197 82484451 82682793 82539948 82241852 81986153 81587051 81116959 80592667 80023079
2888.3 80023079 79325752 78557968 77826790 77168793 76451172 75508537 74498047 73522224 72705238 71864021
2897.9 71864021 70870445 69871635 68874031 67924286 66889755 65764526 64582031 63455624 62374836
2906.6 62374836 61174370 59953896 58504509 57035362 55550983 53839485 52164703 50297920
2914.3 50297920 48449852 46744598 44968250 43183788 41406384 39872658 38579147 37552002
2922.1 37552002 36666256 36027676 35704586 35502228 35710663 35937485 36174477 36829319 37801128 38874752
2931.7 38874752 39969200 41348289 42883545 44487679 46162121 47950275 49789097 51482525
$$ packed form
2869G5927780P4761J02302L95493N92468P73888R19670R25934Q82125O37917N19623
2878.7H1751961M58236K74254J98342j42845k98096k55699l99102m70092n24292n69588
2888.3H0023079o97327p67784p31178o57997p17621r42635j010490r75823q16986q41217
2897.9G1864021r93576r98810r97604r49745j034531j125229j182495j126407j080788
2906.6F2374836j200466j220474j449387j469147j484379j711498j674782j866783
2914.3E0297920j848068j705254j776348j784462j777404j533726j293511j027145
2922.1C7552002q85746o38580l23090k02358K08435K26822K36992O54842R71809J073624
2931.7C8874752J094448J379089J535256J604134J674442J788154J838822J693428
$$ plain form
2939.4 51482525 53302807 55219368 56898853 58468513 60001793 61320015 62524300 63444389 64023003
2948.1 64023003 64491875 64774002 64996788 64965881 64674599 64581367 64561134 64552055 64753662 65258904 65957573
2958.7 65957573 66774445 67713570 68791290 70094528 71461060 72867523 74508667 76326401 78008011
2967.4 78008011 79491257 80885139 82121048 83184418 84195351 85178619 86009850 86647812 87240669
2976.1 87240669 87816948 88317650 88825371 89327477 89887390 90445824 90943642 91396912 91699684 92179016
2985.7 92179016 92785362 93349220 93829094 94042961 94324387 94547897 94633972 94730721 94671265 94584908
2995.3 94584908 94438469 94108269 93623146 93155373 92718712 92101616 91283821 90449745 89819130 89271469
3005 89271469 88786758 88385048 88015106 87876411 88078049 88780792 89648987 90271675 91056343 92226578
$$ packed form
2939.4E1482525J820282J916561J679485J569660J533280J318222J204285R20089N78614
2948.1F4023003M68872K82127K22786l0907k91282r3232k0233r079K01607N05242O98669
2958.7F5957573Q16872R39125J077720J303238J366532J406463J641144J817734J681610
2967.4G8008011J483246J393882J235909J063370J010933R83268Q31231O37962N92857
2976.1H7240669N76279N00702N07721N02106N59913N58434M97818M53270L02772M79332
2985.7I2179016O06346N63858M79874K13867K81426K23510Q6075R6749n9456q6357
2995.3I4584908j46439l30200m85123m67773m36661o17096q17795q34076o30615n47661
3005H9271469m84711m01710l69942j38695K01638P02743Q68195O22688P84668J170235
$$ plain form
3014.6 92226578 93537086 94772453 95890739 96921478 97923370 98809769 99576263 100448540 101372635
3023.3 101372635 101978455 102291580 102679810 103109421 103405533 103512627 103719429 104143616 104394897 104534996
3033 104534996 104646339 104708054 104900116 105148155 105307968 105288055 105226425 105372719 105471321 105535896 105805725
3043.6 105805725 105895279 105860199 105889076 105813599 105705620 105733482 106007866 106086014 105973091 106090187 106140732
3054.2 106140732 106121140 106206581 106233917 106155556 106062119 106096375 106170753 106050919 105926743 105972801 106172157
3064.8 106172157 106392075 106267052 106166901 106336151 106453941 106524033 106468872 106551552 106787743 106793884
3074.4 106793884 106598396 106459534 106563164 106650475 106642532 106694733 106797554 106749763 106655403 106876770 107005089
3085 107005089 106874176 106776794 106781479 106851898 106791954 106692062 106698837 106848061 107032295 107025146 107017502 107086876
$$ packed form
3014.6I2226578J310508J235367J118286J030739J001892Q86399P66494Q72277R24095
3023.3A01372635O05820L13125L88230M29611K96112J07094K06802M24187K51281J40099
3033A04534996J11343O1715J92062K48039J59813j9913o1630J46294R8602O4575K69829
3043.6A05805725Q9554l5080K8877p5477j07979K7862K74384P8148j12923J17096N0545
3054.2A06140732j9592Q5441K7336p8361r3437L4256P4378j19834j24176M6058J99356
3064.8A06172157K19918j25023j00151J69250J17790P0092n5161Q2680K36191O141
3074.4A06793884j95488j38862J03630Q7311p943N2201J02821m7791r4360K21367J28319
3085A07005089j30913r7382M685P0419n9944r9892O775J49224J84234p149p644O9374
$$ plain form
3096.6 107086876 106936134 106747391 106958908 107240143 107108383 106940468 106974686 107014465 107065552 107027390
3106.2 107027390 106954506 106952461 106867310 106881454 107008453 107042778 107045212 107018547 106909721 106898384 107141647
3116.9 107141647 107235664 107108704 107054604 106946030 106881531 106921242 106898132 106922264 106912552 106837357 106826485
3127.5 106826485 106852448 107057419 107135048 106822525 106613785 106656509 106787941 106909348 106967239 106797256
3137.1 106797256 106530869 106565941 106773247 106908714 106809502 106770195 106829117 106758308 106814415 106754402 106646019
3147.7 106646019 106707893 106777618 106768127 106722832 106809677 106852661 106878731 106790489 106641151 106574234 106589272
3158.3 106589272 106805672 106788147 106806343 106798248 106553917 106578621 106507133 106481567 106542717 106421791 106401764
3168.9 106401764 106270943 106092491 106193710 106368980 106469460 106590401 106472839 106296852 106476784 106608688
$$ packed form
3096.6A07086876j50742j88743K11517K81235j31760j67915L4218L9779N1087l8162
3106.2A07027390p2884k045q5151J4144J26999L4325K434k6665j08826j1337K43263
3116.9A07141647R4017j26960n4100j08574o4499L9711k3110K4132r712p5195j0872
3127.5A06826485K5963K04971P7629l12523k08740M2724J31432J21407N7891j69983
3137.1A06797256k66387L5072K07306J35467r9212l9307N8922p0809N6107o0013j08383
3147.7A06646019O1874O9725r491m5295Q6845M2984K6070q8242j49338o6917J5038
3158.3A06589272K16400j7525J8196q095k44331K4704p1488k5566O1150j20926k0027
3168.9A06401764j30821j78452J01219J75270J00480J20941j17562j75987J79932J31904
$$ plain form
3178.6 106608688 106475349 106158577 105910004 106067719 106268791 106233589 106162727 106041519 105958977 106051346
3188.2 106051346 106242729 106447205 106385674 106175301 106079430 106068092 106030212 105840508 105658859 105484734
3197.9 105484734 105522842 105803429 105926125 105909531 105792122 105595215 105532387 105733299 105844719 105855484
3207.5 105855484 105834106 105670921 105891655 106063797 105827103 105619751 105499504 105634010 105806824 105763130
3217.2 105763130 105637161 105575951 105512695 105444336 105479736 105424339 105356422 105394676 105414726 105402565 105368340
3227.8 105368340 105227325 105151787 105233986 105193237 105213089 105349442 105489769 105506805 105160919 104918106
3237.4 104918106 105022972 105117790 105007416 104888756 104894310 104897942 104963676 104974571 104878052 104849213 104858597
3248 104858597 104888023 104853355 104777405 104786507 104767708 104877838 104935379 104595215 104476288 104484390 104298927
$$ packed form
3178.6A06608688j33339l16772k48573J57715K01072l5202p0862j21208q2542R2369
3188.2A06051346J91383K04476o1531k10373r5871j1338l7880j89704j81649j74125
3197.9A05484734L8108K80587J22696j6594j17409j96907o2828K00912J11420J0765
3207.5A05855484k1378j63185K20734J72142k36694k07352j20247J34506J72814m3694
3217.2A05763130j25969o1210o3256o8359L5400n5397o7917L8254K0050j2161l4225
3227.8A05368340j41015p5538Q2199m0749J9852J36353J40327J7036l45886k42813
3237.4A04918106J04866R4818j10374j18660N554L632O5734J0895r6519k8839R384
3248A04858597K9426l4668p5950R102j8799J10130N7541l40164j18927Q102j85463
$$ plain form
3258.6 104298927 104320358 104478188 104496239 104237961 104206993 104550720 104681267 104618942 104578300 104597481 104551193
3269.2 104551193 104547264 104516350 104342651 104310715 104222954 104141632 104169899 104117157 104060204 103914520 103851845
3279.8 103851845 104058083 104087845 103814827 103752251 103867432 103910202 104042793 104052109 103915810 103896950 103793938
3290.4 103793938 103708961 103815659 103820419 103699417 103525108 103459076 103607132 103622833 103515411 103532875 103510742
3301 103510742 103411247 103473091 103529816 103600273 103673325 103510757 103537888 103502502 103347015 103435684 103282074
3311.7 103282074 103160271 103247421 103170158 103069611 103126419 103118950 103066124 103195969 102983604 102717728 102840462
3322.3 102840462 102810730 102768860 103006058 103178589 103019295 102855759 102851631 102929588 102997658 102925598 102880836
3332.9 102880836 102781624 102689339 102670624 102730843 102802673 102680122 102734024 102721153 102604431 102739838 102674049
$$ packed form
3258.6A04298927K1431J57830J8051k58278l0968L43727J30547o2325m0642J9181m6288
3269.2A04551193l929l0914j73699l1936q7761q1322K8267n2742n6953j45684o2675
3279.8A03851845K06238K9762k73018o2576J15181M2770J32591R316j36299j8860j03012
3290.4A03793938q4977J06698M760j21002j74309o6032J48056J5701j07422J7464k2133
3301A03510742r9495O1844N6725P0457P3052j62568K7131l5386j55487Q8669j53610
3311.7A03282074j21803Q7150p7263j00547N6808p469n2826J29845k12365k65876J22734
3322.3A02840462k9732m1870K37198J72531j59294j63536m128P7957O8070p2060m4762
3332.9A02880836r9212r2285j8715O0219P1830j22551N3902j2871j16722J35407o5789
$$ plain form
3343.5 102674049 102570831 102674156 102682434 102544220 102469894 102598022 102677139 102611252 102486382 102333397
3353.1 102333397 102205872 102072876 102067299 102106934 102181129 102324730 102106110 102021797 102264145 102118874
3362.8 102118874 101900177 101885796 102036324 102138298 102044571 102045242 102000114 101967102 101966675 101860870 101806267
3373.4 101806267 101819954 101858475 101753265 101564743 101519379 101548080 101567337 101632431 101808472 101995789 101834000
3384 101834000 101536568 101652344 101616226 101320007 101360855 101645355 101835320 101624069 101493034 101703156
3393.6 101703156 101627487 101387779 101223740 101150520 101283073 101399590 101372147 101363602 101246040 101093117
3403.3 101093117 101158768 101216118 101299667 101459755 101429680 101250946 101092728 101008209 101035011 101070259 100980347
3413.9 100980347 100886833 100857864 100948013 101055389 101047531 101106613 101199631 101214500 101130211 101144135 101247215
$$ packed form
3343.5A02674049j03218J03325Q278j38214p4326J28128P9117o5887j24870j52985
3353.1A02333397j27525j32996n577L9635P4195J43601k18620q4313K42348j45271
3362.8A02118874k18697j4381J50528J01974r3727O71m5128l3012m27j05805n4603
3373.4A01806267J3687L8521j05210j88522m5364K8701J9257O5094J76041J87317j61789
3384A01834000k97432J15776l6118k96219M0848K84500J89965k11251j31035K10122
3393.6A01703156p5669k39708j64039p3220J32553J16517k7443q545j17562j52923
3403.3A01093117O5651N7350Q3549J60088l0075j78734j58218q4519K6802L5248q9912
3413.9A00980347r3514k8969R0149J07376p858N9082R3018J4869q4289J3924J03080
$$ plain form
3424.5 101247215 101036201 100791031 100883049 101007416 101014687 101222923 101404518 101149643 100849182 100871872
3434.1 100871872 101104935 101093643 100878357 100827110 100842545 100818344 100737846 100863594 101081680 100904701
3443.8 100904701 100725334 100733932 100615982 100457542 100456558 100514816 100531570 100624153 100856819 100866066 100710945
3454.4 100710945 100701637 100759033 100735771 100644264 100786072 100884102 100706871 100636589 100749237 100885986 100654579
3465 100654579 100410271 100501205 100667747 100921501 100869087 100796387 100982147 100888123 100593704 100528954 100864883
3475.6 100864883 100887695 100683510 101042686 101397911 101289352 101157333 101156784 101092644 101039284 101111542 101285164
3486.2 101285164 101399643 101324310 101001328 100610329 100717583 100980049 101021706 101230927 101323265 101306999
3495.8 101306999 101323639 101230385 101202278 101420074 101561562 101297089 101404762 101714333 101623039 101642738
$$ packed form
3424.5A01247215k11014k45170R2018J24367P271K08236J81595k54875l00461K2690
3434.1A00871872K33063j1292k15286n1247J5435k4201q0498J25748K18086j76979
3443.8A00904701j79367Q598j17950j58440r84N8258J6754R2583K32666R247j55121
3454.4A00710945r308N7396k3262r1507J41808R8030j77231p0282J12648J36749k31407
3465A00654579k44308R0934J66542K53754n2414p2700J85760r4024k94419o4750L35929
3475.6A00864883K2812k04185L59176L55225j08559j32019n49o4140n3360P2258J73622
3486.2A01285164J14479p5333l22982l90999J07254K62466M1657K09221R2338j6266
3495.8A01306999J6640r3254k8107K17796J41488k64473J07673L09571r1294J9699
$$ plain form
3505.5 101642738 101595215 101626961 101663406 101616982 101835274 101839485 101780403 101848541 101959290 102012489 101733604
3516.1 101733604 101735428 102147751 102210098 101934685 101956001 102233139 102249870 102357239 102591003 102621353 102721367
3526.7 102721367 102727592 102565758 102368294 102461510 102755135 102692192 102685028 102794182 102833412 102976509 103050034
3537.3 103050034 103127129 103061974 102940788 103047203 103158463 103298592 103387352 103297478 103375526 103734177
3547 103734177 103966423 103934624 103942184 103997986 103943207 103807518 103985161 104226822 104286530 104473335 104580536
3557.6 104580536 104526611 104481178 104516235 104921539 105141045 104989784 104912621 104866608 105334587 106191452
3567.2 106191452 106207932 105924103 105772049 105597374 105595757 105809258 106108681 106179657 105876747 105686218
3576.9 105686218 105792160 105947662 106077896 106027061 105970222 106293884 106790642 106971649 106835670 106830772
$$ packed form
3505.5A01642738m7523L1746L6445m6424K18292M211n9082O8138J10749N3199k78885
3516.1A01733604J824M12323O2347k75413K1316K77138J6731J07369K33764L0350J00014
3526.7A02721367O225j61834j97464R3216K93625o2943p164J09154L9230J43097P3525
3537.3A03050034P7095o5155j21186J06415J11260J40129Q8760q9874P8048L58651
3547A03734177K32246l1799P560N5802n4779j35689J77643K41661N9708J86805J07201
3557.6A04580536n3925m5433L5057M05304K19506j51261p7163m6013M67979Q56865
3567.2A06191452J6480k83829j52054j74675j617K13501K99423P0976l02910j90529
3576.9A05686218J05942J55502J30234n0835n6839L23662M96758J81007j35979m898
$$ plain form
3586.5 106830772 106974388 106874603 106815018 106795547 106767670 106814171 106977226 107327820 107603683 107496696
3596.1 107496696 107285812 107341537 107405304 107348198 107461861 107547997 107407448 107290245 107465225 107733932
3605.8 107733932 107933945 108162605 108073128 107892357 107887848 107867744 108106438 108165611 108113976 108312302 108201790
3616.4 108201790 108218109 108412567 108537048 109120995 108948586 108402245 108256203 108142845 108148277 108474167
3626 108474167 108676643 108963295 109654121 109197258 109102203 109023933 108816727 108963295 108866699 108591133
3635.7 108591133 108521004 108494736 108604660 108637711 108578262 108606918 108795647 108937683 108740723 108594315
3645.3 108594315 108993637 110092834 110298943 110170105 110192390 109723595 109246742 108713112 108526840 108784004
3655 108784004 108911362 108941925 108924637 108962639 109008026 108886177 108823662 108833878 108880920 108831772 108727722
$$ packed form
3586.5A06830772J43616r9785n9585j9471k7877M6501J63055L50594K75863j06987
3596.1A07496696k10884N5725O3767n7106J13663Q6136j40549j17203J74980K68707
3605.8A07733932K00013K28660q9477j80771m509k0104K38694N9173n1635J98326j10512
3616.4A08201790J6319J94458J24481N83947j72409n46341j46042j13358N432L25890
3626A08474167K02476K86652O90826m56863r5055p8270k07206J46568r6596k75566
3635.7A08591133p0129k6268J09924L3051n9449K8656J88729J42036j96960j46408
3645.3A08594315L99322J099197K06109j28838K2285m68795m76853n33630j86272K57164
3655A08784004J27358L0563j7288L8002M5387j21849o2515J0216M7042m9148j04050
$$ plain form
3665.6 108727722 108813599 108869461 109001648 109369568 109663818 109959946 109650650 109157837 109069733 110286324
3675.2 110286324 110764053 110000229 109643463 109372826 109388573 109384949 109407379 109468971 109233772 109206551 109428909
3685.8 109428909 109556862 109946449 110400688 109681305 109217720 109445747 109372292 109245010 109299828 109327080
3695.5 109327080 109521713 109409813 109066444 109007034 109080437 109198250 109538353 109744385 109513023 109323746
3705.1 109323746 109434731 109439827 109326950 109614944 110326584 110030685 109419632 109540367 109556992 109334373
3714.8 109334373 109345528 109508530 109508636 109512184 109504761 109466423 109629913 110009865 109972305 109769386 109715645
3725.4 109715645 109709648 109709938 109525970 109462021 109680550 109996590 110503387 110380608 110141357 109689804 109577057
3736 109577057 110042694 109903419 109905556 110090729 110279358 110260483 109849556 109713333 110602936 109860626
$$ packed form
3665.6A08727722Q5877N5862J32187L67920K94250K96128l09296m92813q8104J216591
3675.2A10286324M77729p63824l56766k70637J5747l624K2430O1592k35199k7221K22358
3685.8A09428909J27953L89587M54239p19383m63585K28027p3455j27282N4818K7252
3695.5A09327080J94633j11900l43369n9410P3403J17813L40103K06032k31362j89277
3705.1A09323746J10985N096j12877K87994P11640k95899o11053J20735J6625k22619
3714.8A09334373J1155J63002J06L548p423l8338J63490L79952l7560k02919n3741
3725.4A09715645n997K90j83968o3949K18529L16040N06797j22779k39251m51553j12747
3736A09577057M65637j39275K137J85173J88629j8875m10927j36223Q89603p42310
$$ plain form
3745.6 109860626 109531960 109899521 109790077 109565018 110177902 110112640 110478043 110139107 109592567 109541382
3755.3 109541382 109606232 109589523 109552315 109698624 110117294 109886642 109534035 109493553 109457855 109545135 110029747
3765.9 110029747 110016899 109740211 109629761 109696938 109823738 109688637 109509224 109571594 109673492 109605431
3775.5 109605431 109691025 109710526 109574089 109757439 109933258 109698990 109547714 109687492 109782227 109754784
3785.2 109754784 109828476 109734726 109417679 109345978 109673164 109891876 109818504 109629616 109413155 109290558
3794.8 109290558 109385559 109429611 109484825 109734840 109666908 109898598 110894798 110421570 109951569 109577209
3804.4 109577209 109423264 109779541 110111137 109809082 109679207 109581505 109522301 109617340 109440331 109407532
3814.1 109407532 109742111 110122185 110581329 110390350 110158501 110198112 109958183 109623840 109891106 109962830
$$ packed form
3745.6A09860626l28666L67561j09444k25059O12884o5262L65403l38936n46540n1185
3755.3A09541382O4850j6709l7208J46309M18670k30652l52607m0482l5698Q7280M84612
3765.9A10029747j2848k76688j10450O7177J26800j35101j79413O2370J01898o8061
3775.5A09605431Q5594J9501j36437J83350J75819k34268j51276J39778R4735k7443
3785.2A09754784P3692r3750l17047p1701L27186K18712p3372j88888k16461j22597
3794.8A09290558R5001M4052N5214K50015o7932K31690R96200m73228m70001l74360
3804.4A09577209j53945L56277L31596l02055j29875r7702n9204R5039j77009l2799
3814.1A09407532L34579L80074M59144j90979k31849L9611k39929l34343K67266P1724
$$ plain form
3823.7 109962830 109941399 109938087 110059448 110176605 109865799 109712326 109884743 109835983 109766884 109880424
3833.4 109880424 109920425 109949509 109808914 109880356 110944435 110814857 110273972 110264565 110036301 109987228
3843 109987228 109951614 109669098 109560387 109458397 109603958 109847046 109979614 109944908 109996933 110711433
3852.7 110711433 110944496 110667755 110071045 109657532 109530266 109595459 109683022 109649452 109629875 109899155
3862.3 109899155 109874489 109805710 110661949 110820534 110125069 109746338 109840225 110626656 110756241 110059311
3871.9 110059311 109649117 109739510 109923676 109958000 109926308 109783058 109812767 109939850 110240410 110187775
3881.6 110187775 109745895 109695045 109777275 109766396 110253616 110130180 109755783 109590729 109815269 110427505
3891.2 110427505 110256493 109755760 109744347 109861656 109749100 109751518 110051743 110200569 109949593 109762512
$$ packed form
3823.7A09962830k1431l312J21361J17157l10806j53473J72417m8760o9099J13540
3833.4A09880424M0001K9084j40595P1442J064079j29578n40885r407k28264m9073
3843A09987228l5614k82516j08711j01990J45561K43088J32568l4706N2025P14500
3852.7A10711433K33063k76741n96710m13513j27266O5193Q7563l3570j9577K69280
3862.3A09899155k4666o8779Q56239J58585o95465l78731R3887P86431J29585o96930
3871.9A10059311m10194R0393J84166L4324l1692j43250K9709J27083L00560n2635
3881.6A10187775m41880n0850Q2230j0879M87220j23436l74397j65054K24540O12236
3891.2A10427505j71012n00733j1413J17309j12556K418L00225J48826k50976j87081
$$ plain form
3900.9 109762512 109956673 110312233 110229919 110220085 110362053 110297241 109874557 109632851 109819763 109726898
3910.5 109726898 109400208 109504822 110075584 110203979 109753357 109709686 110041931 109932594 109507309 109604660
3920.2 109604660 109963409 109792847 109817619 109904099 109967232 110051895 110064262 109892792 109486389 109637054
3929.8 109637054 109924080 109869797 109765259 109839645 109990898 109839951 109687340 109592857 109681801 109906425
3939.5 109906425 109892387 109769745 109927620 110328018 110198502 110152039 110200951 110076004 109963730 109664627
3949.1 109664627 109625511 109795036 109763000 109767540 109789497 109688316 109764244 110016418 109986023 109899170 109752220
3959.7 109752220 109695282 109827797 109855759 109976685 109915253 109763420 109672974 109512421 109640656 109813385
3969.3 109813385 109714325 109593079 109370529 109164062 109475395 109898346 110016716 110014839 109816414 109688889
$$ packed form
3900.9A09762512J94161L55560q2314r834J41968o4812m22684k41706J86912r2865
3910.5A09726898l26690J04614N70762J28395m50622m3671L32245j09337m25285R7351
3920.2A09604660L58749j70562K4772Q6480O3133Q4663J2367j71470m06403J50665
3929.8A09637054K87026n4283j04538P4386J51253j50947j52611r4483Q8944K24624
3939.5A09906425j4038j22642J57875M00398j29516m6463M8912j24947j12274k99103
3949.1A09664627l9116J69525l2036M540K1957j01181P5928K52174l0395q6853j46950
3959.7A09752220n6938J32515K7962J20926o1432j51833r0446j60553J28235J72729
3969.3A09813385r9060j21246k22550k06467L11333M22951J18370j877j98425j27525
$$ plain form
3979 109688889 109796471 109886719 109884010 109708244 109642525 109839127 109827888 109784248 109855797 109921135 110077538
3989.6 110077538 109874535 109732628 109993828 110140503 110069946 109803032 109698944 109735428 109782051 109720169
3999.2 109720169 109661034
4000.2 109661034
$$ packed form
3979A09688889J07582R0248k709j75766o5719J96602j1239m3640P1549O5338J56403
3989.6A10077538k03003j41907K61200J46675p0557k66914j04088L6484M6623o1882
3999.2A09720169n9135
4000.2A09661034
##END=$$ End of the data block
