##TITLE=$$ Begin of the data block
##JCAMP-DX=5.00 $$ ACD/SpecManager v 10.08
##SPECTROMETER/DATA SYSTEM=Varian
##DATE=19 Mar 2013 14:04:50
##DATA TYPE=INFRARED SPECTRUM
##DATA CLASS=XYDATA
##ORIGIN=
##OWNER=
##NPOINTS=3735
##FIRSTX=399.26403809
##LASTX=4000.35498047
##MAXX=4000.35498047
##MINX=399.26403809
##MAXY=341.46316528
##MINY=0.00000100
##XFACTOR=1.0000000000
##YFACTOR=0.000001000000000
##FIRSTY=10.86358643
##DELTAX=0.96440572
##XUNITS=1/CM
##YUNITS=TRANSMITTANCE
##XYDATA=(X++(Y..Y))
399.3A0863586UL30599579%Zl41463164K7061221P3578030%Wj00639251%TP4137351
$$ 10863586 10863586 10863586 341463165 341463165 341463165 341463165 341463165 341463165 341463165 341463165 341463165 1 27061222 100639252 100639252 100639252 100639252 100639252 100639252 1 1 1 74137352
421.4G4137352Q8504509q1226761o6674785j4740314%UK01288176j64174304%Tl7113872
$$ 74137352 162641861 81415100 14740315 1 1 1 1 201288177 37113873 37113873 37113873 1
433AO467465L5147890%p666095l3949260%T2Q0422324J07827736j15183037m0046509
$$ 1 6467466 41615356 41615356 33949261 1 1 1 1 1 1 1 1 1 1 1 1 1 1 1 1 1 1 1 1 1 1 1 80422325 188250061 73067024 33020515
462.9C3020515k952333m341858L4792494L5437221K6528161K0917717o8880433n63629
$$ 33020515 30068182 25726324 60518818 95956039 122484200 143401917 74521484 73957855
470.6G3957855N251244M0348091K0277451n7390496k7864914j789703J4595901n321113
$$ 73957855 79209099 119557190 139834641 82444145 54579231 52789528 67385429 62064316
478.3F2064316K4862015Q0370315k7170700r754822m0273941m7455116K2933220L4547630
$$ 62064316 86926331 167296646 140125946 130371124 90097183 42642067 65575287 100122917
486.1A00122917j6926262r886574K2893708R935936N140190K9652641K3440796l2403763
$$ 100122917 83196655 73310081 96203789 106139725 111279915 140932556 164373352 131969589
493.8A31969589m3374916O376480K3253052k0769279n098343K2025535k057754j8664894
$$ 131969589 88594673 94971153 118224205 97454926 92356583 114382118 112324364 93659470
501.5I3659470p422982L872338N974540L659264n658333K875015J4543045J0655266
$$ 93659470 86236488 90108826 96083366 99742630 94084297 96959312 111502357 122157623
509.2A22157623m391693j7070640M202842J4858178r819298j996460M128700l182442
$$ 122157623 117765930 100695290 104898132 119756310 109937012 107940552 112069252 108886810
516.9A08886810J916794m71565o394051l578521N20446K074890k478340j519165O601601
$$ 108886810 110803604 110332039 103937988 100359467 100879913 102954803 100476463 98957298 105558899
525.6A05558899j987557o832374M01382M566574J726632j155495O842041J738449p562546
$$ 105558899 103571342 96738968 97140350 101706924 103433556 102278061 109120102 110858551 103296005
534.3A03296005n532806n475685L503135R155175l06900o099495J012649N239685Q72223
$$ 103296005 97763199 92287514 95790649 104945824 104638924 98539429 99552078 104791763 105663986
543A05663986n60882l778092J86264J684006l887260J171066L591537J368119k658379
$$ 105663986 105103104 101325012 101511276 103195282 99308022 100479088 104070625 105438744 102780365
551.6A02780365n896805R80103L682960m249893k454391L165679J881554K651817K124848
$$ 102780365 96883560 97863663 101546623 97296730 94842339 98008018 99889572 102541389 104666237
560.3A04666237l015282j628105L107147J53260k583977J878578M16710l112930q66265
$$ 104666237 101650955 100022850 103129997 103283257 100699280 102577858 102994568 99881638 99015373
569I9015373Q18154Q45443o7444Q47001Q28903o65871j647835r67559J861305J099540
$$ 99015373 99833527 100678970 100611526 101458527 102287430 101621559 99973724 99006165 100867470 101967010
578.6A01967010Q95363j157028l444847J300430K74704j450943M89220o92841J26000
$$ 101967010 102862373 101705345 98260498 99560928 99835632 98384689 98873909 98181068 98307068
587.3I8307068k25868o93200j26670M28497K440918Q82896P6012q34862j468666k19711
$$ 98307068 98081200 97388000 97261330 97689827 100130745 101013641 101089653 100254791 98786125 98566414
597I8566414J03134J278397J158073J18774q45703O0334O12419j020592L9986N01121
$$ 98566414 98669548 99947945 101106018 101224792 100379089 100439423 101051842 100031250 100071236 100572357
606.6A00572357o92688j627907j258369m49547K613541N912025L88199l661674n72670
$$ 100572357 99879669 98251762 96993393 96543846 99157387 105069412 105457611 101795937 101223267
615.3A01223267O13174r15642N19203K000550k76589n27771j204498r76395p24006
$$ 101223267 101836441 100920799 101440002 103440552 103163963 102636192 101431694 100455299 99731293
624I9731293k460228O18660L084518J244171n62401j293457n77018J354774O554m94675
$$ 99731293 97271065 97889725 100974243 102218414 101656013 100362556 99785538 101140312 101146866 100652191
633.6A00652191J000321j300148R81964J390518k103386j255531K838J505409o5010
$$ 100652191 101652512 100352364 101334328 102724846 100621460 99365929 99368767 100874176 100809166
642.3A00809166r25064J010658K69615j823356m93569J972824P72416J719985Q11493
$$ 100809166 99884102 100894760 101164375 99341019 98847450 100820274 101592690 103312675 104124168
651A04124168r2231Q65387l080460k161468J194366J003387L82004J30448p20215j516571
$$ 104124168 104031937 104897324 101816864 99655396 100849762 101853149 102235153 102365601 101645386 100128815
660.6A00128815j342194m27948R31625J10589M08729N55351J329003M172340p327301
$$ 100128815 98786621 98358673 99290298 99400887 99809616 100364967 101693970 105866310 98539009
669.3I8539009k517990J081451K319992Q4511j763458k93381J59905P0755j469513
$$ 98539009 96021019 97102470 99422462 99506973 97743515 97450134 97610039 97680794 96211281
678I6211281p19910k34421j541702n65491J77697J627998K49390j321648q00301o11923
$$ 96211281 95491371 95256950 93715248 93149757 93327454 94955452 95204842 93883194 93082893 92470970
687.6I2470970O02356L42850O73836J57905m35554M27795r61037j121467N09758Q98048
$$ 92470970 93073326 93416176 94090012 94247917 93812363 94240158 93279121 92157654 92667412 93565460
697.3I3565460J96579j263641j141274M98734q44582q69415J025444j4084l88199r3818
$$ 93565460 93762039 92498398 91357124 91855858 91011276 90141861 91167305 91153221 90765022 90671204
706.9I0671204M95933j4656r15588k04583j085227j082764K94723Q03467r68033j762634
$$ 90671204 91167137 91152481 90236893 90032310 88947083 87864319 88159042 88962509 87994476 86231842
716.6H6231842K05513M19014j20781q42079j085953p63992j064133O7040J177566Q26317
$$ 86231842 86437355 86856369 86735588 85893509 84807556 84043564 82979431 83046471 84224037 85050354
726.2H5050354M69254Q514k6054J146240L05931m87236K021561K688690m89678j273285
$$ 85050354 85519608 85528122 85502068 86648308 86954239 86467003 88488564 91177254 90687576 89414291
735.8H9414291R95453J352677J134277O97227k3849Q06847J85646n39582P97646K235107
$$ 89414291 90409744 91762421 92896698 93593925 93570076 94376923 94562569 94022987 94820633 97055740
745.5I7055740O30341j440033l05717R53742J620400Q09151O38771Q27705j031219
$$ 97055740 97686081 96246048 95940331 96894073 98514473 99323624 99962395 100790100 99758881
754.2I9758881o33644l34534n5786Q66752j109581r77127J636620J595817M44466l93784
$$ 99758881 99125237 98790703 98734917 99601669 98492088 97514961 99151581 100747398 101191864 100798080
763.8A00798080j351669p0656J265816p9102l65341J17928m36402L34702k68188p93313
$$ 100798080 99446411 99375755 100641571 100562469 100197128 100315056 99878654 100213356 99945168 99151855
773.5I9151855K147927K029808K24899o36597j536888k25311M3320L18039j6945l15079
$$ 99151855 101299782 103329590 103554489 102917892 101381004 101155693 101199013 101517052 101500107 101185028
783.1A01185028O24039r14803o18027J280770J315971j235138j072342J978478k04895
$$ 101185028 101809067 100894264 100276237 101557007 102872978 101637840 100565498 102543976 102339081
791.8A02339081m31534R61166j66839O06209J47445m11468j22307J27464K58820p09450
$$ 102339081 101907547 102868713 102701874 103308083 103455528 103044060 102921753 103049217 103308037 102598587
801.4A02598587j46011J050132Q49465r84009j702614P05658J357208r70192j11145
$$ 102598587 102452576 103502708 104352173 103368164 101665550 102371208 103728416 102758224 102647079
810.1A02647079J926995L44337n22171j031494j609116Q2261M15748R66088J373764
$$ 102647079 104574074 104918411 104396240 103364746 101755630 101837891 102253639 103219727 104593491
818.8A04593491l71926r51576n48248K14767m67048o37734O64574M72969M65538q62679
$$ 104593491 104221565 103269989 102721741 102936508 102469460 101831726 102496300 102969269 103434807 102572128
828.4A02572128j569122k61322O42014J348365J10016r44465j074372m16694j35560
$$ 102572128 101003006 100741684 101383698 102732063 102842079 101897614 100823242 100406548 100270988
837.1A00270988q71429O95976Q26218J03134K42203j50528m89319j003036M01382K19627
$$ 100270988 99399559 100095535 100921753 101024887 101267090 101116562 100627243 99624207 100025589 100245216
846.8A00245216j152099l69339j74340N06836J322075k29568j529740j99653N11352
$$ 100245216 99093117 98723778 98549438 99056274 100378349 100148781 98619041 98419388 98930740
855.4I8930740K31400K44347K65350O15990n26993r35463L64624N90767K5772N1956
$$ 98930740 99162140 99406487 99671837 100287827 99760834 98825371 99189995 99780762 99806534 99858490
865.1I9858490O00418K54601n56214j025902l81675L29086j89476J98936Q78479L20145
$$ 99858490 100458908 100713509 100157295 99131393 98749718 99078804 98889328 99088264 99966743 100286888
874.7A00286888J94382L76816l96401m02511L19671M14803K02072Q7326K87323K09351
$$ 100286888 100481270 100858086 100461685 100059174 100378845 100793648 100995720 101083046 101370369 101579720
884.4A01579720M8698n65887m78379O58577M57497m39018n42870M6669Q9218L18154
$$ 101579720 101628418 101062531 100584152 101242729 101700226 101261208 100718338 100765007 100854225 101172379
894A01172379K71911m10820M20555O23917r53926j586304L75046J155533j17264j17752
$$ 101172379 101444290 101033470 101454025 102077942 101124016 99537712 99912758 101068291 100951027 100833275
903.7A00833275o68083p54258J28914N7114m26811j63910q6014n20523J88126k14623
$$ 100833275 100165192 99410934 99539848 99596962 99170151 99006241 98920227 98399704 98587830 98373207
913.3I8373207n65582R1835R17633Q77960j184753o14769K42881Q9104L66219m12110
$$ 98373207 97807625 97899460 98817093 99695053 98510300 97895531 98138412 98227516 98593735 98181625
922.9I8181625k50900O2264L20434m6974j24451P05292R6481l24195m56391J88286
$$ 98181625 97930725 97992989 98313423 98266449 98141998 98847290 98943771 98619576 98163185 98351471
932.6I8351471P66273l30932j84670M75823l16086k29256M33380k98568j48735M83207
$$ 98351471 99117744 98786812 98602142 99077965 98761879 98532623 98966003 98667435 98518700 99001907
942.2I9001907N0957m43642j75315L59077m04602o71173m64424k21344O36764J50872
$$ 99001907 99052864 98609222 98433907 98792984 98388382 97717209 97252785 97031441 97668205 97819077
951.9I7819077l92884K70302M83704l66738o00319N48829J375938Q9004j462432l99544
$$ 97819077 97426193 97696495 98180199 97813461 97213142 97761971 99137909 99226913 97764481 97364937
961.5I7364937M33029k90512n12055k48779J06423P9444J20270L09037r5391l12919
$$ 97364937 97797966 97507454 96995399 96746620 96853043 96932487 97052757 97361794 97266403 96953484
971.2I6953484J76055m2129j88316Q2748q93509q21884M91188P08374l2562n69466
$$ 96953484 97129539 97087410 96899094 96981842 96088333 95266449 95757637 96466011 96433449 95863983
980.8I5863983j41220r3872q17825o00083J73294J81687L57101j7540l67103P82982
$$ 95863983 95722763 95628891 94811066 94210983 94384277 94565964 94923065 94905525 94538422 95321404
990.5I5321404M28520p23435n02540M51164Q05389l59420l64487O35826J34422l10867
$$ 95321404 95749924 95026489 94523949 94975113 95780502 95421082 95056595 95692421 95826843 95515976
1000.1I5515976K39860l8322k79449P751k47337k10305l88832m96330q00697r92043
$$ 95515976 95755836 95717514 95438065 95445816 95198479 94988174 94599342 94103012 93302315 92310272
1009.7I2310272K56027M99276k47177j42769J72928m31885q25844o05568n72227Q9744
$$ 92310272 92566299 93065575 92818398 92675629 92848557 92416672 91590828 90985260 90413033 90502777
1019.4I0502777l39325j113762m92241j40510l93311r59541o57036q3115m76036o88156
$$ 90502777 90163452 89049690 88557449 88416939 88023628 87064087 86407051 86323936 85847900 85159744
1029H5159744q87352j020439l66264r7695k61177l20991j11977J89285j12037L39058
$$ 85159744 84272392 83251953 82885689 82787994 82526817 82205826 82093849 82283134 82171097 82510155
1038.7H2510155K3239m50890K93801J56868N85006M40590j1734M63677m5006l00781
$$ 82510155 82533394 82082504 82376305 82533173 83118179 83558769 83547035 84010712 83965706 83664925
1048.3H3664925j81733j21444K75482L18443m89525m4487J113099K69203J53183Q25378
$$ 83664925 83483192 83361748 83637230 83955673 83466148 83421661 84534760 84803963 84957146 85782524
1058H5782524K39075n72281k97737P69218O35895L56865L34518j79069L68179O56891
$$ 85782524 86021599 85449318 85151581 85920799 86556694 86913559 87248077 87069008 87437187 88094078
1067.6H8094078J02058k8472J00952Q55659j83830j558197L06457J123208o9108p93190
$$ 88094078 88196136 88167664 88268616 89124275 88940445 87382248 87688705 88811913 88742805 87949615
1077.2H7949615j113670p47719k83806J33378q0765o40183p48893p08184k57484K12303
$$ 87949615 86835945 86088226 85804420 85937798 85857033 85216850 84467957 83759773 83502289 83714592
1086.9H3714592l54698j221024o41395p92366j167199j66801Q354j67404l53210l58841
$$ 83714592 83359894 82138870 81497475 80705109 79537910 79371109 79379463 79212059 78858849 78500008
1096.5G8500008l85270n55290L05550J583320Q17620p96662N68169J333328J83960
$$ 78500008 78114738 77559448 77864998 79448318 80265938 79469276 80037445 81370773 81554733
1105.2H1554733k35168k80152K11426N03014P1449l46718m72320m42459q0994k95822
$$ 81554733 81319565 81039413 81250839 81753853 81825302 81478584 81006264 80563805 80482811 80186989
1114.9H0186989n73120j99883k45323k0454l71201m61761O90132J036270K10365K43530
$$ 80186989 79613869 79413986 79168663 79148209 78777008 78315247 79005379 80041649 80252014 80495544
1124.5H0495544R69681L60443O51459M71794j98456l86993j123772j39885k37442o96754
$$ 80495544 81465225 81825668 82477127 82948921 82750465 82363472 81239700 81099815 80862373 80165619
1134.1H0165619l91419q45077k57492m35555q53141o87241m77921k42492m9668l65799
$$ 80165619 79774200 78929123 78671631 78236076 77382935 76695694 76217773 75975281 75925613 75559814
1143.8G5559814r35951k86094k59484l84353n41237p19788q75358j273896o22413r78547
$$ 75559814 74623863 74337769 74078285 73693932 73152695 72432907 71557549 70283653 69661240 68682693
1153.4F8682693j138725q91205r46373q89022j057202o98936q20244k76337j91520
$$ 68682693 67543968 66652763 65706390 64817368 63760166 63061230 62240986 61964649 61773129
1162.1F1773129p59137r84836l64201M47735n54638k85324R567R7813M1267q24966
$$ 61773129 61013992 60029156 59664955 60112690 59558052 59272728 59282295 59380108 59421375 58596409
1171.8E8596409k13806J81911L56678j01417n37217n1723J92211m6829j62209M47415
$$ 58596409 58382603 58564514 58921192 58819775 58282558 58230835 58423046 58376217 58214008 58661423
1181.4E8661423M31709L64162J05080L93585R25637L86108L57918O55868P60868N38365
$$ 58661423 59093132 59457294 59562374 59955959 60881596 61267704 61625622 62281490 63042358 63580723
1191F3580723O11217M92012M50142M59633N91911J241707N41497O88934J040634N54672
$$ 63580723 64191940 64683952 65134094 65593727 66185638 67427345 67968842 68657776 69698410 70253082
1200.7G0253082N53917K80670N07195N92636L19672K43248M16870K35725K12021N67947
$$ 70253082 70806999 71087669 71594864 72187500 72507172 72750420 73167290 73403015 73615036 74182983
1210.3G4182983K40952L08098O4560O9267M82811L82553J12717l15689K43644M18633
$$ 74182983 74423935 74732033 74796593 74865860 75348671 75731224 75843941 75528252 75771896 76190529
1220G6190529K6268J56250J20926l15857m12720J25168q8562k70294p1594j57807l59794
$$ 76190529 76216797 76373047 76493973 76178116 75765396 75890564 75802002 75531708 75460114 75302307 74942513
1230.6G4942513k98943j44585k86545k4917j45798k95090n40626n96047j95076l56491
$$ 74942513 74643570 74498985 74212440 74187523 74041725 73746635 73206009 72609962 72414886 72058395
1240.2G2058395J3466J51871J61377k8839k11716O2912K25426O47178K37343M05838
$$ 72058395 72071861 72223732 72385109 72356270 72144554 72207466 72432892 73080070 73317413 73723251
1249.9G3723251N59525M19075P81898L42278K55592L06946J75781M723K72507M92866
$$ 73723251 74282776 74701851 75483749 75826027 76081619 76388565 76564346 76569069 76841576 77334442
1259.5G7334442N1079j07628o7543M63028K83844J45531M49089J45721K7512M188K96822
$$ 77334442 77385521 77277893 77210350 77673378 77957222 78102753 78551842 78697563 78725075 78729263 79026085
1270.1G9026085K80861J24916j68213j93848K99645K98034J06461l91724P2121O67564
$$ 79026085 79306946 79431862 79263649 79069801 79369446 79667480 79773941 79382217 79454338 80121902
1279.8H0121902N57480N51117K77893L72498M11888M98131N90790N35652L27522J48087
$$ 80121902 80679382 81230499 81508392 81880890 82292778 82790909 83381699 83917351 84244873 84392960
1289.4H4392960K00950j16211Q3016J17470k13547M2839J8860m31519n12360k36892
$$ 84392960 84593910 84477699 84560715 84678185 84464638 84507477 84526337 84094818 83582458 83345566
1299H3345566j40534J79581J34232k9084L64518M96131L22510J76811M92150K78358
$$ 83345566 83205032 83384613 83518845 83489761 83854279 84350410 84672920 84849731 85341881 85620239
1308.7H5620239p9742N6724J47622K64823K16294K12913k53677m23370M3708K15905
$$ 85620239 85540497 85597221 85744843 86009666 86225960 86438873 86185196 85761826 85805534 86021439
1318.3H6021439J45622J4244N3009O1821L77846L90930L01208L76145J43875M08791
$$ 86021439 86167061 86181305 86234314 86296135 86673981 87064911 87366119 87742264 87886139 88294930
1328H8294930O54983L63098j36070R224K89642k3010j12167k27761l85246q3847J93840
$$ 88294930 88949913 89313011 89176941 89186165 89475807 89452797 89340630 89112869 88727623 88643776 88837616
1338.6H8837616l80043n79559Q918j79008l08357m74945l58086n2780k40570j75087
$$ 88837616 88457573 87878014 87886932 87707924 87399567 86924622 86566536 86513756 86273186 86098099
1348.2H6098099j36391j25496J15685K40783J05423M52759P19406L98270J98990m6982
$$ 86098099 85961708 85836212 85951897 86192680 86298103 86750862 87470268 87868538 88067528 88020546
1357.9H8020546K7832p4921j46934j87233n34172j080071j232238r70864j072510j092903
$$ 88020546 88048378 87973457 87826523 87639290 87105118 86025047 84792809 83821945 82749435 81656532
1367.5H1656532r01313o25649n73837n45365j00715l60352l51387k23747m31481p9216
$$ 81656532 80755219 80129570 79555733 79010368 78909653 78549301 78197914 77974167 77542686 77463470
1377.2G7463470L49175J163963J191719J521118J655732J301300R02694O33309P32567
$$ 77463470 77812645 78976608 80168327 81689445 83345177 84646477 85549171 86182480 86915047
1385.8H6915047P85118O91490k36046q0490k9739j06606J52420q6014K39579N32409
$$ 86915047 87700165 88391655 88155609 88075119 88045380 87938774 88091194 88005180 88244759 88777168
1395.5H8777168Q8272j30684N6000M41109L72055O23108N90492O15128N05775M36447
$$ 88777168 88865440 88734756 88790756 89231865 89603920 90227028 90817520 91432648 91938423 92374870
1405.1I2374870K97913J62590K44568p9231k00203k72576m29008q38562o52870n57717
$$ 92374870 92672783 92835373 93079941 93000710 92800507 92527931 92098923 91260361 90607491 90049774
1414.8I0049774r13231n27961k58042J51932O93031l51448N6664K40593J27472J36070
$$ 90049774 89136543 88608582 88350540 88502472 89195503 88844055 88900719 89141312 89268784 89404854
1424.4H9404854J71287J07796k68318n14809n04127q63701m61136k03781q36304o65062
$$ 89404854 89576141 89683937 89415619 88900810 88396683 87532982 87071846 86868065 86031761 85366699
1434.1H5366699l49502m55857q84781o46102m45534p29553m11248n99853n44335l14750
$$ 85366699 85017197 84561340 83676559 83030457 82584923 81855370 81444122 80844269 80299934 79985184
1443.7G9985184o10733m72077l91594K7909l48320l45223n41687r28894r56360j552208
$$ 79985184 79374451 78902374 78510780 78538689 78190369 77845146 77303459 76374565 75418205 73865997
1453.3G3865997j000106j404519j005745j001129r93126O38245n97290J57120o02936
$$ 73865997 72865891 71461372 70455627 69454498 68461372 69099617 68502327 68659447 68056511
1462F8056511n8884K22054p27867r3697k47131J813171K455994M457565M318131L893096
$$ 68056511 67997627 68219681 67491814 67398117 67150986 68964157 71420151 75877716 80195847 84088943
1471.7H4088943N723748K342880J686760O13106J358757L03207K88513Q93494N65475
$$ 84088943 89812691 92155571 93842331 94455437 95814194 96117401 96405914 97299408 97864883
1480.3I7864883J062951M30175Q60085O77826L53599N09270N45326Q66722k4139R03931
$$ 97864883 98927834 99358009 100218094 100895920 101249519 101758789 102304115 103170837 103146698 104050629
1490A04050629m00040j71043L03444q5923M78974P19307O61239p34245k50130K7786
$$ 104050629 103650589 103479546 103782990 103697067 104176041 104895348 105556587 104822342 104572212 104599998
1499.6A04599998m9926K03323k44621K60597L29399M17885q05199k8808J155761o75468
$$ 104599998 104550072 104753395 104508774 104769371 105098770 105516655 104711456 104682648 105838409 105162941
1509.3A05162941K80869N6579K50939K77420l38387l19794M62021R94599q75084L40515
$$ 105162941 105443810 105500389 105751328 106028748 105690361 105370567 105832588 106827187 105952103 106292618
1518.9A06292618J66229m8469L91311p61886M51332j6503j2687P522l38333p0793K33520
$$ 106292618 106458847 106410378 106801689 106039803 106491135 106474632 106461945 106469467 106131134 106060341 106293861
1529.5A06293861J55259M5204K61413l26507N1193J07552J71783M01543J16089J154068
$$ 106293861 106449120 106494324 106755737 106429230 106480423 106587975 106759758 107161301 107277390 108431458
1539.2A08431458j366601P7988L59184p01675j31592m25384k4674O951l9643J8341
$$ 108431458 107064857 107142845 107502029 106800354 106668762 106243378 106218704 106225655 106186012 106204353
1548.8A06204353L21205J38024j73264K54784J35429l13545j11938M78324P53182J510040
$$ 106204353 106525558 106663582 106490318 106745102 106880531 106566986 106455048 106933372 107686554 109196594
1558.5A09196594K67647k953133j6845p6302J29761L5225O286K17125j11335J81846
$$ 109196594 109464241 106511108 106494263 106417961 106547722 106582947 106589233 106806358 106695023 106876869
1568.1A06876869N34622L12241p69249m52866j20147n0698L68218Q33801k15065o96525
$$ 106876869 107411491 107723732 106954483 106501617 106381470 106330772 106698990 107532791 107317726 106621201
1577.7A06621201k007k5566p7873J25793Q3862j58645k42714J60484J28128O7864l8986
$$ 106621201 106619194 106593628 106515755 106641548 106725410 106566765 106324051 106484535 106612663 106680527 106641541
1588.4A06641541n5932J33507j60095p1915j00845j13884J0567K63756J04171k71789
$$ 106641541 106585609 106719116 106559021 106487106 106386261 106272377 106282944 106546700 106650871 106379082
1598A06379082L6644k20116j48537R1591J6365l8643k6290J79435j15753O1653J76018
$$ 106379082 106415726 106195610 106047073 106138664 106155029 106116386 106090096 106269531 106153778 106215431 106391449
1608.6A06391449J37085m4548j62544k00386m23706K26600J34567l70956l38440J77445
$$ 106391449 106528534 106483986 106321442 106121056 105697350 105923950 106058517 105687561 105349121 105526566
1618.2A05526566K14477j69319Q7868J8867Q5526j13289l53012j05011j34545K74109
$$ 105526566 105741043 105571724 105659592 105678459 105763985 105650696 105297684 105192673 105058128 105332237
1627.9A05332237j00822Q6021J02242j69541o5643m0695M35814l91022p217n7465l00995
$$ 105332237 105231415 105317436 105419678 105250137 105184494 105143799 105579613 105188591 105181374 105123909 104822914
1638.5A04822914n8151o47591n11429j15562J95717J9028j19400j11481k58820j1352
$$ 104822914 104764763 104117172 103605743 103490181 103685898 103704926 103585526 103474045 103215225 103203873
1648.1A03203873m39690o0860Q5656Q72993J676430l976151Q69934r5405m8859N890
$$ 103203873 102764183 102703323 102788979 103661972 105338402 101362251 102232185 102136780 102087921 102093811
1657.8A02093811J08620J85905J85356J74286p6713K88192M4869j5740o7390m189J66352
$$ 102093811 102202431 102388336 102573692 102747978 102671265 102959457 103004326 102988586 102921196 102917007 103083359
1668.4A03083359o8321K77618Q5319l99856m89464N8891j4198m51713J9958j99692
$$ 103083359 103015038 103292656 103377975 102978119 102488655 102547546 102533348 102081635 102101593 101901901
1678A01901901J03333P339k44247k47589j20255p8544j473267K84546k88757j89637
$$ 101901901 102005234 102012573 101768326 101520737 101400482 101321938 99848671 100133217 99844460 99654823
1687.7I9654823m39300m95606n06889q70644o17576o37368k76199k76153j114747p31056
$$ 99654823 99215523 98719917 98213028 97342384 96724808 96087440 95811241 95535088 94420341 93689285
1697.3I3689285r13315j007606k387680q53485j23619n04418j026542j489060j299309
$$ 93689285 92775970 91768364 89380684 88527199 88403580 87899162 86872620 85383560 84084251
1706H4084251j451530j342987j194725j370003j827652j368790j090293j214638j113053
$$ 84084251 82632721 81289734 80095009 78725006 76897354 75528564 74438271 73223633 72110580
1714.7G2110580j147979j201477j368042j387345n57563o81557p91313o59607q95848
$$ 72110580 70962601 69761124 68393082 67005737 66448174 65766617 64975304 64315697 63419849
1723.4F3419849j022117j063450j331898j566650j753990j706562k548478k496364
$$ 63419849 62397732 61334282 60002384 58435734 56681744 54975182 52426704 49930340
1731.1D9930340j875523j718509l307469n717235o87241j363995r90211p91313p59266
$$ 49930340 48054817 46336308 43028839 37311604 36624363 35260368 34270157 33478844 32719578
1739.8C2719578n87662M2751J190972J034111J805324J283524K484325K496872K823899
$$ 32719578 32131916 32174667 33365639 34399750 36205074 37488598 39972923 42469795 45293694
1748.4D5293694L596233J993591M716374L364547L052975L501515L525741L851761
$$ 45293694 48889927 50883518 55599892 58964439 62017414 65518929 69044670 72896431
1756.2G2896431M213074L275505K020012K498787K001304L005509K068924Q25965J262703
$$ 72896431 77109505 80385010 82405022 84903809 86905113 89910622 91979546 92805511 94068214
1764.8I4068214Q72879R38759M76807J116920Q01117J96961Q92586O75178L54302J55891
$$ 94068214 94941093 95879852 96356659 97473579 98274696 98471657 99364243 100039421 100393723 100549614
1774.5A00549614M09401M35432L57605J42708J29273M89395J7898J90476K76535K32628
$$ 100549614 100959015 101394447 101752052 101894760 102024033 102513428 102531326 102721802 102998337 103230965
1784.1A03230965J50474Q9623J09459O5551K95548K61284L25958k7710K10442O3476
$$ 103230965 103381439 103471062 103580521 103646072 103941620 104202904 104528862 104501152 104711594 104775070
1793.8A04775070k88246K13135J73096K53692J36086j27678J07635l799J48536J88332
$$ 104775070 104486824 104699959 104873055 105126747 105262833 105135155 105242790 105238991 105387527 105575859
1803.4A05575859O7017J14204J53862L6354J0727q2062K5086M23515J2848k3499N135
$$ 105575859 105642876 105757080 105910942 105947296 105958023 105875961 105901047 106324562 106337410 106313911 106319046
1814A06319046o8207O6841N3589R9671k343o279Q1559K5734j53992J3435L87566k0722
$$ 106319046 106250839 106317680 106371269 106470940 106468597 106462318 106543877 106569611 106415619 106429054 106816620 106795898
1825.6A06795898k62260J55251K86499J36024o9412j21086j69182j69098N8685J58707
$$ 106795898 106533638 106688889 106975388 107111412 107042000 106920914 106751732 106582634 106641319 106800026
1835.2A06800026K4620J50536J08688j08765j75834k2583K26539K02347L45856m5143
$$ 106800026 106824646 106975182 107083870 106975105 106799271 106776688 107003227 107205574 107551430 107506287
1844.9A07506287j89095K25327J33918l05755l65479M4197L01133R7381j30157J0482
$$ 107506287 107317192 107542519 107676437 107370682 107005203 107049400 107350533 107447914 107317757 107328239
1854.5A07328239o3110j73576J62582J09902M8248J6685j02157J18606J70754q6090
$$ 107328239 107265129 107091553 107254135 107364037 107412285 107428970 107326813 107445419 107616173 107530083
1864.2A07530083j01570K25921K9541r9701J00266k47772j68938j09032N074J70028
$$ 107530083 107428513 107654434 107683975 107584274 107684540 107436768 107267830 107158798 107163872 107333900
1873.8A07333900L3204o035J08444k9526j84440j34415L9329K51549J7105j32019m9850
$$ 107333900 107367104 107361069 107469513 107439987 107255547 107121132 107160461 107412010 107429115 107297096 107247246
1884.4A07247246o8794J5571j846M600N7236J41815j7402Q049P8056j0826K68028L5599
$$ 107247246 107178452 107194023 107192177 107196777 107254013 107395828 107378426 107386475 107464531 107453705 107721733 107757332
1896A07757332j80832N8563q4320k41745p9399L3562j3291K31522J99356p5943j57860
$$ 107757332 107576500 107635063 107550743 107308998 107229599 107263161 107249870 107481392 107680748 107604805 107446945
1906.6A07446945j06544K56187J39038j46644m9912P4570L4347j8951N9692k1957L5477
$$ 107446945 107340401 107596588 107735626 107588982 107539070 107613640 107647987 107629036 107688728 107666771 107702248
1917.2A07702248o5125j41876J33751J03569l1914o3126o4895j00319l0060j7082L7178
$$ 107702248 107637123 107495247 107628998 107732567 107700653 107637527 107572632 107472313 107442253 107425171 107462349
1927.8A07462349J96739J06743p1259j56089l517P3982o0532j49765p980J30424r414
$$ 107462349 107659088 107765831 107694572 107538483 107534966 107608948 107548416 107398651 107390671 107521095 107511681
1938.4A07511681J2977p301k6589J0384j14311m2465K3422J53267J29394n1475J0055
$$ 107511681 107524658 107517357 107490768 107501152 107386841 107344376 107367798 107521065 107650459 107598984 107609039
1949A07609039P0381j16455j10397m9774o4316J05110J3031J39397J55945j73569m2763
$$ 107609039 107679420 107562965 107452568 107402794 107338478 107443588 107456619 107596016 107751961 107578392 107535629
1959.6A07535629j11122R567K70295p1824j03958J18241K1843n303o4560j94145l6499
$$ 107535629 107424507 107434074 107704369 107632545 107528587 107646828 107668671 107663368 107598808 107404663 107368164
1970.2A07368164P820J62293L25554l8331j84127l9284P3990K4994j69701l1067J98631
$$ 107368164 107375984 107538277 107863831 107825500 107641373 107602089 107676079 107701073 107531372 107500305 107698936
1980.8A07698936N2430L2501N8250j89315j21354j1093R2797M9530j40938L280r6916
$$ 107698936 107751366 107783867 107842117 107652802 107531448 107520355 107613152 107662682 107521744 107525024 107428108
1991.5A07428108J3947J36650O325k4773k10617j4343J97166J65367K0981j43036j5785
$$ 107428108 107442055 107578705 107585030 107560257 107349640 107335297 107532463 107697830 107718811 107575775 107559990
2002.1A07559990N2605R338P637M4800o6384j52740n7480Q4961K37518J25138j41487
$$ 107559990 107612595 107621933 107629570 107674370 107607986 107455246 107397766 107482727 107720245 107845383 107703896
2012.7A07703896j38329M4296j5602k7893m7043k3422M9171k04155n149Q5960j16516
$$ 107703896 107565567 107609863 107594261 107566368 107519325 107495903 107545074 107340919 107335770 107421730 107305214
2023.3A07305214P7179J06399K9152N6969N2773j51078j44462j15509j34880J87110
$$ 107305214 107382393 107488792 107517944 107574913 107627686 107476608 107332146 107216637 107081757 107268867
2032.9A07268867J29395j28151k11456P5401K69165J7365J12472J13953j36696j97388
$$ 107268867 107398262 107270111 107058655 107134056 107403221 107420586 107533058 107647011 107510315 107312927
2042.6A07312927L4790N8792j75903n5214P0625J60500J65840R7260K5245p1464j02158
$$ 107312927 107347717 107406509 107230606 107175392 107246017 107406517 107572357 107669617 107694862 107623398 107521240
2053.2A07521240j55807N8380J29135R5451J22261o2233j23916p9018J62338J51078
$$ 107521240 107365433 107423813 107552948 107648399 107770660 107708427 107584511 107505493 107667831 107818909
2062.8A07818909j34613n5168j25367j36444J52336p881p8918K28973N3001r6214J6625
$$ 107818909 107684296 107629128 107503761 107367317 107519653 107511772 107432854 107661827 107714828 107618614 107635239
2073.4A07635239j06263m3640o080q7914J34186J78619R9846Q7273k17217j89346K5276
$$ 107635239 107528976 107485336 107479256 107391342 107525528 107704147 107803993 107891266 107674049 107484703 107509979
2084A07509979k23457o2515L55148J08604k4383J32690m1572k5894K7183j02638r2385
$$ 107509979 107286522 107224007 107579155 107687759 107663376 107796066 107754494 107728600 107755783 107653145 107560760
2094.6A07560760L7552K33155l1845j97197j4214q141J82129J91185k0546m6249m0260
$$ 107560760 107598312 107831467 107799622 107602425 107588211 107580070 107762199 107953384 107932838 107886589 107846329
2105.2A07846329q8326L1388P1678r7954l5431n1201Q5488K16476K6291j17279j71478
$$ 107846329 107758003 107789391 107861069 107763115 107727684 107676483 107761971 107978447 108004738 107887459 107715981
2115.9A07715981M5951N1041N196L8131K9740R8900M3792J36971M2618j58287k44431
$$ 107715981 107761932 107812973 107818169 107856300 107886040 107984940 108028732 108165703 108208321 108050034 107805603
2126.5A07805603k3621J57044o5247K5078p4303j4076J82137p614j14518k16713k6008
$$ 107805603 107781982 107939026 107873779 107898857 107824554 107810478 107992615 107985001 107870483 107653770 107627762
2137.1A07627762J62773K48741J14151j10260Q339L624o6956j25206q4442p5782J67717
$$ 107627762 107790535 108039276 108153427 108043167 108051506 108055130 107988174 107862968 107778526 107702744 107870461
2147.7A07870461K62283j49468j37001o9648n761p3509j84654J42441L43017J35422
$$ 107870461 108132744 107983276 107846275 107776627 107770866 107697357 107512703 107655144 107998161 108133583
2157.3A08133583k14966q0520O9969J26243Q6739j86081q5846k5291M3380k8343j48140
$$ 108133583 107918617 107838097 107908066 108034309 108121048 107934967 107849121 107823830 107867210 107838867 107690727
2167.9A07690727m5990L0449L01697J42448q5510k3804j85485j64345k236p026j999
$$ 107690727 107644737 107675186 107976883 108119331 108033821 108010017 107824532 107660187 107657951 107650925 107648926
2178.5A07648926J1856m3205J22673K11967n19m7386P8583L3836k27005j54396J17531
$$ 107648926 107660782 107617577 107740250 107952217 107951698 107904312 107982895 108016731 107789726 107635330 107752861
2189.1A07752861O2965J0643J72959J60751n95m8202j11557p9155j3276O0837J49681
$$ 107752861 107815826 107826469 107999428 108160179 108159584 108111382 107999825 107920670 107907394 107968231 108117912
2199.8A08117912O7963l8445p6912p1197j6151J73873J12053j35666j20002l1861k1041
$$ 108117912 108185875 108147430 108070518 107999321 107983170 108157043 108269096 108133430 108013428 107981567 107960526
2210.4A07960526q7685R0057R8198o8954m891o4575J57906K42584j72409k40814M661
$$ 107960526 107872841 107962898 108061096 107992142 107987251 107922676 108080582 108323166 108150757 107909943 107914604
2221A07914604O8245q6479j09421J48094J83136j11007j3085J28578k7496o3423k8038
$$ 107914604 107982849 107896370 107786949 107935043 108118179 108007172 107994087 108122665 108095169 108031746 108003708
2231.6A08003708l4607j35834R9655J74576j76437j09825J67472K39151J9310r8892
$$ 108003708 107969101 107833267 107932922 108107498 107931061 107821236 107988708 108227859 108247169 108148277
2241.2A08148277j28555j03676J28441O5582j91696k08862J92703K80975j33957j90094
$$ 108148277 108019722 107916046 108044487 108110069 107918373 107709511 107902214 108183189 108049232 107859138
2250.9A07859138O2188J17851o2241l4454O2019Q8951j8394p7583R3040r6359j52901
$$ 107859138 107921326 108039177 107976936 107942482 108004501 108093452 108075058 107997475 108090515 107994156 107841255
2261.5A07841255J10687K04789M7241j27670J5777J16104J0445j17073N9006R0126
$$ 107841255 107951942 108156731 108203972 108076302 108092079 108208183 108218628 108101555 108160561 108250687
2271.1A08250687q4168P6798o050j20614O295q728j12862m0810J12549R5856j0246
$$ 108250687 108166519 108243317 108237267 108116653 108122948 108114220 108001358 107960548 108073097 108168953 108158707
2281.7A08158707j71593k8313J66092J6922j64192j72363J2893J09635R8366K7328
$$ 108158707 107987114 107958801 108124893 108141815 107977623 107805260 107818153 107927788 108026154 108053482
2291.4A08053482M0535o2050k10876P2227J60019N1285j81404k66587J72860K50312
$$ 108053482 108094017 108031967 107821091 107893318 108053337 108104622 107923218 107656631 107829491 108079803
2301A08079803P9026q1528j21765K12349K89902M234k38342L6110K45559o1210p6706
$$ 108079803 108158829 108077301 107955536 108167885 108457787 108462021 108223679 108259789 108505348 108444138 108367432
2311.6A08367432j81954j65756L06824J68327j98509j41953J51909K41028O981o0387
$$ 108367432 108185478 108019722 108326546 108494873 108296364 108154411 108306320 108547348 108554329 108493942
2321.3A08493942q8875P7675M30458K04758l24661P0976M67499m82002p33590K86095
$$ 108493942 108405067 108482742 108913200 109117958 108793297 108864273 109331772 108849770 108116180 108402275
2330.9A08402275N22904k36725o15166K2125O75995L25974k4598K68288j12289j33835
$$ 108402275 108925179 108688454 108073288 108095413 108771408 109097382 109072784 109341072 109228783 109094948
2340.6A09094948O6788P072J97723j51909k21496j82419j08147k28630r5008M28482
$$ 109094948 109161736 109168808 109366531 109214622 108993126 108810707 108702560 108473930 108378922 108807404
2350.2A08807404J08429p2022O5186j63346l60428M1962J308502M10561l36060p6217
$$ 108807404 108915833 108843811 108908997 108745651 108385223 108427185 109735687 110146248 109810188 109733971
2359.8A09733971M57359K08359j240494j43776O61057K74124n11185l36990q5221n90797
$$ 109733971 110191330 110399689 109159195 109015419 109676476 109950600 109439415 109102425 109017204 108426407
2369.5A08426407J49460k01210q8517O03013j17829l25569Q2100M4319j62857j3206
$$ 108426407 108575867 108374657 108286140 108889153 108771324 108445755 108527855 108572174 108409317 108396111
2379.1A08396111j39664j74423N6213m417j183R621P0228J12473k6322k27005j24855
$$ 108396111 108256447 108082024 108138237 108133820 108132637 108142258 108212486 108324959 108298637 108071632 107946777
2389.7A07946777P8125O9626J38054r2598j72432R056M4213L0464L6667J85684n4154
$$ 107946777 108024902 108094528 108232582 108139984 107967552 107976608 108020821 108051285 108087952 108273636 108219482
2400.3A08219482j21261J7464r2232p7744p2693P0496L6461m5555K2217L3706J42945
$$ 108219482 108098221 108115685 108023453 107945709 107873016 107943512 107979973 107934418 107956635 107990341 108133286
2410.9A08133286R7351k8847q6807k0508M1694K5605p3357j71265n4290k541L5828
$$ 108133286 108230637 108201790 108114983 108094475 108136169 108161774 108088417 107917152 107862862 107860321 107896149
2421.6A07896149J36558J72173L5698n1857n8808j30272J4222q034k0592J31760K4414
$$ 107896149 108032707 108204880 108240578 108188721 108129913 107999641 108013863 108005829 107985237 108116997 108141411
2432.2A08141411m5571j9714o3446N577K34947P4921j77628k5177J3260m768R4292
$$ 108141411 108095840 108076126 108012680 108018257 108253204 108328125 108150497 108125320 108138580 108133812 108228104
2442.8A08228104O652j78077j60897k9762J63803J32302l6881Q9890L2585j44196j72210
$$ 108228104 108234756 108056679 107895782 107866020 108029823 108162125 108125244 108215134 108247719 108103523 107931313
2453.4A07931313j22765R7794K58956K2049j91337n3147j49818l571J44951r1056J01097
$$ 107931313 107808548 107906342 108165298 108187347 107996010 107942863 107793045 107789474 107934425 107843369 107944466
2464A07944466J27792l4004k9244o0730K7970J63780M6738k74117j75346L2501L5126
$$ 107944466 108072258 108038254 108009010 107948280 107976250 108140030 108186768 107912651 107737305 107769806 107804932
2474.6A07804932J02226L2318k06657j43372Q6426n1415Q950J92527J45340M3984n5168
$$ 107804932 107907158 107939476 107732819 107589447 107675873 107624458 107633408 107825935 107971275 108015259 107960091
2485.2A07960091p607p5165L2631P0000r0324p8843p0037J49078L700k31438L0259
$$ 107960091 107952484 107877319 107909950 107979950 107889626 107810783 107740746 107889824 107893524 107662086 107692345
2495.8A07692345P2837l6697j3847N6625Q2276O7947j05133j92703M1877L3791n5183
$$ 107692345 107765182 107728485 107714638 107771263 107853539 107921486 107816353 107623650 107665527 107699318 107644135
2506.4A07644135N294j3527P6317J08589j5037q3252j46088j02592n4581L5698J63254
$$ 107644135 107649429 107635902 107712219 107820808 107805771 107722519 107576431 107473839 107419258 107454956 107618210
2517A07618210l6415k2965J42578j31836j98730J23489J48667m3991j17020p6775K02462
$$ 107618210 107581795 107558830 107701408 107569572 107370842 107494331 107642998 107599007 107481987 107405212 107607674
2527.6A07607674L7407l42705j5358J74766K6955j01814j3497J89675p1755r6687J69449
$$ 107607674 107645081 107302376 107287018 107461784 107488739 107386925 107373428 107563103 107491348 107394661 107564110
2538.2A07564110J1436j90880l1448J55731l3889j60500j7677L4195J13266M196k29935
$$ 107564110 107575546 107384666 107353218 107508949 107475060 107314560 107296883 107331078 107444344 107448540 107218605
2548.9A07218605m9637J59638J68701m3480j10863J82404L1852j63887j03920o1927
$$ 107218605 107168968 107328606 107497307 107453827 107342964 107525368 107557220 107393333 107289413 107227486
2558.5A07227486O9351P0282P0640N3109r0607j50253N6152Q4534j55930j23695L4744
$$ 107227486 107296837 107367119 107437759 107490868 107400261 107250008 107306160 107390694 107234764 107111069 107145813
2569.1A07145813J02188m7050p1312j07643j63788N7205N2956P3165K0768P5737J16012
$$ 107145813 107248001 107200951 107129639 107021996 106858208 106915413 106968369 107041534 107062302 107138039 107254051
2579.7A07254051j36352N2917L8460j93894j12533J02989P1030r3048K1537o6581r3323
$$ 107254051 107117699 107170616 107209076 107015182 106902649 107005638 107076668 106983620 107005157 106938576 106845253
2590.3A06845253k342P5615j396j62758m883k7954J10466J12442n7595L3661r4665
$$ 106845253 106842911 106918526 106917130 106754372 106749489 106721535 106832001 106944443 106886848 106920509 106825844
2600.9A06825844P0328J90742l6201j52924j39687L6736K3453j75232j67237Q3672
$$ 106825844 106896172 107086914 107050713 106897789 106758102 106794838 106818291 106643059 106475822 106559494
2610.6A06559494K20352J3848k40166n531K16712r9906j89949J5625Q7234k7077p2845
$$ 106559494 106779846 106793694 106553528 106547997 106764709 106664803 106474854 106490479 106577713 106550636 106477791
2621.2A06477791k0538k5208k44n1949k8602j9982L6316J587k05475L2166J50047j793
$$ 106477791 106457253 106432045 106431801 106379852 106351250 106331268 106367584 106369171 106163696 106195862 106345909 106344116
2632.8A06344116j22810k23526Q7372J43882j28944Q362J08757L502j09085j56525
$$ 106344116 106221306 105997780 106085152 106229034 106100090 106108452 106217209 106220711 106111626 105955101
2642.4A05955101L4569Q6342k5246j35201n1025K80251O7009l08876j15899J37520
$$ 105955101 105989670 106076012 106050766 105915565 105864540 106144791 106211800 105902924 105787025 105924545
2652A05924545P1389p7317q4671M5853R6336j22925o0699l4264j60736J4092q6556
$$ 105924545 105995934 105918617 105833946 105879799 105976135 105853210 105792511 105758247 105597511 105611603 105525047
2662.6A05525047m7699N5230n1034O9298J3214j36863o7063P9918p1487j78086J7411
$$ 105525047 105477348 105532578 105481544 105550842 105564056 105427193 105360130 105440048 105368561 105190475 105207886
2673.3A05207886M2480l1845l5339J18927J74461L0937j15097L5935K23724n5191j19934
$$ 105207886 105250366 105218521 105183182 105302109 105476570 105507507 105392410 105428345 105652069 105596878 105476944
2683.9A05476944j25206j76285J70700K80190j9348n6534J31553N974j0444P8529M0405
$$ 105476944 105351738 105175453 105346153 105626343 105606995 105550461 105682014 105687988 105677544 105756073 105796478
2694.5A05796478q7028j59073J73332M0222j43219J34186Q8883k9694j01364O1096
$$ 105796478 105709450 105550377 105723709 105763931 105620712 105754898 105843781 105814087 105712723 105773819
2704.1A05773819J84006k7596j79024k54898L6499K34085r0774k04941j4854L2287
$$ 105773819 105957825 105930229 105751205 105496307 105532806 105766891 105676117 105471176 105456322 105488609
2713.8A05488609o7901j7433P8598M9415J32622L3127k74369j68655O9550J7326j36398
$$ 105488609 105420708 105403275 105481873 105531288 105663910 105697037 105422668 105254013 105323563 105340889 105204491
2724.4A05204491p2197M9171j01112j44135j3504J8418J5602N2993J00182J30470Q896
$$ 105204491 105132294 105181465 105080353 104936218 104922714 104941132 104956734 105009727 105109909 105240379 105249275
2735A05249275p4318J15723l7079j51268R0637R7397J17798j4641r6954j0552j19377
$$ 105249275 105174957 105290680 105253601 105102333 105192970 105290367 105408165 105393524 105296570 105286018 105166641
2745.6A05166641m9957j5709k6825N1476L4027M0123o1028p3318J61964J48697q3725
$$ 105166641 105116684 105100975 105074150 105125626 105159653 105199776 105138748 105065430 105227394 105376091 105292366
2756.2A05292366k03911j62422P1526P5210N3169K40838n7015k47230J5380o1279j97327
$$ 105292366 105088455 104926033 104997559 105072769 105125938 105366776 105309761 105062531 105077911 105016632 104819305
2766.8A04819305j74079j31951P8560K2736j11588R7496L3096j25427j54632j86371
$$ 104819305 104645226 104513275 104591835 104614571 104502983 104600479 104633575 104508148 104353516 104167145
2776.4A04167145k9381j26015k43759L0640N5519k26692j49704J8333l1830j2245j87424
$$ 104167145 104137764 104011749 103767990 103798630 103854149 103627457 103477753 103496086 103464256 103452011 103264587
2787A03264587k48993j46667k15942j50040j30905J2749K2872k58277j92749j68183
$$ 103264587 103015594 102868927 102652985 102502945 102372040 102384789 102407661 102149384 101956635 101788452
2796.7A01788452r0469J39549m044k87193m09813k42065n8197k10739l43964k38434
$$ 101788452 101697983 101837532 101833488 101546295 101136482 100894417 100836220 100625481 100281517 100043083
2806.3A00043083k00996k67136k73575l31756l91152m67773m73656k19620j86912l66058
$$ 100043083 99842087 99574951 99301376 98969620 98578468 98110695 97637039 97417419 97230507 96864449
2816I6864449m09897m51355l67409l04039o10626q38364n03006l30994p79960r99466
$$ 96864449 96454552 96003197 95635788 95331749 94721123 93882759 93379753 93048759 92268799 91269333
2825.6I1269333q87787q08144p62413r43893j095718j053856j107201j224731j286194
$$ 91269333 90381546 89573402 88810989 87867096 86771378 85717522 84610321 83385590 82099396
2834.3H2099396j206917j214729j510903j904785k146965k065666k203957k652382
$$ 82099396 80892479 79677750 78166847 76262062 74115097 72049431 69845474 67193092
2842F7193092k947059l319714l540863l467358l399173l327568l083165k664112k269542
$$ 67193092 64246033 60926319 57385456 53918098 50518925 47191357 44108192 41444080 39174538
2850.7C9174538j984742j417709q10680m55967L12385O81908R58725J642948J764378
$$ 39174538 37189796 35772087 34961407 34505440 34817825 35499733 36458458 38101406 39865784
2859.4C9865784J907982K205257K322144K352779K330639K056103J405250J070644
$$ 39865784 41773766 43979023 46301167 48653946 50984585 53040688 54445938 55516582
2867.1E5516582R43062N28591K68059K18064L36826P31407J058392J175800J150772
$$ 55516582 56459644 56988235 57256294 57474358 57811184 58542591 59600983 60776783 61927555
2875.8F1927555J106918R68579P75711N43770J16821K083q9974k71316m29245p48329
$$ 61927555 63034473 64003052 64778763 65322533 65439354 65441437 65351463 65080147 64650902 63902573
2885.4F3902573o02013o42136r54692q63129r34799j000115r45919q49369r57992j317593
$$ 63902573 63300560 62658424 61703732 60840603 59905804 58905689 57959770 57110401 56152409 54834816
2895.1E4834816j165386r11045j037129j175823j125267r70863q77182j017815j238316
$$ 54834816 53669430 52758385 51721256 50545433 49420166 48449303 47572121 46554306 45315990
2903.7D5315990j171798j047886j091759j159454j178833j341652j390503j336430
$$ 45315990 44144192 43096306 42004547 40845093 39666260 38324608 36934105 35597675
2911.4C5597675j403034j326721j335426j223933j214037j288711j093027j075964
$$ 35597675 34194641 32867920 31532494 30308561 29094524 27805813 26712786 25636822
2919.2B5636822j010462r19064o09266m26165m62034j49095l8616O3198J81823L02826
$$ 25636822 24626360 23707296 23098030 22671865 22209831 22060736 22022120 22085318 22267141 22569967
2928.8B2569967N11956N67894M91907N41816R24317J104246J131550J268659J367701
$$ 22569967 23081923 23649817 24141724 24683540 25607857 26712103 27843653 29112312 30480013
2937.5C0480013J292602J395361J573773J500778J410782J222526J259175J352840
$$ 30480013 31772615 33167976 34741749 36242527 37653309 38875835 40135010 41487850
2945.2D1487850J209606R18541N96009M23706J97017P0740j59653k46826n2547p7191
$$ 41487850 42697456 43615997 44212006 44635712 44832729 44903469 44743816 44496990 44444443 44367252
2954.8D4367252N5718L37288O01108P14829Q44398J112606J319203J548820J699776
$$ 44367252 44422970 44760258 45361366 46076195 46920593 48033199 49352402 50901222 52600998
2963.5E2600998J892219J963582J891120K016854K058124J675942J524544J691993
$$ 52600998 54493217 56456799 58347919 60364773 62422897 64098839 65623383 67315376
2971.2F7315376J517876J225159J086074J142952J120415Q39607O87142Q41530Q44642
$$ 67315376 68833252 70058411 71144485 72287437 73407852 74247459 74934601 75776131 76620773
2979.9G6620773P03476P71378P74711Q41645Q37341P77031P57675N50202N78628N18921
$$ 76620773 77324249 78095627 78870338 79711983 80549324 81326355 82084030 82634232 83212860 83731781
2989.6H3731781L27187J53640R0760J29547k48451k77977k02279o49879q92014q25630
$$ 83731781 84058968 84212608 84303368 84432915 84184464 83906487 83704208 83054329 82162315 81336685
2999.2H1336685p75856r78309j093400j002563j043266j043968o94222k75421k60910
$$ 81336685 80560829 79582520 78489120 77486557 76443291 75399323 74705101 74429680 74168770
3007.9G4168770r8503N36873J118667J111687R70405J371682J867538K039002J884498
$$ 74168770 74070267 74607140 75725807 76837494 77807899 79179581 81047119 83086121 84970619
3016.6H4970619J750710J653969J690086J595528J226684J231331J229500R68246P53762
$$ 84970619 86721329 88375298 90065384 91660912 92887596 94118927 95348427 96316673 97070435
3025.2I7070435O96868O33385M96529M85161M69184N96100O21140K99301K9755Q5479
$$ 97070435 97767303 98400688 98897217 99382378 99851562 100447662 101068802 101368103 101397858 101483337
3034.9A01483337M52706M08699J48018J59736J30555J24542k3041M6967L78448K34314
$$ 101483337 101936043 102344742 102492760 102652496 102783051 102907593 102884552 102931519 103309967 103544281
3044.5A03544281J81465J56105j24397r2712O4376J48095M1664J39053L39577r8687
$$ 103544281 103725746 103881851 103757454 103664742 103729118 103877213 103918877 104057930 104397507 104298820
3054.2A04298820k18139J35734J1338j34018R0362K15546J1558j26251r2598n8632
$$ 104298820 104080681 104216415 104227753 104093735 104184097 104399643 104411201 104284950 104192352 104133720
3063.8A04133720J71135K62101R033L5942K09038N2688j30539j610K75521J94244o7268
$$ 104133720 104304855 104566956 104575989 104611931 104820969 104873657 104743118 104741508 105017029 105211273 105144005
3074.4A05144005q4336k7610J20384J93939P9025M8493J32614J29585R957J04644J04180
$$ 105144005 105059669 105032059 105152443 105346382 105425407 105473900 105606514 105736099 105746056 105850700 105954880
3085A05954880j10138j13877j853J15936l8857q4694K22283J38962q8974r2415P6584
$$ 105954880 105844742 105730865 105729012 105844948 105806091 105721397 105943680 106082642 105993668 105901253 105977837
3095.6A05977837J95785p8621j02600L23860K97692j03249j43333q8768J8623P980
$$ 105977837 106173622 106095001 105992401 106316261 106613953 106510704 106367371 106278603 106297226 106305206
3105.3A06305206k45750j02295R9823P2273L4752O8352J00815l9704k5871R1499K12944
$$ 106305206 106059456 105957161 106056984 106129257 106164009 106232361 106333176 106293472 106267601 106359100 106572044
3115.9A06572044J68198r8618k47093l20366j69883J64619K62436O2386k3995j56654
$$ 106572044 106740242 106641624 106394531 106074165 105904282 106068901 106331337 106393723 106369728 106213074
3125.5A06213074j16852J49269J14609K17262j5320l53760k48939k960K81051P0855
$$ 106213074 106096222 106245491 106360100 106577362 106562042 106208282 105959343 105956383 106237434 106308289
3135.2A06308289L0975j49109k44431K27318J79558m0924k62672M5105K87880r0104
$$ 106308289 106339264 106190155 105945724 106173042 106352600 106311676 106049004 106094109 106381989 106291885
3144.8A06291885j29943j05011O3232m6532l9459J68053P0045O2966j23734m5288k9388
$$ 106291885 106161942 106056931 106120163 106073631 106034172 106202225 106272270 106335236 106211502 106166214 106136826
3155.4A06136826m1077k1683j4236J92421j76613k1332J75682k18399j31622j3138
$$ 106136826 106095749 106074066 106059830 106252251 106075638 106054306 106229988 106011589 105879967 105866829
3165.1A05866829R2064Q2779j35048k44354q5602J4572K5238J56639L3157j8097m6325
$$ 105866829 105958893 106041672 105906624 105662270 105576668 105591240 105616478 105773117 105806274 105788177 105741852
3175.7A05741852R9312K81776l6735k61704l09708j33133P8499K3575K7931J9661o4033
$$ 105741852 105841164 106122940 106086205 105824501 105514793 105381660 105460159 105483734 105511665 105531326 105467293
3186.3A05467293p9109o1753J01227K16515m2870j10123n073J5587p6508k54410p3410
$$ 105467293 105388184 105326431 105427658 105644173 105601303 105491180 105486107 105501694 105425186 105170776 105097366
3196.9A05097366k8473n5793J28151J58859j9188k81509k18544J13113L01247K0797
$$ 105097366 105068893 105013100 105141251 105300110 105280922 104999413 104780869 104893982 105195229 105216026
3206.5A05216026r1972J5541j86417k7847J52474n8724k17850j2596J87615N2551P3883
$$ 105216026 105124054 105139595 104953178 104925331 105077805 105019081 104801231 104788635 104976250 105028801 105102684
3217.2A05102684k4277k30056j52894O3622Q7524k7710j2214M822n181K0539Q377j71685
$$ 105102684 105078407 104848351 104695457 104759079 104846603 104818893 104806679 104811501 104806320 104826859 104835236 104663551
3228.7A04663551n3611m2679k44469R5390J35987M6547j48819l89267J34079K69462
$$ 104663551 104609940 104567261 104322792 104418182 104554169 104600716 104451897 104062630 104196709 104466171
3238.4A04466171j29936l21495j61530M2489N1460O2774j6784p6615m8622J98555J49185
$$ 104466171 104336235 104014740 103853210 103895699 103947159 104009933 103993149 103916534 103867912 104066467 104215652
3249A04215652q6570J6357j50741j48034J297r6275n9471p6126j25313j10344o7322
$$ 104215652 104129082 104145439 103994698 103846664 103847961 103751686 103692215 103616089 103490776 103380432 103313110
3259.6A03313110P2968J03958r3597q1673J08902J3336j28029k7046O3583o6330M6578
$$ 103313110 103386078 103490036 103396439 103314766 103423668 103437004 103308975 103281929 103345512 103279182 103325760
3270.2A03325760J52855j16509k540l2639k72644j3672n5710j6838Q0185j78878O2896
$$ 103325760 103478615 103362106 103359566 103326927 103054283 103040611 102984901 102968063 103048248 102869370 102932266
3280.8A02932266o6017l71406p0214K1996Q5762O9618k0622l609l2341m4487J305Q5777
$$ 102932266 102866249 102494843 102424629 102446625 102532387 102602005 102581383 102577774 102545433 102500946 102502251 102588028
3292.4A02588028j92703k95540n4505Q7677M9393j27144m3670n3421j36353l1273J36574
$$ 102588028 102395325 102099785 102045280 102132957 102182350 102055206 102011536 101958115 101821762 101790489 101927063
3303A01927063R2041l3936L2921o7520j4580l12088k92900L96347L7453j96411L7598
$$ 101927063 102019104 101985168 102018089 101950569 101935989 101623901 101331001 101727348 101764801 101568390 101605988
3313.6A01605988j97907j38206J63597j9158j93786N5580o4911k4551K3353k75421
$$ 101605988 101408081 101269875 101433472 101414314 101220528 101276108 101211197 101186646 101209999 100934578
3323.2A00934578m4098P7148K7703J03767K2469o1493O210R6741j10977j99478n7129
$$ 100934578 100890480 100967628 100995331 101099098 101121567 101060074 101066284 101163025 101052048 100852570 100795441
3333.8A00795441j09276j57692P17J9943p1930j4831m2145N2002J53313j53961k17553
$$ 100795441 100686165 100528473 100529190 100549133 100477203 100462372 100420227 100472229 100625542 100471581 100254028
3344.4A00254028M6357o3530j32683m898J1970J56548N8510k00432k07703j19980p9056
$$ 100254028 100300385 100236855 100104172 100099274 100111244 100267792 100326302 100125870 99918167 99798187 99719131
3355.1I9719131o3423R827k1194J411r2850r1629P1320j46919l9719J21879r1598j06483
$$ 99719131 99655708 99665535 99644341 99645752 99552902 99461273 99532593 99385674 99345955 99467834 99376236 99269753
3366.6I9269753j3306p118o2912j53j5053q4472j9417l197m8164j11000j00365j23863
$$ 99269753 99256447 99249329 99186417 99186264 99171211 99086739 99067322 99064125 99015961 98904961 98804596 98680733
3378.2I8680733j67939m6798N5511J37833K19429j65451k25037J90674k55615m55940
$$ 98680733 98512794 98465996 98521507 98659340 98878769 98713318 98488281 98678955 98423340 97967400
3387.8I7967400R468K53540J91902k12784o8504K52830m9347k46429j81053n2719J27189
$$ 97967400 97976868 98230408 98422310 98209526 98141022 98393852 98344505 98098076 97917023 97864304 97991493
3398.4I7991493Q9897k33352k32926q9073J6319N6977j54503L9535J97510q8821j19637
$$ 97991493 98081390 97848038 97615112 97526039 97542358 97599335 97444832 97484367 97681877 97593056 97473419
3409.1I7473419k6871j39778J4023J70044k07741k72331r125O1058Q8677N6183j00045
$$ 97473419 97446548 97306770 97320793 97490837 97283096 97010765 97001640 97062698 97151375 97207558 97107513
3419.7I7107513j56356P6538J37954K6543q6777j93443k99355j21398K18818L6927
$$ 97107513 96951157 97027695 97165649 97192192 97105415 96911972 96612617 96491219 96710037 96746964
3429.3I6746964M2312O1028j49941q3000m3861J31630l2303l01720j02043O4735k7694
$$ 96746964 96789276 96850304 96700363 96617363 96573502 96705132 96672829 96371109 96269066 96333801 96306107
3439.9I6306107j84258J9783J89301M493k35328j14510J81587k9556j48888m4998o1462
$$ 96306107 96121849 96141632 96330933 96335426 96100098 95985588 96167175 96137619 95988731 95943733 95882271
3450.5I5882271j274K0530p6294M0062J27198m4129j11702j72996M0161J10939j57967
$$ 95882271 95880997 95901527 95825233 95865295 95992493 95948364 95836662 95663666 95703827 95814766 95656799
3461.1I5656799j21246R8618J13388l32268j63727K37968Q1490J08353P1220K31041
$$ 95656799 95535553 95634171 95747559 95415291 95251564 95489532 95571022 95679375 95750595 95981636
3470.8I5981636J17401l18374l08556m6455L62381J56250j31775J81388K55806m6623
$$ 95981636 96099037 95780663 95472107 95425652 95788033 95944283 95812508 95993896 96249702 96203079
3480.4I6203079J8921M3907j74698R8053P9949k0371M8104l7377j11099j92795J23253
$$ 96203079 96222000 96265907 96091209 96189262 96269211 96248840 96296944 96259567 96148468 95955673 96078926
3491I6078926j5884j48224K47513J44539J63566K0081k18041R1393K60803k1942j95168
$$ 96078926 96063042 95914818 96162331 96306870 96470436 96490517 96272476 96363869 96624672 96602730 96407562
3501.6I6407562K17888J83510j50810L1746J2359k06J51894P6820m5265j4084n203
$$ 96407562 96625450 96808960 96658150 96689896 96702255 96702049 96853943 96930763 96885498 96871414 96866211
3512.2I6866211J55685K01653j31874k58743Q2939L54652J16615j81839M822J70738
$$ 96866211 97021896 97223549 97091675 96832932 96915871 97270523 97387138 97205299 97210121 97380859
3521.9I7380859J7456J16280Q7547N8724K28149o5727o226M9157Q1268K87865j52581
$$ 97380859 97398315 97514595 97602142 97660866 97889015 97823288 97817062 97866219 97947487 98235352 98082771
3532.5I8082771p2014K46705K02468J55724J3908J21659m2412o2554K78397K42706
$$ 98082771 98010757 98257462 98459930 98615654 98629562 98751221 98708809 98646255 98924652 99167358
3542.1I9167358P9537R491N0758J68381K32368Q0376M1603K58026M27758J10160m11392
$$ 99167358 99246895 99256386 99307144 99475525 99707893 99788269 99829872 100087898 100515656 100625816 100214424
3552.7A00214424J43562K57988l1463L46977K62535j09428q47K76871N07370K59391
$$ 100214424 100357986 100615974 100584511 100931488 101194023 101084595 101083748 101360619 101867989 102127380
3562.4A02127380k35427j03074M17389O14464M86130j51550k73240K20742p1526p7667
$$ 102127380 101891953 101788879 102206268 102820732 103306862 103155312 102882072 103102814 103031288 102953621
3572A02953621L84621L50006k7954l16948k5017K27157J67229K22458j07307j23009
$$ 102953621 103338242 103688248 103660294 103343346 103318329 103545486 103712715 103935173 103827866 103704857
3581.7A03704857M37408M46839R6183J02433J99875K49794L2737l66859n4306K52464
$$ 103704857 104142265 104589104 104685287 104787720 104987595 105237389 105270126 104903267 104848961 105101425
3591.3A05101425K68624J39289J10833K33566j60362j04424M10988K04124j18530J663
$$ 105101425 105370049 105509338 105620171 105853737 105693375 105588951 105999939 106204063 106085533 106087196
3601A06087196J98510P0159j49993J64184K42539k5399J10245R6359p7453l0167J18790
$$ 106087196 106285706 106355865 106205872 106370056 106612595 106587196 106697441 106793800 106716347 106686180 106804970
3611.6A06804970K65716m8355j5991p7759j07544L34572J21590l8712N56069q7845
$$ 106804970 107070686 107022331 107006340 106928581 106821037 107155609 107277199 107238487 107794556 107706711
3621.2A07706711m18518j74385j3146N6977K57682L84652M07608K83935q10181k0095
$$ 107706711 107288193 107113808 107100662 107157639 107415321 107799973 108207581 108491516 107681335 107661240
3630.9A07661240R3124M2274J82038j9081J07795Q7555p8323m3045o7986N2994o149
$$ 107661240 107754364 107796638 107978676 107959595 108067390 108154945 108076622 108033577 107965591 108018585 108012436
3641.5A08012436J8722J67557k4284L4469M63150O56342m77234k75543M34395j07300
$$ 108012436 108031158 108198715 108174431 108208900 108672050 109328392 108851158 108575615 109010010 108902710
3651.1A08902710n30991k79647K5932K01759J10367l51715j05766K22107J38496K6421
$$ 108902710 108371719 108092072 108118004 108319763 108430130 108078415 107972649 108194756 108333252 108359673
3660.8A08359673j160L58L4943J1253o7939o9290K15194M60678K25373k8099J03698
$$ 108359673 108358513 108358871 108393814 108405067 108337128 108267838 108483032 108943710 109169083 109140984 109244682
3671.4A09244682l11386l00125M14879J068504o41533m75212k8709J07727j78833j11176
$$ 109244682 108933296 108633171 109048050 110116554 109475021 108999809 108971100 109078827 108899994 108788818
3681A08788818K21245P2502k04208j69586Q0963K76237P69799M24369j230163k10251
$$ 108788818 109010063 109082565 108878357 108708771 108789734 109065971 109835770 110260139 109029976 108819725
3690.6A08819725J28090k19315J75408J68617K6222J26061j34918j86570j25595r407
$$ 108819725 108947815 108728500 108903908 109072525 109098747 109224808 109089890 108903320 108777725 108768318
3700.3A08768318L93097N83450L0922l15864j75148m952j70059p4364J12969K88750
$$ 108768318 109161415 109744865 109775787 109459923 109284775 109279823 109109764 109035400 109148369 109437119
3709.9A09437119J73652R461p0809j74286l25340j53610J01143N4153R9411o950n3337
$$ 109437119 109610771 109620232 109549423 109375137 109049797 108896187 108997330 109051483 109150894 109143944 109090607
3720.5A09090607M39109O41259l28278m75998l23112m4388K83882P622j35399J36032
$$ 109090607 109529716 110170975 109842697 109366699 109043587 108999199 109283081 109290703 109155304 109291336
3730.2A09291336L36769J58768k18315N55938N75058j123565O782K45056j72691l219
$$ 109291336 109628105 109786873 109568558 110124496 110699554 109575989 109582771 109827827 109655136 109651917
3739.8A09651917k9603j72081j26289J94771R23866r00780j19110L22358l27286o01570
$$ 109651917 109622314 109450233 109323944 109518715 110442581 109541801 109422691 109745049 109417763 108816193
3749.5A08816193P21725L95989K70927l49449m20311m2595K0523j15257J90239Q5891
$$ 108816193 109537918 109933907 110204834 109855385 109435074 109392479 109413002 109297745 109487984 109573875
3759.1A09573875j83677K0523K8221o599k32522M6082N83023k36893l29689O4629j44547
$$ 109573875 109390198 109410721 109438942 109432343 109199821 109245903 109828926 109592033 109262344 109326973 109182426
3769.7A09182426k94006J70570K31766J48567q079j26282Q8303K670j75308J43684
$$ 109182426 108888420 109058990 109290756 109439323 109431244 109304962 109393265 109395935 109220627 109364311
3779.4A09364311k113j35048L4790R4582J17881j7593o0562k16263k64984J77154M31344
$$ 109364311 109362198 109227150 109261940 109356522 109474403 109456810 109396248 109179985 108915001 109092155 109523499
3790A09523499K40371j40976l25325j85081R3727L97911O3675l44162j1025K08428
$$ 109523499 109763870 109622894 109297569 109112488 109206215 109604126 109667801 109323639 109312614 109521042
3799.6A09521042P33421O01532q87344n18906m76738N768M66782j25801j85143K97195
$$ 109521042 110254463 110855995 109968651 109449745 108973007 108978775 109445557 109319756 109134613 109431808
3809.3A09431808k4765j72431J11244l07251k66762M72916L24600r0187J95694R6084
$$ 109431808 109407043 109234612 109345856 109038605 108771843 109244759 109569359 109479172 109674866 109770950
3818.9A09770950K58339M47678n36896o33720j72470R4650J83800K41424J4916k12487
$$ 109770950 110029289 110476967 109940071 109306351 109133881 109228531 109412331 109653755 109668671 109456184
3828.6A09456184j33308J46652L26706l99475j15715M91028K96211j25717J48003Q5014
$$ 109456184 109322876 109469528 109796234 109396759 109281044 109772072 110068283 109942566 110090569 110175583
3838.2A10175583o03027j23490j71249r4025L90511J9584l63632j81373j24871O2348
$$ 110175583 109572556 109449066 109277817 109183792 109574303 109593887 109230255 109048882 108924011 108986359
3847.8A08986359J22635R5779J54381M84848M81643M14391o90208q42911J10710j52016
$$ 108986359 109108994 109204773 109359154 109844002 110325645 110740036 110049828 109206917 109317627 109165611
3857.5A09165611r8404p8300j14113N04776M23378k27859j48736J17974r6749l54713
$$ 109165611 109067207 108988907 108874794 109379570 109802948 109575089 109426353 109544327 109447578 109092865
3867.1A09092865m242M96460Q82622l26042p24198j32652J93397l27247r23J33957
$$ 109092865 109088623 109585083 110467705 110141663 109417465 109284813 109478210 109150963 109150040 109283997
3876.8A09283997j2818P6988k8595j89994l25508p8644K81822L29689K67242j39328
$$ 109283997 109271179 109348167 109319572 109129578 108804070 108725426 109007248 109336937 109604179 109464851
3886.4A09464851k13295n7815m532J45485J97952l46474j75605L24844L7926k44744
$$ 109464851 109251556 109193741 109189209 109334694 109532646 109186172 109010567 109335411 109373337 109128593
3896.1A09128593j12083K20657K30065n96657l4981K43462J99707N23628N0934k49947
$$ 109128593 109016510 109237167 109467232 108870575 108835594 109079056 109278763 109802391 109853325 109603378
3905.7A09603378n4916l86162k89047K03018J40534j66932K6650K91946L1975j54007
$$ 109603378 109548462 109162300 108873253 109076271 109216805 109049873 109076523 109368469 109400444 109246437
3915.3A09246437J91139J13831l93303m01550m7188K56035M7386J60026K32270K9922
$$ 109246437 109437576 109551407 109158104 108756554 108709366 108965401 109012787 109172813 109405083 109435005
3925A09435005r1301Q2749k17369l63205J66648l0288N7968K87086J14251K3078m57145
$$ 109435005 109343704 109426453 109209084 108845879 109012527 108982239 109040207 109327293 109441544 109464622 109007477
3935.6A09007477k78191R3933K29981K85362m4022l21724j04324J59622j6113Q3672
$$ 109007477 108729286 108823219 109053200 109338562 109294540 108972816 108868492 109028114 109012001 109095673
3945.2A09095673o8596M677P2189k22801N5877j07391k36252r4040j663J74980L63938
$$ 109095673 109027077 109031754 109103943 108881142 108937019 108829628 108593376 108499336 108497673 108672653 109036591
3955.8A09036591J39030k65236J14082j59179k82463K98744P4127j27319j06697J86020
$$ 109036591 109175621 108910385 109024467 108865288 108582825 108881569 108955696 108828377 108721680 108907700
3965.5A08907700O0539l26767k3148J4900j51367k55348j83365Q3496L05535L72680
$$ 108907700 108968239 108641472 108618324 108633224 108481857 108226509 108043144 108126640 108432175 108804855
3975.1A08804855J26305Q7646j16622l58101N5771L60511J62659j58234j74667J2985
$$ 108804855 108931160 109018806 108902184 108544083 108599854 108960365 109123024 108964790 108790123 108803108
3984.8A08803108j47995o912J16791r6176J26709m6830p7224K92961J07322k11814
$$ 108803108 108655113 108648201 108764992 108668816 108795525 108748695 108671471 108964432 109071754 108859940
3994.4A08859940l35404r7175N4916K38068J04934j85592
$$ 108859940 108524536 108427361 108482277 108720345 108825279 108639687
4000.2A08639687
$$ 108639687
##END=$$ End of the data block
