##TITLE=$$ Begin of the data block
##JCAMP-DX=5.00 $$ ACD/SpecManager v 10.08
##SPECTROMETER/DATA SYSTEM=Varian
##DATE=19 Mar 2013 14:17:52
##DATA TYPE=INFRARED SPECTRUM
##DATA CLASS=XYDATA
##ORIGIN=
##OWNER=
##NPOINTS=3735
##FIRSTX=399.26403809
##LASTX=4000.35498047
##MAXX=4000.35498047
##MINX=399.26403809
##MAXY=249.54127502
##MINY=0.00000100
##XFACTOR=1.0000000000
##YFACTOR=0.000001000000000
##FIRSTY=0.00000100
##DELTAX=0.96440572
##XUNITS=1/CM
##YUNITS=TRANSMITTANCE
##XYDATA=(X++(Y..Y))
399.3 1 1 1 1 1 1 1 1 1 1 1 1 1 1 6844095 6844095 6844095 6844095 6844095 6844095 130021301 130021301 1 1069594 145753311 64341019 10939655 53313232
425.3 53313232 55095154 171122757 171122757 1 1 1 1 213778259 101448997 131931885 131931885 74040985
436.9 74040985 1 1 1 1 1 1 1 1 1 1 1 1 1 1 1 1 1 1 1 1 1 1 79462502 41482845 109048767 24303417 28477854 53625469
463.9 53625469 62214516 75352287 84102730 154553482 249541275 94598984 60058807 111506401
471.6 111506401 175384766 137760696 97230972 96281563 101561104 83976685 69487747 64474281
479.3 64474281 72478241 119641335 122370697 106936424 74704231 81902649 103807129 81665329
487 81665329 91619225 124160095 140632751 142696411 148414948 178506836 156843658 100648338
494.7 100648338 92112564 120689751 107677101 97003471 116738434 102694405 98829453 112481148
502.5 112481148 102763000 100066475 102282127 107968857 112952019 109327515 112862854 112469604 105537102
511.1 105537102 110723457 111983482 100081947 99976646 106738823 114008171 119637131 115214035
518.9 115214035 111729393 109852013 102003059 102742310 106218399 103100212 107070358 106622993 103961006
527.5 103961006 104837975 106392059 107675400 102482750 104993279 103462181 96576172 97585793 97085716
536.2 97085716 103634171 111436707 107228004 101426224 106815598 114416138 112672470 113917809 107115227
544.9 107115227 101418137 104435516 102788467 106468689 111145737 113912987 110932686 104460716
552.6 104460716 105851471 105794846 102354904 100185753 98966148 97872574 101407845 107498268 103312775
561.3 103312775 102591942 109334267 106793312 101592720 103823174 107214607 105416840 104665268 107842697
570 107842697 108510803 107891113 106869194 103520966 104297340 103469070 101788116 103871109 102826767
578.6 102826767 104361893 103931877 102005867 105504646 106540466 106665131 107807045 109049629 106243980
587.3 106243980 101542099 100728012 100125694 101054443 102665840 105796158 107025528 105583412 105221268
596 105221268 101466797 101509750 104084755 105774445 108619171 107181946 105288513 104469643 106266380
604.7 106266380 109516541 109455421 105973709 101689056 101639259 102063232 104234085 109103081 110144257
613.4 110144257 109899857 110098564 107728203 103254051 104614189 108177124 108162376 109168610 107838097
622 107838097 106490646 105358452 102118324 101640915 103415665 106030251 107173470 105913544 103736725
630.7 103736725 104787720 107814308 106437096 105930748 106926926 107830215 107108421 103389839 103735222
639.4 103735222 105076477 104977386 104493324 103317223 106112839 107074791 103555595 103155067 104810509
648.1 104810509 106599106 108587463 108084625 108322258 109581772 106722649 105194473 106232697 104996788
656.8 104996788 104418900 105877151 107199730 105758224 102152626 100634850 101698563 103268326 104576111
665.4 104576111 105505760 108456886 114556038 106143593 101495468 102621040 105965729 105874458 104420677
674.1 104420677 103945351 103615662 103151573 102678932 102923462 102972305 101187622 100421921 102664818 103296326
683.8 103296326 102897820 105701782 106631020 104404228 103775284 103918091 104390762 104808723 104336426
692.4 104336426 104892342 104596947 102851158 102534225 103062248 103357132 103420341 103767387 103387978 101609795
702.1 101609795 101178734 101745659 102377083 103249664 103255051 103342064 103955864 103842545 102386879 101256035
711.7 101256035 101381706 102601639 103912048 102274994 100664429 100589317 99922600 100432045 100553833
720.4 100553833 99804916 98960815 97117187 97952461 100120338 99981239 100109299 100302010 99757324
729.1 99757324 99249649 98969666 99878113 102182480 104615685 104290451 103639427 103548859 102575569 103574203
738.7 103574203 103801254 102746841 103033691 103977699 105133934 105455627 106436874 105969009 103727951
747.4 103727951 103241600 105181931 108124336 107535660 106909485 107470039 105992210 105478310 105114967
756.1 105114967 104913170 105458214 105272247 104708443 105026314 105995377 105590500 104783516 103671997 103726723
765.7 103726723 105405411 105549477 105777557 106446419 106741104 107147400 106119942 105524277 107206520
774.4 107206520 108171631 108315849 109175842 109137619 108064445 106717972 106452187 106254288 105754478 106443481
784.1 106443481 105342628 104260796 105436539 105867134 105180229 106125664 108822968 108005569 106228691
792.7 106228691 106796661 106752747 107862419 108829514 108112991 107721985 107738434 108026535 107289864 107563881
802.4 107563881 108903458 108268112 107441429 106901115 107142090 108311691 108131561 108528282 109114944
811.1 109114944 108573029 108705536 107524948 106168976 106762680 106833618 107382614 108645470 108203064
819.7 108203064 107131447 106918427 107332603 107396591 106855446 106320518 106601212 107394241 106916153 106389603
829.4 106389603 106984619 107899750 108844292 108634064 107897087 107515907 107548576 107181526 106172760 106983650
839 106983650 107182640 105952652 106716110 107839287 107442795 106393700 106691292 107449699 107035843 106618156
848.7 106618156 105636452 105428078 107225761 107626579 105856987 105338783 106187393 106806351 107581352
857.4 107581352 107577866 106837669 105859322 104956970 105674492 106231560 105760986 106229706 107493507 108390366
867 108390366 107995972 106558533 105479256 105914520 106810394 107175270 108201988 108383522 107240936
875.7 107240936 106865822 106554115 106065285 106328766 107247154 107624397 107433411 107500351 106936287 106493263
885.3 106493263 106396156 106636963 107864166 107871048 106914902 106622620 107002571 107885788 108198174 107752281
895 107752281 107277863 107578575 108198860 107811943 106733643 106528854 107676994 108960175 108791580 106912666
904.6 106912666 105993431 107039131 108151611 108350082 108080841 107739426 106805824 106464233 106576210
913.3 106576210 105842918 105280388 105894012 107495377 106963417 105408043 106168221 107004044 107185631
922 107185631 106659142 105564903 105871834 106428535 106039749 105852776 106745804 107614525 106966774 106232529
931.6 106232529 106782822 107398933 106983543 106706299 107449654 107618095 107182434 107162003 106933739 107111389
941.3 107111389 107805199 108166756 107738091 107039375 107110527 106560913 106077454 106366356 106315094 107117531
950.9 107117531 107448174 106858383 107367493 107659332 106532181 105561340 106502991 108252708 108421616
959.6 108421616 107239769 106879143 107315987 106994522 106544205 106494225 106902466 107062164 106590500 106614471
969.2 106614471 106403107 106337936 106751862 106722382 107343895 107499748 105924980 105010063 106008919 107072128
978.9 107072128 106964317 106937569 107295029 106888519 105859711 105852654 106187790 105981056 106959938 107212822
988.5 107212822 106322105 106476776 106006660 105542709 105501083 105537117 106683510 106819260 106265274 106468788
998.2 106468788 106367134 105960815 105725990 105954247 106451744 106656944 106016403 105615082 105835976 105666336
1007.8 105666336 105551788 104834953 104892998 106176285 105867966 105355431 105185112 104405365 104304123 104442993
1017.5 104442993 103795639 103518150 103895500 103851097 104376762 104682930 104088509 104024696 103833824 103497025
1027.1 103497025 102758018 102140549 101771774 101066284 101355614 101672264 102103477 102299042 101577835 101325279
1036.7 101325279 101564194 102663300 102356636 101215996 100952423 100916985 102588722 103147102 102248917
1045.4 102248917 102123520 101714577 101331375 101046181 101199440 101825508 102780174 103008835 102566444 102948517
1055.1 102948517 103198425 103591751 103877213 103845779 103668793 103038857 103349632 103571320 103465584 103793343
1064.7 103793343 104188416 104729843 104570885 104395744 104439720 104389900 105116966 104976074 103688957 103901237
1074.4 103901237 104984413 104925606 104257584 103634056 103254807 103192421 103573441 103729630 102912407 102543739
1084 102543739 102460289 101858841 101969490 102509338 102525589 102440170 101870338 100995110 101258736 101697250
1093.6 101697250 101112373 100574516 100717377 100778923 100099190 100093346 101304039 101576332 100890465 101089989
1103.3 101089989 101560081 101596748 101626938 100932678 100616463 101948586 102401398 101732147 101761200 101949600
1112.9 101949600 102193367 101864670 100726776 100300125 100642326 100905754 100657036 100386009 100626358
1121.6 100626358 100859764 101180328 101850304 102004845 101739456 102306252 102733376 102163300 101596634 101634483
1131.2 101634483 102289612 102205673 101278351 101060341 101355186 101502480 101069870 100293663 99882973 99767372
1140.9 99767372 99948303 100285286 100431168 100113579 99347664 98933884 98613281 98119148 98126839 97409370
1150.5 97409370 96217834 96381813 96798882 96226006 95178444 94615410 94231712 93434433 92721687
1159.2 92721687 92819229 93484940 92810707 91779373 91697281 91883278 92379478 92176117 91635010 91586128
1168.9 91586128 91650848 91204102 90284416 90685989 91863327 92041489 91530563 90810829 90408356 90669586
1178.5 90669586 90716225 90556526 90954994 91483025 91568634 91018494 90705605 91457245 92442162 92897720
1188.1 92897720 93146286 93051064 93142998 93958862 94091934 94058922 94379677 94730484 95313713 95321205 95801743
1198.8 95801743 96549568 96649467 97095222 97584183 97946022 98145317 98077484 98165092 98224457 98087692
1208.4 98087692 98327583 98670815 98622459 98912102 98797417 98446915 98791145 98761162 98774704 99082565
1218 99082565 99332115 99786446 99725616 99641388 99877716 99656860 99351768 99292252 99514404 99680054 99576576
1228.6 99576576 99441521 99160767 98915649 98665604 98683807 98825592 98918663 99194916 98633430 98174377
1238.3 98174377 98261482 97999252 97925308 97897644 98156456 98167000 97752083 97729858 97762566 97835533 97914742
1248.9 97914742 98181320 98258224 98399696 99080414 99453201 99412781 99330811 99487366 99329201 99184410
1258.5 99184410 99552422 99800507 99830795 99745888 100178429 100489899 100504257 100882103 100874565 100602295 100521072
1269.2 100521072 100816589 101058182 101088341 101011513 100495216 100292984 100714180 101291893 101195381 100796333
1278.8 100796333 101040558 101307159 101644424 101897652 101699547 101716614 102140503 102687149 102963509 102942299
1288.4 102942299 102856194 102829735 103030678 103257538 103149055 102748520 102756516 103153969 103014702 102513680
1298.1 102513680 102335197 102289337 102212036 102221199 102217278 102462578 102903664 103113037 103279861 103451294 103575928
1308.7 103575928 103451271 103129089 103177979 103162804 103135216 103246330 103214928 103439720 103431122 103262512 103329803
1319.3 103329803 103537354 103828529 103771057 103754875 103868164 104125824 104424820 104328766 104375893 104599579
1328.9 104599579 104905067 104973763 104783958 104986839 104963654 104754341 104838005 104803619 104801888 104830765 104586502
1339.6 104586502 104351471 104306648 104180618 104068855 103954712 103657921 103530579 103495605 103536232 103576332
1349.2 103576332 103514915 103793228 103820297 103561150 103769386 104176491 104430809 104514397 104599617 104385635
1358.8 104385635 104052101 104191963 104427986 104645691 104216087 103372353 102991417 102636993 101968025 101438820
1368.5 101438820 101386490 101088661 100742332 100539055 100244255 100415497 100410881 100032265 100049690 100361641
1378.1 100361641 100657707 101031715 101698212 102374084 102870995 102989082 103331917 103809433 104189430 104477104
1387.8 104477104 104039818 104131828 104304306 104222740 104348770 104446129 105009575 105007797 104574486 104707962
1397.4 104707962 104800026 104567657 104573257 104952095 105394249 105778038 106035469 106071320 105948074 106081879
1407.1 106081879 106165466 105879662 105839325 105901573 105626862 105434341 105495514 105212990 104787941 104719467
1416.7 104719467 104528572 104585869 105135780 104738075 104502075 104565552 104833206 104784172 104467812 104660461
1426.3 104660461 104949883 104952583 104819435 103992310 103710861 104076561 103907112 103506477 103431061 103767227
1436 103767227 103776764 102743370 102056908 101701805 101732788 101543976 101265099 101020485 100806389 100607796
1445.6 100607796 100664925 101097717 100641182 100234718 99983353 99634911 99198776 98634247 98441994 97699875
1455.3 97699875 97414482 97586334 96331833 96406181 96558479 96521378 95720833 95574913 95841446 95715096
1464.9 95715096 95667343 95374458 95916718 96626030 98416405 100399506 102038765 104205086 104975761
1473.6 104975761 105519775 105638298 106329742 106777077 106905655 107108177 107442833 107932770 107669868 107913925
1483.2 107913925 108231979 108376732 108766029 109163918 109667908 109877869 110494156 109789246 109212860 109130814
1492.9 109130814 109085770 109600822 110504501 111069878 110407097 110097519 109785583 109558319 109644066 109591805
1502.5 109591805 109731483 109979004 110220116 109900345 111019943 111147865 110268738 110096992 109892921
1511.2 109892921 110136147 110402176 110175941 110310776 110987885 112166306 111077621 110582344 111066124
1519.9 111066124 112428299 112419624 110905556 110760445 110640266 110408432 110236435 110046494 110280312 110452179
1529.5 110452179 110453369 110600510 110857315 110660881 110586662 110703697 111026329 111543839 111460754 110900818
1539.2 110900818 111187683 111944061 112547470 111523483 110747093 110088715 109864288 110006630 110023544 110176842
1548.8 110176842 110628876 110448174 110049110 110428635 110918938 110767357 110896835 111175949 111807571 112576752
1558.5 112576752 109181717 109845749 110621353 110504990 110197296 109799751 109901047 110283829 110053001
1567.1 110053001 109996849 110838303 111510338 110699753 110139412 109941978 110066338 110329384 111179115 111580833
1576.8 111580833 110529106 109944489 109871719 110057274 110127907 110168030 109989662 109934029 110098625 110101540
1586.4 110101540 110245224 110254295 110174927 110191231 110179115 110176514 109980576 110026207 110265495 110296951 110170853
1597 110170853 110091675 110104324 109914330 109883446 110083336 110234612 110128738 110041489 110304390 110476898 110316330
1607.6 110316330 110223106 110497849 110391846 110104561 109828773 109554878 109837440 110047188 110102753 110038910
1617.3 110038910 109671829 109623619 109718575 109729088 109718010 110009239 109982979 109738068 109516121 109649765
1626.9 109649765 110340164 110076591 109761688 109562363 109458366 109465607 109556923 109968193 110179588 110532776
1636.6 110532776 110413803 110001839 109708969 109301659 109135216 109019859 109158150 109196732 109305847 109958672
1646.2 109958672 110159416 110231117 109297844 108862312 109067551 109823524 113084167 111847931 110161430
1654.9 110161430 109040817 108588860 108584930 108751640 108967659 109098053 109151077 109132484 109063507 108835510
1664.5 108835510 108618690 108606728 108868820 109155113 109037514 109073357 109327538 109155701 109075043 109662102
1674.2 109662102 110050835 108951195 108516991 108476105 108843063 109262627 109355141 109015343 108914772 108845436
1683.8 108845436 108308975 108395782 108001709 107960976 107917648 108047707 107932419 107268700 107134293 107026192
1693.5 107026192 107086411 107452255 107049385 106632172 106213829 105852127 104984428 104789749 104939293 104832428
1703.1 104832428 104380554 103962532 103667717 102707237 101913872 101520332 101165329 100361137 99728561 99496239
1712.8 99496239 99416298 99266235 98335709 97669426 97411598 97004196 96244942 95661385 95187614 94788673
1722.4 94788673 94421295 93792549 93098549 92274658 91480103 90642014 89650719 88227188 86294838
1731.1 86294838 84996742 84095238 83076775 78789970 76157898 74179016 72695671 71779510 71772217
1739.8 71772217 71402466 70732613 71401436 72736511 74502327 75575325 77334351 79348282 81526962
1748.4 81526962 84278358 85444077 88103165 90295097 91879692 93680603 95205666 96872475
1756.2 96872475 98637306 99980431 100879959 101918205 102823257 104221848 104761665 104736870 105248657
1764.8 105248657 105735580 106178856 106290398 106534134 106971588 107273361 108004234 108409546 107989723 107752747
1774.5 107752747 107870415 107986206 108039558 108138611 108276573 108522415 108240295 108106255 108391891 108579666
1784.1 108579666 108550507 108647751 108731522 108667542 108781387 108959549 109086540 108938797 109048737 109116249
1793.8 109116249 108900452 109117355 109255058 109254196 109320549 109224533 109123734 109067528 109299484 109335655 109299889
1804.4 109299889 109484711 109449097 109377556 109430687 109516960 109689400 109727158 109476143 109309486 109349548 109462433
1815 109462433 109476738 109387840 109480583 109566299 109460991 109443695 109535576 109532394 109588097 109954094 109848785
1825.6 109848785 109258736 109402412 109927750 110095070 109844688 109751160 109719841 109572052 109516663 109682098
1835.2 109682098 109647705 109526291 109657166 109788834 109635857 109327881 109354286 109576134 110002701 110396439
1844.9 110396439 110061729 109949242 109943092 109757912 109599304 109680481 109972954 109970421 109831589 109870926 109727325
1855.5 109727325 109546486 109596550 109663979 109727821 109769501 109803925 109853821 109761795 109658707 109709930 109950668
1866.1 109950668 110105949 110003304 109979355 109859238 109705772 109489891 109365219 109558693 109622208 109592903
1875.7 109592903 109641861 109628128 109526237 109437141 109558304 109684822 109701309 109553490 109393883 109483276
1885.4 109483276 109476768 109410172 109408142 109528595 109756134 109621643 109568771 109654495 109596252 109709534 109771111
1896 109771111 109683701 109707733 109497139 109269478 109241417 109245461 109467522 109648933 109715805 109739006 109627686
1906.6 109627686 109664474 109743484 109782265 109812340 109663452 109582039 109602592 109635475 109777145 109836395 109795326
1917.2 109795326 109787697 109676552 109768486 110006638 110096291 110023003 109700714 109423561 109313133 109388710 109522629
1927.8 109522629 109711342 109841209 109564362 109352646 109417648 109667778 109767700 109458847 109478195 109704094
1937.5 109704094 109728676 109627014 109499084 109514442 109538788 109553604 109505829 109611816 109779930 109653442
1947.1 109653442 109514412 109482986 109449020 109360489 109460312 109610077 109622276 109589256 109386108 109383163 109583145
1957.7 109583145 109631470 109548363 109400520 109408043 109552345 109462967 109369789 109617294 109778732 109780235 109608650
1968.3 109608650 109325363 109317810 109364952 109460518 109622528 109588364 109530388 109542679 109550499 109552551 109412735
1978.9 109412735 109275856 109401176 109407990 109451744 109608154 109455063 109335533 109390633 109568588 109638153
1988.6 109638153 109444122 109348907 109468231 109613327 109466858 109384949 109350838 109287933 109383606 109414711 109489990
1999.2 109489990 109568733 109474754 109418472 109469780 109438400 109362030 109430122 109473900 109320625 109205780 109338280
2009.8 109338280 109423485 109519775 109592735 109531242 109581261 109440056 109343491 109448006 109520058 109572868 109451965
2020.4 109451965 109406387 109289078 109179565 109362442 109517281 109512146 109511124 109530624 109426857 109434418 109349174
2031 109349174 109216766 109278694 109199387 109137192 109063736 109107719 109378319 109503403 109506134 109564972 109553230
2041.6 109553230 109330711 109306641 109302582 109297943 109487198 109448395 109452675 109535950 109510208 109472870 109436134 109422791
2053.2 109422791 109340210 109297997 109258644 109262733 109291885 109311760 109427612 109427406 109424545 109451668 109453522 109442299
2064.7 109442299 109267181 109226814 109368568 109395004 109389076 109384033 109185768 109068504 109189117 109214035 109249687
2075.4 109249687 109253952 109128189 109251038 109503990 109622421 109645287 109562836 109429916 109276108 109047867
2085 109047867 109002151 109284012 109284821 109227119 109512985 109488846 109390678 109396988 109275948 109238434 109339455 109513863
2096.6 109513863 109310211 109127548 109296761 109271164 109336143 109524925 109515617 109469536 109531700 109500404 109328094
2107.2 109328094 109256836 109212776 109190796 109265320 109454735 109626358 109657722 109489975 109228622 109195976 109193504
2117.8 109193504 109351830 109609947 109492226 109324348 109387619 109600227 109672112 109543083 109445641 109376251
2127.4 109376251 109248856 109255989 109460983 109434952 109297714 109272774 109277496 109208405 109022469 109074631 109252022
2138 109252022 109392273 109540833 109529297 109571907 109692429 109540985 109340233 109213631 109111946 109480011
2147.7 109480011 109736038 109506851 109368004 109229652 109248672 109255287 109076927 109208504 109634712 109853363
2157.3 109853363 109573174 109328789 109387299 109566299 109621216 109402557 109287483 109387436 109546188 109443474
2167 109443474 109242996 109234749 109214981 109352180 109447083 109475166 109548988 109288078 109111313 109182571 109139053
2177.6 109139053 109148499 109273766 109329926 109314049 109345757 109274406 109183884 109311066 109418015 109322807 109071983
2188.2 109071983 109097580 109318047 109287758 109339607 109326759 109285118 109471405 109396446 109271843 109412170 109443642
2198.8 109443642 109318764 109293571 109327179 109381546 109342110 109261276 109435677 109422546 109206573 109259407 109389931
2209.4 109389931 109322693 109174423 109209938 109274223 109338074 109346634 109288475 109460335 109626732 109563850 109336082
2220 109336082 109169090 109198708 109178215 108993065 109050781 109424225 109558807 109552399 109549530 109469406 109423050
2230.6 109423050 109358749 109203117 109141518 109396980 109384026 109159584 109267975 109422089 109486893 109469955
2240.3 109469955 109391983 109119606 108976570 109228149 109414345 109339638 109095146 109151894 109370323 109355148
2249.9 109355148 109238472 109098511 109113846 109214767 109235695 109176453 109264023 109270935 109149147 109339508 109341103
2260.5 109341103 109141678 109231384 109493393 109501503 109276398 109323013 109417793 109380501 109260185 109238335 109428734
2271.1 109428734 109498878 109451546 109282784 109282921 109487625 109457031 109329376 109249962 109317932 109329376 109105293
2281.7 109105293 109059578 109153267 109234756 109245209 109078033 109040215 109071625 109057762 109093262 109134270 109293633
2292.3 109293633 109293877 109084877 109009872 109062881 109111115 108989014 108883629 108997734 109111687 108959595 108817902
2302.9 108817902 108932640 109136497 109315674 109074921 108712051 108718590 108780243 108815834 108877937 108843910 108633308
2313.5 108633308 108713211 108941742 108754402 108546684 108693436 108987907 108847572 108710190 108835793 108644165
2323.2 108644165 108741020 109062126 109058022 109070541 108840958 108049454 107790756 108325668 108356926 107935158
2332.8 107935158 107706131 108011620 108372032 107954582 107899788 108483589 108169388 107868095 108330551 108193947
2342.5 108193947 108050575 108432678 108744026 108723305 108508400 108348259 108255035 108415260 108453003 108165573
2352.1 108165573 108173897 108171593 108160835 108106621 108106903 108270538 107690536 107188477 107831879 108277847 108028160
2362.7 108028160 108132843 108454895 108559395 108346603 108233002 108188141 108060043 108190559 108252853 108415878
2372.4 108415878 108888252 109063690 108853447 109013771 109280724 109242393 109207634 108889587 108769150 108852768
2382 108852768 108742836 108940453 109154991 109358559 109521950 109404198 109356064 109256950 109203461 109237022 109130188
2392.6 109130188 109067368 109088448 109111092 109166573 109213684 109288338 109483490 109416512 109140778 109124458 109183334
2403.2 109183334 109144173 109136360 109206284 109151833 109058388 109086823 109145905 109284981 109275047 109170044 109210060
2413.8 109210060 109306442 109426834 109338852 109102356 109043137 109116402 109179237 109198929 109122635 108992744 109056244
2424.5 109056244 109202019 109159477 109012917 109052711 109195847 109147659 109236046 109341461 109215096 109135986
2434.1 109135986 109058891 109172722 109331993 109265617 109134628 109086304 109249596 109318977 109307816 109150246
2443.7 109150246 108944084 109060966 109168091 109292816 109297127 109238068 109341743 109361359 109386902 109308228 109196014
2454.3 109196014 109146248 109246284 109264893 109081482 109217888 109193733 109094818 109130692 109022156 109183006
2464 109183006 109280983 109222763 109295479 109312103 109243706 109193672 109242851 109196526 109018616 108947342 108991295 109037842
2475.6 109037842 109152054 109136238 108959038 108987755 109087914 109062744 108999733 109150276 109289413 109189484
2485.2 109189484 109244270 109302078 109265465 109320015 109364113 109270760 109207230 109251801 109008087 108806366 108980415
2495.8 108980415 109087166 109009972 108956055 109096176 109270370 109193726 108975311 108957039 109093231 109077682
2505.5 109077682 109044617 108997955 108912453 109219460 109486191 109264503 109163315 109094627 108825592 108728027
2515.1 108728027 108845505 108972542 109010384 109119537 109284210 109221092 108946350 108884148 108984116 109019638
2524.7 109019638 109165291 109182404 109114830 109040413 108878670 108909401 109054749 109095245 108972359 109080475
2534.4 109080475 109277206 109104805 108988739 109044792 109062515 108905800 108846336 109095291 109099960 108852509
2544 108852509 108859520 109026016 109103264 109116905 108906960 108757172 108964104 109109810 109067703 108990074 109010857
2554.6 109010857 109051804 109037193 109019524 108956833 108908417 108923645 109030403 109058220 108899658 108749443 108844345
2565.2 108844345 108930962 108786606 108872849 109030266 108868576 108724205 108832878 108853325 108832237 108942314
2574.9 108942314 108791328 108616493 108653152 108884270 109082687 108968956 108971794 108997902 108923149 108872017 108840454
2585.5 108840454 108835335 108793060 108758308 108666298 108703270 108844582 109015938 109048889 108869987 108866608 108811043
2596.1 108811043 108746521 108758423 108824326 108862015 108690331 108904900 109104820 108875603 108864288 108918755 108788918
2606.7 108788918 108647339 108515961 108562401 108795219 108859489 108774559 108763191 108856056 108802391 108709869 108775162
2617.3 108775162 108739326 108848755 108859428 108679565 108789200 108869171 108746742 108536827 108464653 108487602
2627 108487602 108535995 108587273 108495186 108618996 108775719 108788841 108766708 108702278 108733337 108659851 108576553
2637.6 108576553 108567169 108525780 108580841 108604187 108446983 108405151 108561508 108507034 108302826 108377609 108793228
2648.2 108793228 108871124 108384064 108219879 108460899 108494888 108350525 108378929 108614403 108703651 108525337
2657.8 108525337 108583595 108670555 108416954 108478935 108542183 108418762 108572609 108636009 108666679 108701019 108603745
2668.4 108603745 108515808 108518440 108492386 108305740 108359535 108530678 108496277 108398125 108348251 108327049 108202972
2679 108202972 108271561 108526360 108660988 108665932 108499130 108346405 108243546 108250191 108463387 108492096 108534950
2689.6 108534950 108816635 108780136 108531433 108438156 108481125 108614128 108704704 108751419 108546608 108318596
2699.3 108318596 108488739 108683739 108645340 108449554 108453743 108584221 108507858 108450974 108392761 108553352 108772758
2709.9 108772758 108532288 108336845 108430054 108552925 108519279 108454231 108538803 108464584 108356888 108377464 108347839
2720.5 108347839 108332932 108387863 108450760 108435936 108495857 108546906 108343559 108157730 108190315 108354134 108464134
2731.1 108464134 108470314 108472107 108406563 108304550 108280624 108261246 108260803 108349152 108302940 108159393 108252472 108537880
2742.7 108537880 108731316 108749321 108700745 108588402 108451683 108357735 108432648 108620674 108574554 108354019
2752.3 108354019 108172195 108208458 108369080 108378212 108255417 108242241 108522743 108557213 108382935 108382858 108305176
2762.9 108305176 108428772 108615112 108499825 108275574 108073250 108117935 108317955 108293839 108203682 108367798
2772.6 108367798 108468277 108470749 108498192 108305290 108170471 108137718 108069214 108151978 108141708 107936790 107946419
2783.2 107946419 108075279 108078590 108097412 107973289 107896713 107924095 107669823 107525520 107699791 107920029
2792.8 107920029 107902557 107735840 107743507 107618301 107518593 107729202 107770828 107574036 107433952 107492210 107605461
2803.4 107605461 107396706 107057053 107032646 107123146 107103157 107009148 106684319 106395142 106364731 106192230
2813.1 106192230 106061699 106153992 106095886 105929855 105826912 105784424 105628883 105327446 105089783 105025032
2822.7 105025032 104991829 104660431 104264488 103918114 103570091 103471710 103315613 102947037 102515221 102161949
2832.4 102161949 101848305 101293312 100717537 100200806 99674789 98999023 98153175 97496216 96674232 95519196
2842 95519196 94115578 92333084 90618607 88878998 86724678 84483696 82389374 80235863 78088760
2850.7 78088760 76264648 74803314 73673523 73021782 73252747 73790405 74180840 75178490 76722832
2859.4 76722832 78371422 79939636 81485725 83209259 84779732 85975082 86786865 87446808 88129303
2868.1 88129303 88410843 88468163 88709785 89140266 89625252 90055962 90717590 91433884 91927101 92329437
2877.7 92329437 92691147 93062325 93399330 93620026 93531921 93296844 93093277 92748215 92466400 92307770
2887.3 92307770 91983955 91474274 90971733 90562256 90275711 89852074 89185059 88506218 87785683 87327576
2897 87327576 86871086 85959053 85135147 84465492 83705360 82944061 82302490 81639809 80926102 80231789
2906.6 80231789 79299431 78236893 77112801 76045334 74958946 73665131 72350502 70921875 69489113
2915.3 69489113 67862923 66316399 65022911 63437557 62032421 60816433 59796387 58888187 58124485
2924 58124485 57872036 57629356 57757973 58045158 58211346 58684635 59293850 60115322 61050812 62181808
2933.6 62181808 63514874 64906693 66452759 68002632 69349579 70538734 71959938 73542618
2941.3 73542618 74889107 76014412 77161667 78280891 79116875 79793869 80383636 80815216 81108566
2950 81108566 81253593 81212334 81027527 81000404 81001541 80839310 80946785 81405090 81849701 82289658 82870125
2960.6 82870125 83495354 84347473 85351974 86156265 87193970 88509460 89693390 90803795 91777687
2969.3 91777687 92605583 93230309 93842834 94584251 95116486 95496834 95992569 96589340 96941689 97204247
2979 97204247 97656067 98062088 98342453 98522842 98756790 99110069 99579514 100018677 100344666 100592773
2988.6 100592773 100778389 101032692 100972443 100839523 101026421 101195351 101222252 101128998 101037895 100742325
2998.2 100742325 100423882 100074738 99529663 99233650 98823120 98280006 97836670 97457634 97246574 97016640
3007.9 97016640 96798836 96692009 97144905 97808990 98054108 98403275 99067177 99948593 100721321 101363029
3017.5 101363029 102108536 102803337 103299644 103668388 104327080 105033394 105409340 105666649 105856392 106011238
3027.2 106011238 106150597 106333778 106625626 106987320 107233696 107148834 106984215 106960121 107166626 107594994
3036.8 107594994 107828049 107785667 107761734 107861839 107837723 107698906 107825417 107893143 107895454 107983475 107821373
3047.4 107821373 107730064 107904495 108150993 108238441 108256401 108449394 108487801 108386047 108356354 108360626 108315590
3058 108315590 108293549 108382851 108419518 108373375 108205467 108083748 108205780 108358643 108359978 108423149 108577293
3068.6 108577293 108527290 108419525 108375122 108525970 108609810 108407516 108412865 108462929 108480034 108518700 108480156
3079.2 108480156 108470177 108601471 108880432 108978745 109134995 109263664 109134438 108912865 108619835 108609795
3088.9 108609795 108702148 108800514 108864571 108794296 108850334 108873596 108911865 108962891 109012657 108998589 109060066
3099.5 109060066 109333481 109161720 108918678 109043869 109216171 109231384 108915771 108731812 108897331 109028976
3109.1 109028976 108984482 108934929 109001045 109122086 109239594 109271362 109288086 109362297 109383080 109338715 109285568
3119.8 109285568 109128784 109110397 109256943 109137184 109025673 108987633 108982574 109049652 108989624 109056602 109095978
3130.4 109095978 108951088 108826469 108817123 108990097 109220352 109325394 109022163 108741219 108856934 109096031
3140 109096031 109297066 109140320 108962570 109079620 109120857 109106934 109112518 109106430 109140366 109160355 109074455
3150.6 109074455 108963425 108945160 109092621 109227020 109162743 109128639 109083229 109120056 109254807 109167046 109207588
3161.2 109207588 109330238 109219749 109140060 109029701 108928955 108980278 108878044 108778915 108824486 108799469
3170.9 108799469 108943550 109153290 109263321 109346268 109256622 109250084 109393692 109456703 109333076 108992500
3180.5 108992500 108747665 108814835 108945976 108924408 108891365 108842636 108799637 108904480 109057426 109213470
3190.1 109213470 109218948 109048874 108965210 108988441 108943344 108804466 108647087 108605110 108767250 108855278 108772972
3200.8 108772972 108709015 108758553 108741592 108738556 108960411 108977310 108944412 108936874 108804039 108950279 109091629
3211.4 109091629 109016273 108857460 108899345 109057426 108970558 108917694 108792511 108691727 108792786 108927032
3221 108927032 109057129 108938850 108739281 108709702 108832756 109045914 109064514 108801552 108745720 108833054 108734787
3231.6 108734787 108861252 109016708 109088440 109051842 108624451 108395874 108502998 108657257 108714943 108731781
3241.3 108731781 108902969 108823486 108493141 108440857 108498199 108505920 108799698 108980736 108935516 108890335 108584557
3251.9 108584557 108427048 108542458 108603516 108522842 108451332 108538902 108429184 108306061 108399872 108410973 108328362
3262.5 108328362 108423386 108639763 108614403 108478363 108382462 108400070 108638992 108826248 108693718 108468071
3272.1 108468071 108465721 108326004 108109192 108297661 108542686 108495277 108342644 108247864 108309242 108461014
3281.8 108461014 108398499 108200859 108181221 108279266 108297874 108123085 108044952 108222862 108335144 108437622
3291.4 108437622 108498978 108346931 108201294 108090515 108067749 108121780 108062935 107982773 107992523 108004189 108010353
3302 108010353 108211365 108233452 108198647 108402168 108287613 108210556 108031052 107875198 108158066 107986465
3311.7 107986465 107948364 108203430 108063538 107973122 107898857 107727478 107800644 107943413 107736397 107697227
3321.3 107697227 107766174 107644775 107750778 108008430 108276344 108096924 107827484 107903526 107962181 107989395
3330.9 107989395 107840248 107789268 107787376 107809929 107886887 107806206 107799423 107751633 107834160 107805817 107678925
3341.6 107678925 107806770 107800278 107813766 107845970 107682663 107395103 107424385 107750053 107817963 107783035 107612701
3352.2 107612701 107460991 107523293 107485359 107380081 107402786 107565308 107658272 107507889 107480995 107686821
3361.8 107686821 107499603 107339035 107533127 107609566 107607910 107404755 107236641 107262932 107452965 107727974
3371.4 107727974 107596848 107394226 107573761 107803711 107561371 107171303 106979843 106882767 107007614 107033669
3381.1 107033669 107084473 107384201 107447159 107285233 107271004 107203850 107033051 107115692 107205002 107157204 107072044
3391.7 107072044 107227394 107540764 107260490 106833702 106756378 106800346 106890923 107041542 107140869 107001686
3401.3 107001686 106749634 106670227 106858185 107014023 107177475 107260574 106998978 106872749 106952400 106957558
3411 106957558 106847099 106838959 106945831 106866516 106781891 106914177 107072273 106998962 106918251 106963242 107045753
3421.6 107045753 106991760 106770378 106735573 106672859 106584145 106567566 106539848 106645218 106867592 107141434 107005447
3432.2 107005447 106709793 106737221 106829170 106693008 106438583 106520653 106645828 106679466 106707893 106624725 106711937
3442.8 106711937 106731216 106514420 106378998 106515472 106573425 106451530 106483795 106485344 106519630 106536011 106477142
3453.4 106477142 106402275 106226967 106343941 106409218 106257614 106420372 106403229 106289787 106386375 106404037
3463.1 106404037 106455101 106146698 105832588 106002716 106224709 106461067 106505592 106588623 106636444 106312065
3472.7 106312065 106054375 105950851 106241394 106454620 106350327 106668205 106935524 106744080 106688881 106826439
3482.3 106826439 106727516 106525429 106420670 106358574 106454819 106677727 106399773 105948685 106160019 106421104
3492 106421104 106443733 106428154 106389580 106651711 106674515 106356491 106124596 106238472 106570885 106607681 106705154
3502.6 106705154 106702301 106504417 106476311 106451118 106508430 106592857 106750145 106858429 106820511 106772766 106632408
3513.2 106632408 106662781 106801277 106762978 106728218 106809875 106891144 106764870 106686172 106900414 106984650 106983940
3523.8 106983940 107130669 107214111 107173103 107088440 107173576 107037758 106966904 107120430 106965736 107019722 107115036
3534.4 107115036 107039032 107120522 107187569 107374641 107375771 107230591 107298882 107384407 107526443 107579575 107556984
3545 107556984 107666801 107692169 107553482 107351494 107421371 107830643 107957443 107784599 107729988 107708420 107966614
3555.6 107966614 108244904 108194054 108124733 108098129 108054184 108116669 108298363 108486549 108485909 108431786 109012810
3566.2 109012810 109712952 109254593 108752251 108733513 108651703 108568649 108619980 108760223 108806511 108591339
3575.9 108591339 108447449 108482918 108396233 108414246 108548126 108618385 108956642 109341995 109417580 109450493 109507584
3586.5 109507584 109223572 109127037 109195724 109095146 109034988 109097511 109147141 109243736 109714684 109668617 109175140
3597.1 109175140 109317650 109457512 109349632 109449303 109647285 109499252 109219368 109344734 109546196 109910835
3606.8 109910835 110292915 110249588 110169594 109992264 109956902 109920982 109678925 109596878 109622787 109652473 110102020
3617.4 110102020 110597824 110560043 110695740 110196991 109810089 109819923 109711853 109809929 110158051 110339523
3627 110339523 110448402 110985512 110255486 109992294 110053314 109950775 110377335 110335480 110097054 110274887
3636.6 110274887 110079002 109821487 109825050 109960823 110123077 110414474 110459610 110105492 110236794 110903839
3646.3 110903839 111521950 110780899 110502083 111350670 111157135 110371513 109788536 109674217 109923759 110081337
3655.9 110081337 110173103 109971649 109998978 110088692 109905846 109960045 110125572 110071693 109908630 109888458 110054916
3666.5 110054916 110189224 110468773 110851883 111021118 110960625 110474205 110056000 110270721 112025314 112015083
3676.2 112015083 110943794 110627022 110377975 110208450 110091034 110251381 110422134 110290344 110386101 110557991
3685.8 110557991 110696426 111332924 111639214 110521355 110294281 110376320 110169884 110235214 110226707 110332588
3695.5 110332588 110513672 110127747 109776260 109830109 110086845 110273933 110535042 110656197 110360748 110190575
3705.1 110190575 110226692 110159203 109982056 110146729 110862358 110783051 110415054 110347290 110410469 110402176 110370216
3715.7 110370216 110385933 110468079 110580925 110497414 110414871 110530434 110856651 110680046 110260849 110119301
3725.4 110119301 110168167 110248421 110169357 110181915 110594032 111306343 111874992 111197632 111137291 111294212
3735 111294212 110721214 110757195 110807472 110777672 110879013 111064911 110912994 110566383 110625282 111311066 110986221
3745.6 110986221 111035881 111148026 110700157 110475014 111040825 111022934 111330368 111363724 110848633 110417984
3755.3 110417984 110294418 110291351 110308655 110475174 110811386 110659546 110252975 110002129 110120064 110480576
3764.9 110480576 110696991 110565903 110571991 110770149 110805229 110608803 110647820 110476868 110444405 110508385 110396469
3775.5 110396469 110584518 110473442 110050529 110018486 110242432 110351379 110341385 110423393 110475670 110300255
3785.2 110300255 110337975 110382195 110080132 109997040 110391891 110543465 110441895 110394974 110308334 110285103 110413063
3795.8 110413063 110357712 110278061 110574684 110798759 111277924 112090111 111323097 110738976 110464264 110566597
3805.4 110566597 110880920 110868217 110639046 110460785 110334930 110241287 110211006 110068420 110068634 110531357 111264847
3816 111264847 111308090 110806580 110861168 111319252 110994148 110640572 110681183 110529846 110525803 110628807 110797234
3826.6 110797234 110680046 110439018 110380814 110698921 111079468 110763084 110650375 110823822 110867699 110643806
3836.3 110643806 110878838 111721909 111207672 110992287 110855492 110276085 110121300 110339874 110390572 110294456
3845.9 110294456 110319336 110368591 110438789 110556778 110653603 110956223 111109192 111355980 111931702 111168671
3855.6 111168671 110705063 110437492 110520386 110544815 110366814 110447838 110569397 110343811 110580276 111325966
3865.2 111325966 111030075 110497124 110248375 110401970 111114578 111235954 110870499 110703140 110774155 110514641
3874.8 110514641 110480782 110573792 110479378 110481743 110535149 110833260 110860481 110523094 110433128 110487198 110609482
3885.4 110609482 110636810 110496857 110466682 110289909 110356430 110773056 110539917 110367706 110478310 110562851
3895.1 110562851 110485977 110391045 110520721 110704063 110580612 110312271 110161674 110296082 110627785 110852226
3904.7 110852226 110792297 110913422 110709251 110254494 110067505 110255432 110291977 110272919 110622810 110574532
3914.4 110574532 110370514 110562340 110753860 110596092 110299316 110256020 110125221 110084740 110214401 110400154
3924 110400154 110868950 110836449 110698784 110365395 109964973 110118599 110249504 110416618 110569946 110669540
3933.7 110669540 110563553 110161949 110144516 110388023 110513519 110520790 110597397 110502213 110419327 110712708 110738861
3944.3 110738861 110513237 110161476 110132095 110333443 110240486 110394295 110503136 110145355 109852692 109919464
3953.9 109919464 110169090 110520981 110611137 110482361 110501976 110316948 110271164 110495285 110499985 110427917 110210098
3964.5 110210098 110208206 110402489 110097084 109991707 110288078 110206009 109929489 109768913 109904358 110141029
3974.2 110141029 110285721 110458969 110580017 110475296 110179382 110160942 110216583 110210648 110161072 109989021
3983.8 109989021 110099205 110051254 110146667 110484474 110465256 110417259 110267914 110249336 110404633 110485031 110389961
3994.4 110389961 110211082 110104065 109931526 110156174 110287659 110197601
4000.2 110197601
##END=$$ End of the data block
